Build failed in Jenkins: Maven TLP » maven-doap-plugin » master #6

classic Classic list List threaded Threaded
4 messages Options
Reply | Threaded
Open this post in threaded view
|

Build failed in Jenkins: Maven TLP » maven-doap-plugin » master #6

Apache Jenkins Server-2
See https://builds.apache.org/job/maven-box/job/maven-doap-plugin/job/master/6/

Changes:

* [MNGSITE-332] - Changed download templates of plugins not to reference
* [MNGSITE-332] - Changed download templates of plugins not to reference
* [MNGSITE-332] - Changed download templates of plugins not to reference
* [MNGSITE-332] - Changed download templates of plugins not to reference
* [MNGSITE-332] - Changed download templates of plugins not to reference
* [MNGSITE-332] - Changed download templates of plugins not to reference
* [MNGSITE-332] - Changed download templates of plugins not to reference

All tests passed

Build log:
[...truncated 70.23 KB...]
[windows-jdk8] [INFO] Downloading: https://repo.maven.apache.org/maven2/antlr/antlr/2.7.7/antlr-2.7.7.pom
[windows-jdk8] [INFO] Downloaded: https://repo.maven.apache.org/maven2/antlr/antlr/2.7.7/antlr-2.7.7.pom (632 B at 53 kB/s)
[windows-jdk8] [INFO] Downloading: https://repo.maven.apache.org/maven2/org/antlr/antlr4-runtime/4.5.3/antlr4-runtime-4.5.3.pom
[windows-jdk8] [INFO] Downloaded: https://repo.maven.apache.org/maven2/org/antlr/antlr4-runtime/4.5.3/antlr4-runtime-4.5.3.pom (2.3 kB at 289 kB/s)
[windows-jdk8] [INFO] Downloading: https://repo.maven.apache.org/maven2/org/antlr/antlr4-master/4.5.3/antlr4-master-4.5.3.pom
[windows-jdk8] [INFO] Downloaded: https://repo.maven.apache.org/maven2/org/antlr/antlr4-master/4.5.3/antlr4-master-4.5.3.pom (3.7 kB at 368 kB/s)
[windows-jdk8] [INFO] Downloading: https://repo.maven.apache.org/maven2/commons-beanutils/commons-beanutils/1.9.2/commons-beanutils-1.9.2.pom
[windows-jdk8] [INFO] Downloaded: https://repo.maven.apache.org/maven2/commons-beanutils/commons-beanutils/1.9.2/commons-beanutils-1.9.2.pom (14 kB at 1.6 MB/s)
[windows-jdk8] [INFO] Downloading: https://repo.maven.apache.org/maven2/org/apache/commons/commons-parent/33/commons-parent-33.pom
[windows-jdk8] [INFO] Downloaded: https://repo.maven.apache.org/maven2/org/apache/commons/commons-parent/33/commons-parent-33.pom (53 kB at 3.8 MB/s)
[windows-jdk8] [INFO] Downloading: https://repo.maven.apache.org/maven2/commons-cli/commons-cli/1.3.1/commons-cli-1.3.1.pom
[windows-jdk8] [INFO] Downloaded: https://repo.maven.apache.org/maven2/commons-cli/commons-cli/1.3.1/commons-cli-1.3.1.pom (10 kB at 1.2 MB/s)
[windows-jdk8] [INFO] Downloading: https://repo.maven.apache.org/maven2/com/google/guava/guava/19.0/guava-19.0.pom
[windows-jdk8] [INFO] Downloaded: https://repo.maven.apache.org/maven2/com/google/guava/guava/19.0/guava-19.0.pom (6.8 kB at 755 kB/s)
[windows-jdk8] [INFO] Downloading: https://repo.maven.apache.org/maven2/com/google/guava/guava-parent/19.0/guava-parent-19.0.pom
[windows-jdk8] [INFO] Downloaded: https://repo.maven.apache.org/maven2/com/google/guava/guava-parent/19.0/guava-parent-19.0.pom (9.9 kB at 1.1 MB/s)
[windows-jdk8] [INFO] Downloading: https://repo.maven.apache.org/maven2/org/sonatype/oss/oss-parent/7/oss-parent-7.pom
[windows-jdk8] [INFO] Downloaded: https://repo.maven.apache.org/maven2/org/sonatype/oss/oss-parent/7/oss-parent-7.pom (4.8 kB at 402 kB/s)
[windows-jdk8] [INFO] Downloading: https://repo.maven.apache.org/maven2/org/apache/maven/shared/maven-shared-resources/2/maven-shared-resources-2.jar
[windows-jdk8] [INFO] Downloading: https://repo.maven.apache.org/maven2/commons-io/commons-io/1.4/commons-io-1.4.jar
[windows-jdk8] [INFO] Downloading: https://repo.maven.apache.org/maven2/org/apache/maven/doxia/doxia-integration-tools/1.6/doxia-integration-tools-1.6.jar
[windows-jdk8] [INFO] Downloading: https://repo.maven.apache.org/maven2/commons-digester/commons-digester/1.6/commons-digester-1.6.jar
[windows-jdk8] [INFO] Downloading: https://repo.maven.apache.org/maven2/org/apache/maven/doxia/doxia-core/1.2/doxia-core-1.2.jar
[windows-jdk8] [INFO] Downloaded: https://repo.maven.apache.org/maven2/commons-io/commons-io/1.4/commons-io-1.4.jar (109 kB at 2.7 MB/s)
[windows-jdk8] [INFO] Downloading: https://repo.maven.apache.org/maven2/org/codehaus/plexus/plexus-resources/1.1.0/plexus-resources-1.1.0.jar
[windows-jdk8] [INFO] Downloaded: https://repo.maven.apache.org/maven2/org/codehaus/plexus/plexus-resources/1.1.0/plexus-resources-1.1.0.jar (23 kB at 380 kB/s)
[windows-jdk8] [INFO] Downloading: https://repo.maven.apache.org/maven2/com/puppycrawl/tools/checkstyle/6.18/checkstyle-6.18.jar
[linux-jdk8] + mvn -P+run-its -Dmaven.test.failure.ignore=true -Dfindbugs.failOnError=false -Dfindbugs.skip=true clean verify
[linux-jdk8] ----- withMaven Wrapper script -----
[linux-jdk8] Picked up JAVA_TOOL_OPTIONS: -Dmaven.ext.class.path="/home/jenkins/jenkins-slave/workspace/ox_maven-doap-plugin_master-K56SP7WQZT7DLJESN4Z67EH56OK5QEQZKI2M7VJKWLIVTWMNHWNA@tmp/withMaven80925a74/pipeline-maven-spy.jar" -Dorg.jenkinsci.plugins.pipeline.maven.reportsFolder="/home/jenkins/jenkins-slave/workspace/ox_maven-doap-plugin_master-K56SP7WQZT7DLJESN4Z67EH56OK5QEQZKI2M7VJKWLIVTWMNHWNA@tmp/withMaven80925a74"
[linux-jdk8] Apache Maven 3.5.2 (138edd61fd100ec658bfa2d307c43b76940a5d7d; 2017-10-18T07:58:13Z)
[linux-jdk8] Maven home: /home/jenkins/tools/maven/apache-maven-3.5.2
[linux-jdk8] Java version: 1.8.0_152, vendor: Oracle Corporation
[linux-jdk8] Java home: /usr/local/asfpackages/java/jdk1.8.0_152/jre
[linux-jdk8] Default locale: en_US, platform encoding: ISO-8859-1
[linux-jdk8] OS name: "linux", version: "4.4.0-45-generic", arch: "amd64", family: "unix"
[linux-jdk8] [INFO] [jenkins-event-spy] Generate /home/jenkins/jenkins-slave/workspace/ox_maven-doap-plugin_master-K56SP7WQZT7DLJESN4Z67EH56OK5QEQZKI2M7VJKWLIVTWMNHWNA@tmp/withMaven80925a74/maven-spy-20180414-191445-8706119913114062900368.log.tmp ...
[windows-jdk10] Checking out Revision 3b7056f2b8f17878de451f3b8385c28a2b604b3a (master)
[windows-jdk10]  > git config core.sparsecheckout # timeout=10
[windows-jdk10]  > git checkout -f 3b7056f2b8f17878de451f3b8385c28a2b604b3a
[windows-jdk10] Commit message: "[MNGSITE-332] - Changed download templates of plugins not to reference .md5 anymore"
[windows-jdk10] Cleaning workspace
[windows-jdk10]  > git rev-parse --verify HEAD # timeout=10
[windows-jdk10] Resetting working tree
[windows-jdk10]  > git reset --hard # timeout=10
[windows-jdk10]  > git clean -fdx # timeout=10
[windows-jdk8] [INFO] Downloaded: https://repo.maven.apache.org/maven2/com/puppycrawl/tools/checkstyle/6.18/checkstyle-6.18.jar (1.2 MB at 6.3 MB/s)
[windows-jdk8] [INFO] Downloading: https://repo.maven.apache.org/maven2/antlr/antlr/2.7.7/antlr-2.7.7.jar
[windows-jdk8] [INFO] Downloaded: https://repo.maven.apache.org/maven2/org/apache/maven/doxia/doxia-core/1.2/doxia-core-1.2.jar (154 kB at 824 kB/s)
[windows-jdk8] [INFO] Downloading: https://repo.maven.apache.org/maven2/org/antlr/antlr4-runtime/4.5.3/antlr4-runtime-4.5.3.jar
[windows-jdk8] [INFO] Downloaded: https://repo.maven.apache.org/maven2/org/apache/maven/shared/maven-shared-resources/2/maven-shared-resources-2.jar (13 kB at 65 kB/s)
[windows-jdk8] [INFO] Downloading: https://repo.maven.apache.org/maven2/commons-beanutils/commons-beanutils/1.9.2/commons-beanutils-1.9.2.jar
[windows-jdk8] [INFO] Downloaded: https://repo.maven.apache.org/maven2/commons-digester/commons-digester/1.6/commons-digester-1.6.jar (168 kB at 818 kB/s)
[windows-jdk8] [INFO] Downloading: https://repo.maven.apache.org/maven2/commons-cli/commons-cli/1.3.1/commons-cli-1.3.1.jar
[windows-jdk8] [INFO] Downloaded: https://repo.maven.apache.org/maven2/org/antlr/antlr4-runtime/4.5.3/antlr4-runtime-4.5.3.jar (302 kB at 1.4 MB/s)
[windows-jdk8] [INFO] Downloading: https://repo.maven.apache.org/maven2/com/google/guava/guava/19.0/guava-19.0.jar
[windows-jdk8] [INFO] Downloaded: https://repo.maven.apache.org/maven2/org/apache/maven/doxia/doxia-integration-tools/1.6/doxia-integration-tools-1.6.jar (45 kB at 207 kB/s)
[windows-jdk8] [INFO] Downloading: https://repo.maven.apache.org/maven2/commons-lang/commons-lang/2.1/commons-lang-2.1.jar
[windows-jdk8] [INFO] Downloaded: https://repo.maven.apache.org/maven2/commons-cli/commons-cli/1.3.1/commons-cli-1.3.1.jar (53 kB at 241 kB/s)
[windows-jdk8] [INFO] Downloaded: https://repo.maven.apache.org/maven2/antlr/antlr/2.7.7/antlr-2.7.7.jar (445 kB at 2.0 MB/s)
[windows-jdk8] [INFO] Downloaded: https://repo.maven.apache.org/maven2/commons-lang/commons-lang/2.1/commons-lang-2.1.jar (208 kB at 834 kB/s)
[windows-jdk8] [INFO] Downloaded: https://repo.maven.apache.org/maven2/commons-beanutils/commons-beanutils/1.9.2/commons-beanutils-1.9.2.jar (234 kB at 903 kB/s)
[windows-jdk8] [INFO] Downloaded: https://repo.maven.apache.org/maven2/com/google/guava/guava/19.0/guava-19.0.jar (2.3 MB at 6.4 MB/s)
[linux-jdk8] [INFO] Scanning for projects...
[linux-jdk8] [INFO]
[linux-jdk8] [INFO] ------------------------------------------------------------------------
[linux-jdk8] [INFO] Building Apache Maven DOAP Plugin 1.3-SNAPSHOT
[linux-jdk8] [INFO] ------------------------------------------------------------------------
[linux-jdk8] [INFO]
[linux-jdk8] [INFO] --- maven-clean-plugin:3.0.0:clean (default-clean) @ maven-doap-plugin ---
[linux-jdk8] [INFO]
[linux-jdk8] [INFO] --- maven-enforcer-plugin:1.4.1:enforce (enforce-maven-version) @ maven-doap-plugin ---
[linux-jdk8] [INFO]
[linux-jdk8] [INFO] --- maven-enforcer-plugin:1.4.1:enforce (enforce-bytecode-version) @ maven-doap-plugin ---
[linux-jdk8] [INFO]
[linux-jdk8] [INFO] --- maven-enforcer-plugin:1.4.1:enforce (ban-known-bad-maven-versions) @ maven-doap-plugin ---
[linux-jdk8] [INFO]
[linux-jdk8] [INFO] --- maven-enforcer-plugin:1.4.1:enforce (ensure-no-container-api) @ maven-doap-plugin ---
[linux-jdk8] [INFO]
[linux-jdk8] [INFO] --- apache-rat-plugin:0.12:check (rat-check) @ maven-doap-plugin ---
[linux-jdk8] [INFO] Enabled default license matchers.
[linux-jdk8] [INFO] Will parse SCM ignores for exclusions...
[linux-jdk8] [INFO] Parsing exclusions from /home/jenkins/jenkins-slave/workspace/ox_maven-doap-plugin_master-K56SP7WQZT7DLJESN4Z67EH56OK5QEQZKI2M7VJKWLIVTWMNHWNA/m/.gitignore
[linux-jdk8] [INFO] Finished adding exclusions from SCM ignore files.
[linux-jdk8] [INFO] 71 implicit excludes (use -debug for more details).
[linux-jdk8] [INFO] Exclude: .repository/**
[linux-jdk8] [INFO] Exclude: .maven/spy.log
[linux-jdk8] [INFO] Exclude: dependency-reduced-pom.xml
[linux-jdk8] [INFO] Exclude: .java-version
[linux-jdk8] [INFO] 42 resources included (use -debug for more details)
[windows-jdk8] [INFO] There are 2 errors reported by Checkstyle 6.18 with config/maven_checks.xml ruleset.
[windows-jdk8] [INFO] Ignored 2 errors, 0 violation remaining.
[windows-jdk8] [INFO]
[windows-jdk8] [INFO] --- maven-invoker-plugin:3.0.1:verify (integration-test) @ maven-doap-plugin ---
[windows-jdk8] [INFO] -------------------------------------------------
[windows-jdk8] [INFO] Build Summary:
[windows-jdk8] [INFO]   Passed: 4, Failed: 0, Errors: 0, Skipped: 0
[windows-jdk8] [INFO] -------------------------------------------------
[windows-jdk8] [INFO] ------------------------------------------------------------------------
[windows-jdk8] [INFO] BUILD SUCCESS
[windows-jdk8] [INFO] ------------------------------------------------------------------------
[windows-jdk8] [INFO] Total time: 44.038 s
[windows-jdk8] [INFO] Finished at: 2018-04-14T19:14:48Z
[linux-jdk8] [INFO] Rat check: Summary over all files. Unapproved: 0, unknown: 0, generated: 0, approved: 41 licenses.
[linux-jdk8] [INFO]
[linux-jdk8] [INFO] --- maven-plugin-plugin:3.5.1:helpmojo (generate-helpmojo) @ maven-doap-plugin ---
[linux-jdk8] [INFO] Using 'UTF-8' encoding to read mojo source files.
[windows-jdk8] [INFO] Final Memory: 57M/989M
[windows-jdk8] [INFO] ------------------------------------------------------------------------
[windows-jdk8] [INFO] [jenkins-event-spy] Generated F:\jenkins\jenkins-slave\workspace\ox_maven-doap-plugin_master-K56SP7WQZT7DLJESN4Z67EH56OK5QEQZKI2M7VJKWLIVTWMNHWNA@2@tmp\withMaven8131f82a\maven-spy-20180414-191403-5927270170848132212091.log
[windows-jdk8] Picked up JAVA_TOOL_OPTIONS: -Dmaven.ext.class.path="f:\jenkins\jenkins-slave\workspace\ox_maven-doap-plugin_master-K56SP7WQZT7DLJESN4Z67EH56OK5QEQZKI2M7VJKWLIVTWMNHWNA@2@tmp\withMaven8131f82a\pipeline-maven-spy.jar" -Dorg.jenkinsci.plugins.pipeline.maven.reportsFolder="f:\jenkins\jenkins-slave\workspace\ox_maven-doap-plugin_master-K56SP7WQZT7DLJESN4Z67EH56OK5QEQZKI2M7VJKWLIVTWMNHWNA@2@tmp\withMaven8131f82a"
[linux-jdk8] [INFO] java-javadoc mojo extractor found 0 mojo descriptor.
[linux-jdk10] ERROR: Unable to retrieve commit message
[linux-jdk10] java.lang.InterruptedException
[linux-jdk10] at java.lang.Object.wait(Native Method)
[linux-jdk10] at hudson.remoting.Request.call(Request.java:167)
[linux-jdk10] at hudson.remoting.Channel.call(Channel.java:907)
[linux-jdk10] at hudson.remoting.RemoteInvocationHandler.invoke(RemoteInvocationHandler.java:281)
[linux-jdk10] at com.sun.proxy.$Proxy109.withRepository(Unknown Source)
[linux-jdk10] at org.jenkinsci.plugins.gitclient.RemoteGitImpl.withRepository(RemoteGitImpl.java:235)
[linux-jdk10] at hudson.plugins.git.GitSCM.printCommitMessageToLog(GitSCM.java:1245)
[linux-jdk10] at hudson.plugins.git.GitSCM.checkout(GitSCM.java:1218)
[linux-jdk10] at org.jenkinsci.plugins.workflow.steps.scm.SCMStep.checkout(SCMStep.java:113)
[linux-jdk10] at org.jenkinsci.plugins.workflow.steps.scm.SCMStep$StepExecutionImpl.run(SCMStep.java:85)
[linux-jdk10] at org.jenkinsci.plugins.workflow.steps.scm.SCMStep$StepExecutionImpl.run(SCMStep.java:75)
[linux-jdk10] at org.jenkinsci.plugins.workflow.steps.AbstractSynchronousNonBlockingStepExecution$1$1.call(AbstractSynchronousNonBlockingStepExecution.java:47)
[linux-jdk10] at hudson.security.ACL.impersonate(ACL.java:260)
[linux-jdk10] at org.jenkinsci.plugins.workflow.steps.AbstractSynchronousNonBlockingStepExecution$1.run(AbstractSynchronousNonBlockingStepExecution.java:44)
[linux-jdk10] at java.util.concurrent.Executors$RunnableAdapter.call(Executors.java:511)
[linux-jdk10] at java.util.concurrent.FutureTask.run(FutureTask.java:266)
[linux-jdk10] at java.util.concurrent.ThreadPoolExecutor.runWorker(ThreadPoolExecutor.java:1149)
[linux-jdk10] at java.util.concurrent.ThreadPoolExecutor$Worker.run(ThreadPoolExecutor.java:624)
[linux-jdk10] at java.lang.Thread.run(Thread.java:748)
[linux-jdk10] Cleaning workspace
[linux-jdk9] ERROR: Unable to retrieve commit message
[linux-jdk9] java.lang.InterruptedException
[linux-jdk9] at java.lang.Object.wait(Native Method)
[linux-jdk9] at hudson.remoting.Request.call(Request.java:167)
[linux-jdk9] at hudson.remoting.Channel.call(Channel.java:907)
[linux-jdk9] at hudson.remoting.RemoteInvocationHandler.invoke(RemoteInvocationHandler.java:281)
[linux-jdk9] at com.sun.proxy.$Proxy109.withRepository(Unknown Source)
[linux-jdk9] at org.jenkinsci.plugins.gitclient.RemoteGitImpl.withRepository(RemoteGitImpl.java:235)
[linux-jdk9] at hudson.plugins.git.GitSCM.printCommitMessageToLog(GitSCM.java:1245)
[linux-jdk9] at hudson.plugins.git.GitSCM.checkout(GitSCM.java:1218)
[linux-jdk9] at org.jenkinsci.plugins.workflow.steps.scm.SCMStep.checkout(SCMStep.java:113)
[linux-jdk9] at org.jenkinsci.plugins.workflow.steps.scm.SCMStep$StepExecutionImpl.run(SCMStep.java:85)
[linux-jdk9] at org.jenkinsci.plugins.workflow.steps.scm.SCMStep$StepExecutionImpl.run(SCMStep.java:75)
[linux-jdk9] at org.jenkinsci.plugins.workflow.steps.AbstractSynchronousNonBlockingStepExecution$1$1.call(AbstractSynchronousNonBlockingStepExecution.java:47)
[linux-jdk9] at hudson.security.ACL.impersonate(ACL.java:260)
[linux-jdk9] at org.jenkinsci.plugins.workflow.steps.AbstractSynchronousNonBlockingStepExecution$1.run(AbstractSynchronousNonBlockingStepExecution.java:44)
[linux-jdk9] at java.util.concurrent.Executors$RunnableAdapter.call(Executors.java:511)
[linux-jdk9] at java.util.concurrent.FutureTask.run(FutureTask.java:266)
[linux-jdk9] at java.util.concurrent.ThreadPoolExecutor.runWorker(ThreadPoolExecutor.java:1149)
[linux-jdk9] at java.util.concurrent.ThreadPoolExecutor$Worker.run(ThreadPoolExecutor.java:624)
[linux-jdk9] at java.lang.Thread.run(Thread.java:748)
[linux-jdk9] Cleaning workspace
[windows-jdk8] Sending interrupt signal to process
[Pipeline] [linux-jdk7] // node
[linux-jdk10]  > git rev-parse --verify HEAD # timeout=10
[linux-jdk9]  > git rev-parse --verify HEAD # timeout=10
[Pipeline] [windows-jdk9] // node
[linux-jdk10] Resetting working tree
[linux-jdk10]  > git reset --hard # timeout=10
[linux-jdk9] Resetting working tree
[linux-jdk9]  > git reset --hard # timeout=10
[Pipeline] [linux-jdk7] }
[Pipeline] [windows-jdk9] }
[Pipeline] [windows-jdk8] }
[Pipeline] [linux-jdk8] }
[Pipeline] [windows-jdk10] }
[linux-jdk10]  > git clean -fdx # timeout=10
[linux-jdk9]  > git clean -fdx # timeout=10
[Pipeline] [windows-jdk8] // dir
[Pipeline] [linux-jdk8] // dir
[Pipeline] [windows-jdk10] // dir
[Pipeline] [windows-jdk8] }
[windows-jdk8] [withMaven] junitPublisher - Archive test results for Maven artifact org.apache.maven.plugins:maven-doap-plugin:1.3-SNAPSHOT generated by maven-surefire-plugin:test (default-test): m\target\surefire-reports\*.xml
[windows-jdk8] [withMaven] junitPublisher - Jenkins JUnit Attachments Plugin not found, can't publish test attachments.Recording test results
[Pipeline] [linux-jdk8] }
[linux-jdk8] [withMaven] One or multiple Maven executions have been ignored by the Jenkins Pipeline Maven Plugin because they have been interrupted before completion (1). See Pipeline Maven Plugin FAQ for more details.
[Pipeline] [windows-jdk10] }
[Pipeline] [windows-jdk8] // withMaven
[Pipeline] [linux-jdk8] // withMaven
[Pipeline] [windows-jdk10] // stage
[Pipeline] [windows-jdk8] }
[Pipeline] [linux-jdk8] echo
[linux-jdk8] [FAIL FAST] windows-jdk7 had first failure, ignoring script returned exit code 143
[Pipeline] [linux-jdk8] }
[Pipeline] [windows-jdk10] stage
[Pipeline] [windows-jdk10] { (Build windows-jdk10)
[Pipeline] [windows-jdk10] echo
[windows-jdk10] [FAIL FAST] windows-jdk7 has failed. Skipping windows-jdk10.
[Pipeline] [windows-jdk10] }
[Pipeline] [windows-jdk8] // stage
[Pipeline] [linux-jdk8] // stage
[Pipeline] [linux-jdk8] }
[Pipeline] [windows-jdk8] }
[Pipeline] [windows-jdk10] // stage
[Pipeline] [windows-jdk10] }
[Pipeline] [linux-jdk8] // node
[Pipeline] [windows-jdk8] // node
[Pipeline] [linux-jdk8] }
[Pipeline] [windows-jdk8] }
[Pipeline] [windows-jdk10] // node
[Pipeline] [windows-jdk10] }
[Pipeline] [linux-jdk10] }
[Pipeline] [linux-jdk9] }
[Pipeline] [linux-jdk10] // dir
[Pipeline] [linux-jdk9] // dir
[Pipeline] [linux-jdk10] echo
[linux-jdk10] [FAIL FAST] windows-jdk7 had first failure, ignoring Timeout waiting for task.
[Pipeline] [linux-jdk10] }
[Pipeline] [linux-jdk9] echo
[linux-jdk9] [FAIL FAST] windows-jdk7 had first failure, ignoring Timeout waiting for task.
[Pipeline] [linux-jdk9] }
[Pipeline] [linux-jdk10] // stage
[Pipeline] [linux-jdk9] // stage
[Pipeline] [linux-jdk10] stage
[Pipeline] [linux-jdk10] { (Build linux-jdk10)
[Pipeline] [linux-jdk9] stage
[Pipeline] [linux-jdk9] { (Build linux-jdk9)
[Pipeline] [linux-jdk10] echo
[linux-jdk10] [FAIL FAST] windows-jdk7 has failed. Skipping linux-jdk10.
[Pipeline] [linux-jdk10] }
[Pipeline] [linux-jdk9] echo
[linux-jdk9] [FAIL FAST] windows-jdk7 has failed. Skipping linux-jdk9.
[Pipeline] [linux-jdk9] }
[Pipeline] [linux-jdk10] // stage
[Pipeline] [linux-jdk9] // stage
[Pipeline] [linux-jdk10] }
[Pipeline] [linux-jdk9] }
[Pipeline] [linux-jdk10] // node
[Pipeline] [linux-jdk9] // node
[Pipeline] [linux-jdk9] }
[Pipeline] [linux-jdk10] }
[Pipeline] // parallel
[Pipeline] echo
***** FAST FAILURE *****

Fast failure triggered by windows-jdk7

***** FAST FAILURE *****
[Pipeline] stage
[Pipeline] { (Notifications)
[Pipeline] echo
Build result: FAILURE
[Pipeline] jiraIssueSelector
[Pipeline] jiraComment
[Pipeline] emailext
Reply | Threaded
Open this post in threaded view
|

Build failed in Jenkins: Maven TLP » maven-doap-plugin » master #7

Apache Jenkins Server-2
See https://builds.apache.org/job/maven-box/job/maven-doap-plugin/job/master/7/

No changes.

No tests ran.

Build log:
[...truncated 22.71 KB...]
[linux-jdk8]  > git config remote.origin.url https://gitbox.apache.org/repos/asf/maven-doap-plugin.git # timeout=10
[linux-jdk8] Fetching without tags
[linux-jdk8] Fetching upstream changes from https://gitbox.apache.org/repos/asf/maven-doap-plugin.git
[linux-jdk8]  > git --version # timeout=10
[linux-jdk8]  > git fetch --no-tags --progress https://gitbox.apache.org/repos/asf/maven-doap-plugin.git +refs/heads/*:refs/remotes/origin/*
[linux-jdk9]  > git rev-parse --is-inside-work-tree # timeout=10
[linux-jdk9] Fetching changes from the remote Git repository
[linux-jdk9]  > git config remote.origin.url https://gitbox.apache.org/repos/asf/maven-doap-plugin.git # timeout=10
[linux-jdk9] Fetching without tags
[linux-jdk9] Fetching upstream changes from https://gitbox.apache.org/repos/asf/maven-doap-plugin.git
[linux-jdk9]  > git --version # timeout=10
[linux-jdk9]  > git fetch --no-tags --progress https://gitbox.apache.org/repos/asf/maven-doap-plugin.git +refs/heads/*:refs/remotes/origin/*
[linux-jdk10]  > git rev-parse --is-inside-work-tree # timeout=10
[linux-jdk10] Fetching changes from the remote Git repository
[linux-jdk10]  > git config remote.origin.url https://gitbox.apache.org/repos/asf/maven-doap-plugin.git # timeout=10
[linux-jdk10] Fetching without tags
[linux-jdk10] Fetching upstream changes from https://gitbox.apache.org/repos/asf/maven-doap-plugin.git
[linux-jdk10]  > git --version # timeout=10
[windows-jdk7] Checking out Revision 3b7056f2b8f17878de451f3b8385c28a2b604b3a (master)
[windows-jdk7]  > git config core.sparsecheckout # timeout=10
[windows-jdk7]  > git checkout -f 3b7056f2b8f17878de451f3b8385c28a2b604b3a
[windows-jdk7] Commit message: "[MNGSITE-332] - Changed download templates of plugins not to reference .md5 anymore"
[windows-jdk7]  > git rev-list --no-walk 3b7056f2b8f17878de451f3b8385c28a2b604b3a # timeout=10
[windows-jdk7] Cleaning workspace
[windows-jdk7]  > git rev-parse --verify HEAD # timeout=10
[windows-jdk8] Checking out Revision 3b7056f2b8f17878de451f3b8385c28a2b604b3a (master)
[windows-jdk8]  > git config core.sparsecheckout # timeout=10
[windows-jdk8]  > git checkout -f 3b7056f2b8f17878de451f3b8385c28a2b604b3a
[windows-jdk8] Commit message: "[MNGSITE-332] - Changed download templates of plugins not to reference .md5 anymore"
[windows-jdk8] Cleaning workspace
[windows-jdk8]  > git rev-parse --verify HEAD # timeout=10
[windows-jdk8] Resetting working tree
[windows-jdk8]  > git reset --hard # timeout=10
[windows-jdk8]  > git clean -fdx # timeout=10
[linux-jdk10]  > git fetch --no-tags --progress https://gitbox.apache.org/repos/asf/maven-doap-plugin.git +refs/heads/*:refs/remotes/origin/*
[windows-jdk7] Resetting working tree
[windows-jdk7]  > git reset --hard # timeout=10
[windows-jdk7]  > git clean -fdx # timeout=10
[Pipeline] [windows-jdk8] }
[Pipeline] [windows-jdk8] // dir
[Pipeline] [windows-jdk8] }
[Pipeline] [windows-jdk8] // stage
[Pipeline] [windows-jdk8] stage
[Pipeline] [windows-jdk8] { (Build windows-jdk8)
[Pipeline] [windows-jdk7] }
[Pipeline] [windows-jdk8] withMaven
[windows-jdk8] [withMaven] Options: [org.jenkinsci.plugins.pipeline.maven.publishers.GeneratedArtifactsPublisher[disabled=true], org.jenkinsci.plugins.pipeline.maven.publishers.JunitTestsPublisher[disabled=false], org.jenkinsci.plugins.pipeline.maven.publishers.FindbugsAnalysisPublisher[disabled=true], org.jenkinsci.plugins.pipeline.maven.publishers.TasksScannerPublisher[disabled=true], org.jenkinsci.plugins.pipeline.maven.publishers.DependenciesFingerprintPublisher[disabled=false, scopes=[compile, provided, runtime], versions={snapshot:true, release:false}], org.jenkinsci.plugins.pipeline.maven.publishers.InvokerRunsPublisher[disabled=false], org.jenkinsci.plugins.pipeline.maven.publishers.PipelineGraphPublisher[disabled=false, scopes=[compile, provided, runtime], versions={snapshot:true, release:false}, skipDownstreamTriggers=false, lifecycleThreshold=deploy, ignoreUpstreamTriggers=false]]
[windows-jdk8] [withMaven] Available options:
[windows-jdk8] [withMaven] using JDK installation JDK 1.8 (latest)
[windows-jdk8] [withMaven] using Maven installation 'Maven 3.5.0 (Windows)'
[Pipeline] [windows-jdk8] {
[Pipeline] [windows-jdk7] // dir
[Pipeline] [windows-jdk7] }
[Pipeline] [windows-jdk8] dir
[windows-jdk8] Running in f:\jenkins\jenkins-slave\workspace\ox_maven-doap-plugin_master-K56SP7WQZT7DLJESN4Z67EH56OK5QEQZKI2M7VJKWLIVTWMNHWNA@2\m
[Pipeline] [windows-jdk8] {
[linux-jdk8] Checking out Revision 3b7056f2b8f17878de451f3b8385c28a2b604b3a (master)
[linux-jdk9] Checking out Revision 3b7056f2b8f17878de451f3b8385c28a2b604b3a (master)
[linux-jdk10] Checking out Revision 3b7056f2b8f17878de451f3b8385c28a2b604b3a (master)
[Pipeline] [windows-jdk7] // stage
[Pipeline] [windows-jdk7] stage
[Pipeline] [windows-jdk7] { (Build windows-jdk7)
[Pipeline] [windows-jdk8] isUnix
[Pipeline] [windows-jdk8] bat
[windows-jdk8] [m] Running batch script
[Pipeline] [windows-jdk7] withMaven
[windows-jdk7] [withMaven] Options: [org.jenkinsci.plugins.pipeline.maven.publishers.GeneratedArtifactsPublisher[disabled=true], org.jenkinsci.plugins.pipeline.maven.publishers.JunitTestsPublisher[disabled=false], org.jenkinsci.plugins.pipeline.maven.publishers.FindbugsAnalysisPublisher[disabled=true], org.jenkinsci.plugins.pipeline.maven.publishers.TasksScannerPublisher[disabled=true], org.jenkinsci.plugins.pipeline.maven.publishers.DependenciesFingerprintPublisher[disabled=false, scopes=[compile, provided, runtime], versions={snapshot:true, release:false}], org.jenkinsci.plugins.pipeline.maven.publishers.InvokerRunsPublisher[disabled=false], org.jenkinsci.plugins.pipeline.maven.publishers.PipelineGraphPublisher[disabled=false, scopes=[compile, provided, runtime], versions={snapshot:true, release:false}, skipDownstreamTriggers=false, lifecycleThreshold=deploy, ignoreUpstreamTriggers=false]]
[windows-jdk7] [withMaven] Available options:
[windows-jdk7] [withMaven] using JDK installation JDK 1.7 (latest)
[windows-jdk7] [withMaven] using Maven installation 'Maven 3.5.0 (Windows)'
[Pipeline] [windows-jdk7] {
[linux-jdk7]  > git config remote.origin.url https://gitbox.apache.org/repos/asf/maven-doap-plugin.git # timeout=10
[linux-jdk7]  > git config --add remote.origin.fetch +refs/heads/*:refs/remotes/origin/* # timeout=10
[linux-jdk8]  > git config core.sparsecheckout # timeout=10
[Pipeline] [windows-jdk7] dir
[windows-jdk7] Running in f:\jenkins\jenkins-slave\workspace\ox_maven-doap-plugin_master-K56SP7WQZT7DLJESN4Z67EH56OK5QEQZKI2M7VJKWLIVTWMNHWNA\m
[Pipeline] [windows-jdk7] {
[linux-jdk7]  > git config remote.origin.url https://gitbox.apache.org/repos/asf/maven-doap-plugin.git # timeout=10
[linux-jdk7] Fetching without tags
[linux-jdk8]  > git checkout -f 3b7056f2b8f17878de451f3b8385c28a2b604b3a
[linux-jdk8] Commit message: "[MNGSITE-332] - Changed download templates of plugins not to reference .md5 anymore"
[linux-jdk8] Cleaning workspace
[linux-jdk9]  > git config core.sparsecheckout # timeout=10
[linux-jdk9]  > git checkout -f 3b7056f2b8f17878de451f3b8385c28a2b604b3a
[linux-jdk10]  > git config core.sparsecheckout # timeout=10
[linux-jdk10]  > git checkout -f 3b7056f2b8f17878de451f3b8385c28a2b604b3a
[windows-jdk8]
[windows-jdk8] f:\jenkins\jenkins-slave\workspace\ox_maven-doap-plugin_master-K56SP7WQZT7DLJESN4Z67EH56OK5QEQZKI2M7VJKWLIVTWMNHWNA@2\m>mvn -P+run-its -Dmaven.test.failure.ignore=true -Dfindbugs.failOnError=false -Dfindbugs.skip=true clean verify
[windows-jdk8] ----- withMaven Wrapper script -----
[Pipeline] [windows-jdk7] isUnix
[Pipeline] [windows-jdk7] bat
[linux-jdk9] Commit message: "[MNGSITE-332] - Changed download templates of plugins not to reference .md5 anymore"
[linux-jdk9] Cleaning workspace
[windows-jdk7] [m] Running batch script
[Pipeline] [linux-jdk10] }
[Pipeline] [linux-jdk10] // dir
[Pipeline] [linux-jdk10] echo
[linux-jdk10] [FAIL FAST] This is the first failure and likely root cause
[Pipeline] [linux-jdk10] }
[Pipeline] [linux-jdk10] // stage
[Pipeline] [linux-jdk10] }
[Pipeline] [linux-jdk10] // node
[windows-jdk9] Running on windows-2012-1 in f:\jenkins\jenkins-slave\workspace\ox_maven-doap-plugin_master-K56SP7WQZT7DLJESN4Z67EH56OK5QEQZKI2M7VJKWLIVTWMNHWNA
[Pipeline] [linux-jdk10] }
[linux-jdk10] Failed in branch linux-jdk10
[linux-jdk7] Fetching upstream changes from https://gitbox.apache.org/repos/asf/maven-doap-plugin.git
[linux-jdk7]  > git fetch --no-tags --progress https://gitbox.apache.org/repos/asf/maven-doap-plugin.git +refs/heads/*:refs/remotes/origin/*
[linux-jdk8]  > git rev-parse --verify HEAD # timeout=10
[linux-jdk8] Resetting working tree
[linux-jdk8]  > git reset --hard # timeout=10
[linux-jdk8]  > git clean -fdx # timeout=10
[linux-jdk9]  > git rev-parse --verify HEAD # timeout=10
[linux-jdk9] Resetting working tree
[linux-jdk9]  > git reset --hard # timeout=10
[linux-jdk9]  > git clean -fdx # timeout=10
[windows-jdk7] Sending interrupt signal to process
[windows-jdk10] Running on windows-2012-3 in f:\jenkins\jenkins-slave\workspace\ox_maven-doap-plugin_master-K56SP7WQZT7DLJESN4Z67EH56OK5QEQZKI2M7VJKWLIVTWMNHWNA
[windows-jdk8] Sending interrupt signal to process
[windows-jdk7]
[windows-jdk7] f:\jenkins\jenkins-slave\workspace\ox_maven-doap-plugin_master-K56SP7WQZT7DLJESN4Z67EH56OK5QEQZKI2M7VJKWLIVTWMNHWNA\m>mvn -P+run-its -Dmaven.test.failure.ignore=true -Dfindbugs.failOnError=false -Dfindbugs.skip=true clean verify
[windows-jdk7] ----- withMaven Wrapper script -----
[Pipeline] [windows-jdk9] {
[Pipeline] [windows-jdk9] }
[Pipeline] [windows-jdk10] {
[Pipeline] [windows-jdk9] // node
[Pipeline] [windows-jdk9] }
[windows-jdk9] Failed in branch windows-jdk9
[Pipeline] [linux-jdk7] }
[Pipeline] [linux-jdk8] }
[Pipeline] [linux-jdk9] }
[Pipeline] [windows-jdk7] }
[Pipeline] [windows-jdk10] stage
[Pipeline] [windows-jdk10] { (Checkout windows-jdk10)
[Pipeline] [windows-jdk10] dir
[windows-jdk10] Running in f:\jenkins\jenkins-slave\workspace\ox_maven-doap-plugin_master-K56SP7WQZT7DLJESN4Z67EH56OK5QEQZKI2M7VJKWLIVTWMNHWNA\m
[Pipeline] [windows-jdk10] {
[Pipeline] [windows-jdk10] checkout
[Pipeline] [linux-jdk7] // dir
[Pipeline] [linux-jdk8] // dir
[Pipeline] [linux-jdk9] // dir
[windows-jdk10]  > git rev-parse --is-inside-work-tree # timeout=10
[windows-jdk8] Apache Maven 3.5.0 (ff8f5e7444045639af65f6095c62210b5713f426; 2017-04-03T19:39:06Z)
[windows-jdk8] Maven home: F:\jenkins\tools\maven\apache-maven-3.5.0\bin\..
[windows-jdk8] Java version: 1.8.0_152, vendor: Oracle Corporation
[windows-jdk8] Java home: f:\jenkins\tools\java\latest1.8\jre
[windows-jdk8] Default locale: en_US, platform encoding: Cp1252
[windows-jdk8] OS name: "windows server 2012 r2", version: "6.3", arch: "amd64", family: "windows"
[Pipeline] [windows-jdk7] // dir
[Pipeline] [linux-jdk7] echo
[windows-jdk10] Fetching changes from the remote Git repository
[linux-jdk7] [FAIL FAST] linux-jdk10 had first failure, ignoring null
[Pipeline] [linux-jdk7] }
[Pipeline] [linux-jdk8] echo
[linux-jdk8] [FAIL FAST] linux-jdk10 had first failure, ignoring null
[Pipeline] [linux-jdk8] }
[Pipeline] [linux-jdk9] echo
[linux-jdk9] [FAIL FAST] linux-jdk10 had first failure, ignoring null
[Pipeline] [linux-jdk9] }
[Pipeline] [windows-jdk7] }
[windows-jdk10]  > git config remote.origin.url https://gitbox.apache.org/repos/asf/maven-doap-plugin.git # timeout=10
[Pipeline] [linux-jdk7] // stage
[Pipeline] [linux-jdk8] // stage
[windows-jdk10] Fetching without tags
[Pipeline] [linux-jdk9] // stage
[windows-jdk10] Fetching upstream changes from https://gitbox.apache.org/repos/asf/maven-doap-plugin.git
[windows-jdk10]  > git --version # timeout=10
[Pipeline] [windows-jdk7] // withMaven
[windows-jdk10]  > git fetch --no-tags --progress https://gitbox.apache.org/repos/asf/maven-doap-plugin.git +refs/heads/*:refs/remotes/origin/*
[Pipeline] [linux-jdk7] stage
[Pipeline] [linux-jdk7] { (Build linux-jdk7)
[Pipeline] [linux-jdk8] stage
[Pipeline] [linux-jdk8] { (Build linux-jdk8)
[Pipeline] [linux-jdk9] stage
[Pipeline] [linux-jdk9] { (Build linux-jdk9)
[Pipeline] [windows-jdk8] }
[Pipeline] [windows-jdk7] echo
[windows-jdk7] [FAIL FAST] linux-jdk10 had first failure, ignoring script returned exit code -1
[Pipeline] [windows-jdk7] }
[Pipeline] [linux-jdk7] echo
[linux-jdk7] [FAIL FAST] linux-jdk10 has failed. Skipping linux-jdk7.
[Pipeline] [linux-jdk7] }
[Pipeline] [linux-jdk8] echo
[linux-jdk8] [FAIL FAST] linux-jdk10 has failed. Skipping linux-jdk8.
[Pipeline] [linux-jdk8] }
[Pipeline] [linux-jdk9] echo
[linux-jdk9] [FAIL FAST] linux-jdk10 has failed. Skipping linux-jdk9.
[Pipeline] [linux-jdk9] }
[Pipeline] [windows-jdk8] // dir
[Pipeline] [windows-jdk7] // stage
[Pipeline] [windows-jdk7] }
[Pipeline] [windows-jdk8] }
[Pipeline] [linux-jdk7] // stage
[Pipeline] [linux-jdk8] // stage
[Pipeline] [linux-jdk9] // stage
[Pipeline] [linux-jdk7] }
[Pipeline] [linux-jdk8] }
[Pipeline] [linux-jdk9] }
[Pipeline] [windows-jdk7] // node
[Pipeline] [windows-jdk8] // withMaven
[Pipeline] [windows-jdk7] }
[Pipeline] [windows-jdk8] echo
[windows-jdk8] [FAIL FAST] linux-jdk10 had first failure, ignoring script returned exit code -1
[Pipeline] [windows-jdk8] }
[Pipeline] [linux-jdk7] // node
[Pipeline] [linux-jdk8] // node
[Pipeline] [linux-jdk9] // node
[Pipeline] [linux-jdk7] }
[Pipeline] [linux-jdk8] }
[Pipeline] [linux-jdk9] }
[Pipeline] [windows-jdk8] // stage
[Pipeline] [windows-jdk8] }
[Pipeline] [windows-jdk8] // node
[Pipeline] [windows-jdk8] }
[windows-jdk10] Checking out Revision 3b7056f2b8f17878de451f3b8385c28a2b604b3a (master)
[windows-jdk10]  > git config core.sparsecheckout # timeout=10
[windows-jdk10]  > git checkout -f 3b7056f2b8f17878de451f3b8385c28a2b604b3a
[windows-jdk10] Commit message: "[MNGSITE-332] - Changed download templates of plugins not to reference .md5 anymore"
[windows-jdk10] Cleaning workspace
[windows-jdk10]  > git rev-parse --verify HEAD # timeout=10
[windows-jdk10] Resetting working tree
[windows-jdk10]  > git reset --hard # timeout=10
[windows-jdk10]  > git clean -fdx # timeout=10
[Pipeline] [windows-jdk10] }
[Pipeline] [windows-jdk10] // dir
[Pipeline] [windows-jdk10] }
[Pipeline] [windows-jdk10] // stage
[Pipeline] [windows-jdk10] stage
[Pipeline] [windows-jdk10] { (Build windows-jdk10)
[Pipeline] [windows-jdk10] echo
[windows-jdk10] [FAIL FAST] linux-jdk10 has failed. Skipping windows-jdk10.
[Pipeline] [windows-jdk10] }
[Pipeline] [windows-jdk10] // stage
[Pipeline] [windows-jdk10] }
[Pipeline] [windows-jdk10] // node
[Pipeline] [windows-jdk10] }
[windows-jdk10] Failed in branch windows-jdk10
[Pipeline] // parallel
[Pipeline] echo
***** FAST FAILURE *****

Fast failure triggered by linux-jdk10

***** FAST FAILURE *****
[Pipeline] stage
[Pipeline] { (Notifications)
[Pipeline] echo
Build result: FAILURE
[Pipeline] jiraIssueSelector
[Pipeline] emailext
Reply | Threaded
Open this post in threaded view
|

Build failed in Jenkins: Maven TLP » maven-doap-plugin » master #8

Apache Jenkins Server-2
See https://builds.apache.org/job/maven-box/job/maven-doap-plugin/job/master/8/

No changes.

No tests ran.

Build log:
[...truncated 9.53 KB...]
[Pipeline] [windows-jdk7] node
[Pipeline] [windows-jdk8] node
[Pipeline] [windows-jdk9] node
[Pipeline] [windows-jdk10] node
[Pipeline] [linux-jdk7] {
[Pipeline] [linux-jdk8] {
[Pipeline] [linux-jdk9] {
[Pipeline] [linux-jdk10] {
[windows-jdk7] Running on windows-2012-2 in f:\jenkins\jenkins-slave\workspace\ox_maven-doap-plugin_master-K56SP7WQZT7DLJESN4Z67EH56OK5QEQZKI2M7VJKWLIVTWMNHWNA
[Pipeline] [linux-jdk7] stage
[Pipeline] [linux-jdk7] { (Checkout linux-jdk7)
[Pipeline] [linux-jdk8] stage
[Pipeline] [linux-jdk8] { (Checkout linux-jdk8)
[Pipeline] [linux-jdk9] stage
[Pipeline] [linux-jdk9] { (Checkout linux-jdk9)
[Pipeline] [linux-jdk10] stage
[Pipeline] [linux-jdk10] { (Checkout linux-jdk10)
[Pipeline] [linux-jdk7] dir
[linux-jdk7] Running in /home/jenkins/jenkins-slave/workspace/ox_maven-doap-plugin_master-K56SP7WQZT7DLJESN4Z67EH56OK5QEQZKI2M7VJKWLIVTWMNHWNA/m
[Pipeline] [linux-jdk7] {
[Pipeline] [linux-jdk8] dir
[linux-jdk8] Running in /home/jenkins/jenkins-slave/workspace/ox_maven-doap-plugin_master-K56SP7WQZT7DLJESN4Z67EH56OK5QEQZKI2M7VJKWLIVTWMNHWNA/m
[Pipeline] [linux-jdk8] {
[Pipeline] [linux-jdk9] dir
[linux-jdk9] Running in /home/jenkins/jenkins-slave/workspace/ox_maven-doap-plugin_master-K56SP7WQZT7DLJESN4Z67EH56OK5QEQZKI2M7VJKWLIVTWMNHWNA/m
[Pipeline] [linux-jdk9] {
[Pipeline] [linux-jdk10] dir
[linux-jdk10] Running in /home/jenkins/jenkins-slave/workspace/ox_maven-doap-plugin_master-K56SP7WQZT7DLJESN4Z67EH56OK5QEQZKI2M7VJKWLIVTWMNHWNA/m
[Pipeline] [linux-jdk10] {
[Pipeline] [windows-jdk7] {
[Pipeline] [linux-jdk7] checkout
[Pipeline] [linux-jdk8] checkout
[Pipeline] [linux-jdk9] checkout
[Pipeline] [linux-jdk10] checkout
[Pipeline] [windows-jdk7] stage
[Pipeline] [windows-jdk7] { (Checkout windows-jdk7)
[Pipeline] [windows-jdk7] dir
[windows-jdk7] Running in f:\jenkins\jenkins-slave\workspace\ox_maven-doap-plugin_master-K56SP7WQZT7DLJESN4Z67EH56OK5QEQZKI2M7VJKWLIVTWMNHWNA\m
[Pipeline] [windows-jdk7] {
[Pipeline] [windows-jdk7] checkout
[linux-jdk7]  > git rev-parse --is-inside-work-tree # timeout=10
[linux-jdk7] Fetching changes from the remote Git repository
[linux-jdk7]  > git config remote.origin.url https://gitbox.apache.org/repos/asf/maven-doap-plugin.git # timeout=10
[linux-jdk7] Fetching without tags
[linux-jdk8]  > git rev-parse --is-inside-work-tree # timeout=10
[linux-jdk8] Fetching changes from the remote Git repository
[linux-jdk8]  > git config remote.origin.url https://gitbox.apache.org/repos/asf/maven-doap-plugin.git # timeout=10
[linux-jdk8] Fetching without tags
[linux-jdk10]  > git rev-parse --is-inside-work-tree # timeout=10
[linux-jdk10] Fetching changes from the remote Git repository
[linux-jdk10]  > git config remote.origin.url https://gitbox.apache.org/repos/asf/maven-doap-plugin.git # timeout=10
[linux-jdk10] Fetching without tags
[windows-jdk7]  > git rev-parse --is-inside-work-tree # timeout=10
[windows-jdk7] Fetching changes from the remote Git repository
[windows-jdk7]  > git config remote.origin.url https://gitbox.apache.org/repos/asf/maven-doap-plugin.git # timeout=10
[windows-jdk7] Fetching without tags
[windows-jdk7] Fetching upstream changes from https://gitbox.apache.org/repos/asf/maven-doap-plugin.git
[windows-jdk7]  > git --version # timeout=10
[windows-jdk7]  > git fetch --no-tags --progress https://gitbox.apache.org/repos/asf/maven-doap-plugin.git +refs/heads/*:refs/remotes/origin/*
[windows-jdk7] Checking out Revision 3b7056f2b8f17878de451f3b8385c28a2b604b3a (master)
[windows-jdk7]  > git config core.sparsecheckout # timeout=10
[windows-jdk7]  > git checkout -f 3b7056f2b8f17878de451f3b8385c28a2b604b3a
[windows-jdk7] Commit message: "[MNGSITE-332] - Changed download templates of plugins not to reference .md5 anymore"
[windows-jdk7]  > git rev-list --no-walk 3b7056f2b8f17878de451f3b8385c28a2b604b3a # timeout=10
[linux-jdk7] Fetching upstream changes from https://gitbox.apache.org/repos/asf/maven-doap-plugin.git
[linux-jdk7]  > git --version # timeout=10
[linux-jdk7]  > git fetch --no-tags --progress https://gitbox.apache.org/repos/asf/maven-doap-plugin.git +refs/heads/*:refs/remotes/origin/*
[linux-jdk8] Fetching upstream changes from https://gitbox.apache.org/repos/asf/maven-doap-plugin.git
[linux-jdk8]  > git --version # timeout=10
[linux-jdk8]  > git fetch --no-tags --progress https://gitbox.apache.org/repos/asf/maven-doap-plugin.git +refs/heads/*:refs/remotes/origin/*
[linux-jdk10] Fetching upstream changes from https://gitbox.apache.org/repos/asf/maven-doap-plugin.git
[linux-jdk10]  > git --version # timeout=10
[linux-jdk10]  > git fetch --no-tags --progress https://gitbox.apache.org/repos/asf/maven-doap-plugin.git +refs/heads/*:refs/remotes/origin/*
[windows-jdk7] Cleaning workspace
[windows-jdk7]  > git rev-parse --verify HEAD # timeout=10
[windows-jdk7] Resetting working tree
[windows-jdk7]  > git reset --hard # timeout=10
[windows-jdk7]  > git clean -fdx # timeout=10
[Pipeline] [windows-jdk7] }
[Pipeline] [windows-jdk7] // dir
[Pipeline] [windows-jdk7] }
[Pipeline] [windows-jdk7] // stage
[Pipeline] [windows-jdk7] stage
[Pipeline] [windows-jdk7] { (Build windows-jdk7)
[Pipeline] [windows-jdk7] withMaven
[windows-jdk7] [withMaven] Options: [org.jenkinsci.plugins.pipeline.maven.publishers.GeneratedArtifactsPublisher[disabled=true], org.jenkinsci.plugins.pipeline.maven.publishers.JunitTestsPublisher[disabled=false], org.jenkinsci.plugins.pipeline.maven.publishers.FindbugsAnalysisPublisher[disabled=true], org.jenkinsci.plugins.pipeline.maven.publishers.TasksScannerPublisher[disabled=true], org.jenkinsci.plugins.pipeline.maven.publishers.DependenciesFingerprintPublisher[disabled=false, scopes=[compile, provided, runtime], versions={snapshot:true, release:false}], org.jenkinsci.plugins.pipeline.maven.publishers.InvokerRunsPublisher[disabled=false], org.jenkinsci.plugins.pipeline.maven.publishers.PipelineGraphPublisher[disabled=false, scopes=[compile, provided, runtime], versions={snapshot:true, release:false}, skipDownstreamTriggers=false, lifecycleThreshold=deploy, ignoreUpstreamTriggers=false]]
[windows-jdk7] [withMaven] Available options:
[windows-jdk7] [withMaven] using JDK installation JDK 1.7 (latest)
[windows-jdk7] [withMaven] using Maven installation 'Maven 3.5.0 (Windows)'
[Pipeline] [windows-jdk7] {
[Pipeline] [windows-jdk7] dir
[windows-jdk7] Running in f:\jenkins\jenkins-slave\workspace\ox_maven-doap-plugin_master-K56SP7WQZT7DLJESN4Z67EH56OK5QEQZKI2M7VJKWLIVTWMNHWNA\m
[Pipeline] [windows-jdk7] {
[Pipeline] [windows-jdk7] isUnix
[Pipeline] [windows-jdk7] bat
[linux-jdk7] Checking out Revision 3b7056f2b8f17878de451f3b8385c28a2b604b3a (master)
[linux-jdk7]  > git config core.sparsecheckout # timeout=10
[linux-jdk7]  > git checkout -f 3b7056f2b8f17878de451f3b8385c28a2b604b3a
[linux-jdk8] Checking out Revision 3b7056f2b8f17878de451f3b8385c28a2b604b3a (master)
[linux-jdk8]  > git config core.sparsecheckout # timeout=10
[linux-jdk8]  > git checkout -f 3b7056f2b8f17878de451f3b8385c28a2b604b3a
[linux-jdk10] Checking out Revision 3b7056f2b8f17878de451f3b8385c28a2b604b3a (master)
[linux-jdk10]  > git config core.sparsecheckout # timeout=10
[linux-jdk10]  > git checkout -f 3b7056f2b8f17878de451f3b8385c28a2b604b3a
[windows-jdk7] [m] Running batch script
[windows-jdk7]
[windows-jdk7] f:\jenkins\jenkins-slave\workspace\ox_maven-doap-plugin_master-K56SP7WQZT7DLJESN4Z67EH56OK5QEQZKI2M7VJKWLIVTWMNHWNA\m>mvn -P+run-its -Dmaven.test.failure.ignore=true -Dfindbugs.failOnError=false -Dfindbugs.skip=true clean verify
[windows-jdk7] ----- withMaven Wrapper script -----
[Pipeline] [linux-jdk10] }
[Pipeline] [linux-jdk10] // dir
[Pipeline] [linux-jdk10] echo
[linux-jdk7] Commit message: "[MNGSITE-332] - Changed download templates of plugins not to reference .md5 anymore"
[linux-jdk7] Cleaning workspace
[linux-jdk10] [FAIL FAST] This is the first failure and likely root cause
[Pipeline] [linux-jdk10] }
[Pipeline] [linux-jdk10] // stage
[linux-jdk8] Commit message: "[MNGSITE-332] - Changed download templates of plugins not to reference .md5 anymore"
[linux-jdk8] Cleaning workspace
[Pipeline] [linux-jdk10] }
[Pipeline] [linux-jdk10] // node
[Pipeline] [linux-jdk10] }
[windows-jdk8] Running on windows-2012-2 in f:\jenkins\jenkins-slave\workspace\ox_maven-doap-plugin_master-K56SP7WQZT7DLJESN4Z67EH56OK5QEQZKI2M7VJKWLIVTWMNHWNA@2
[windows-jdk9] Running on windows-2012-2 in f:\jenkins\jenkins-slave\workspace\ox_maven-doap-plugin_master-K56SP7WQZT7DLJESN4Z67EH56OK5QEQZKI2M7VJKWLIVTWMNHWNA@3
[linux-jdk7]  > git rev-parse --verify HEAD # timeout=10
[linux-jdk7] Resetting working tree
[linux-jdk7]  > git reset --hard # timeout=10
[linux-jdk7]  > git clean -fdx # timeout=10
[linux-jdk8]  > git rev-parse --verify HEAD # timeout=10
[linux-jdk8] Resetting working tree
[linux-jdk8]  > git reset --hard # timeout=10
[linux-jdk8]  > git clean -fdx # timeout=10
[windows-jdk7] Sending interrupt signal to process
[windows-jdk7] Apache Maven 3.5.0 (ff8f5e7444045639af65f6095c62210b5713f426; 2017-04-03T19:39:06Z)
[windows-jdk7] Maven home: F:\jenkins\tools\maven\apache-maven-3.5.0\bin\..
[windows-jdk7] Java version: 1.7.0_79, vendor: Oracle Corporation
[windows-jdk7] Java home: f:\jenkins\tools\java\latest1.7\jre
[windows-jdk7] Default locale: en_US, platform encoding: Cp1252
[windows-jdk7] OS name: "windows server 2012 r2", version: "6.3", arch: "amd64", family: "windows"
[linux-jdk10] Failed in branch linux-jdk10
[Pipeline] [windows-jdk8] {
[Pipeline] [windows-jdk9] // node
[Pipeline] [windows-jdk10] // node
[Pipeline] [windows-jdk9] }
[windows-jdk9] Failed in branch windows-jdk9
[Pipeline] [windows-jdk10] }
[windows-jdk10] Failed in branch windows-jdk10
[Pipeline] [linux-jdk7] }
[Pipeline] [linux-jdk8] }
[Pipeline] [linux-jdk9] }
[Pipeline] [windows-jdk8] stage
[Pipeline] [windows-jdk8] { (Checkout windows-jdk8)
[Pipeline] [windows-jdk8] dir
[windows-jdk8] Running in f:\jenkins\jenkins-slave\workspace\ox_maven-doap-plugin_master-K56SP7WQZT7DLJESN4Z67EH56OK5QEQZKI2M7VJKWLIVTWMNHWNA@2\m
[Pipeline] [windows-jdk8] {
[Pipeline] [windows-jdk8] checkout
[Pipeline] [linux-jdk7] // dir
[Pipeline] [linux-jdk8] // dir
[Pipeline] [linux-jdk9] // dir
[Pipeline] [linux-jdk7] echo
[linux-jdk7] [FAIL FAST] linux-jdk10 had first failure, ignoring null
[Pipeline] [linux-jdk7] }
[Pipeline] [linux-jdk8] echo
[linux-jdk8] [FAIL FAST] linux-jdk10 had first failure, ignoring null
[Pipeline] [linux-jdk8] }
[Pipeline] [linux-jdk9] echo
[linux-jdk9] [FAIL FAST] linux-jdk10 had first failure, ignoring java.lang.InterruptedException
[Pipeline] [linux-jdk9] }
[Pipeline] [linux-jdk7] // stage
[windows-jdk8]  > git rev-parse --is-inside-work-tree # timeout=10
[Pipeline] [linux-jdk8] // stage
[Pipeline] [linux-jdk9] // stage
[Pipeline] [linux-jdk7] stage
[Pipeline] [linux-jdk7] { (Build linux-jdk7)
[Pipeline] [linux-jdk8] stage
[windows-jdk8] Fetching changes from the remote Git repository
[Pipeline] [linux-jdk8] { (Build linux-jdk8)
[Pipeline] [linux-jdk9] stage
[Pipeline] [linux-jdk9] { (Build linux-jdk9)
[Pipeline] [linux-jdk7] echo
[linux-jdk7] [FAIL FAST] linux-jdk10 has failed. Skipping linux-jdk7.
[Pipeline] [linux-jdk7] }
[windows-jdk8]  > git config remote.origin.url https://gitbox.apache.org/repos/asf/maven-doap-plugin.git # timeout=10
[Pipeline] [linux-jdk8] echo
[linux-jdk8] [FAIL FAST] linux-jdk10 has failed. Skipping linux-jdk8.
[Pipeline] [linux-jdk8] }
[Pipeline] [linux-jdk9] echo
[linux-jdk9] [FAIL FAST] linux-jdk10 has failed. Skipping linux-jdk9.
[Pipeline] [linux-jdk9] }
[Pipeline] [linux-jdk7] // stage
[Pipeline] [linux-jdk8] // stage
[Pipeline] [linux-jdk9] // stage
[windows-jdk8] Fetching without tags
[Pipeline] [linux-jdk7] }
[Pipeline] [linux-jdk8] }
[Pipeline] [linux-jdk9] }
[Pipeline] [windows-jdk7] }
[Pipeline] [linux-jdk7] // node
[windows-jdk8] Fetching upstream changes from https://gitbox.apache.org/repos/asf/maven-doap-plugin.git
[windows-jdk8]  > git --version # timeout=10
[Pipeline] [linux-jdk8] // node
[windows-jdk8]  > git fetch --no-tags --progress https://gitbox.apache.org/repos/asf/maven-doap-plugin.git +refs/heads/*:refs/remotes/origin/*
[Pipeline] [linux-jdk9] // node
[Pipeline] [windows-jdk7] // dir
[Pipeline] [linux-jdk7] }
[Pipeline] [linux-jdk8] }
[Pipeline] [linux-jdk9] }
[Pipeline] [windows-jdk7] }
[Pipeline] [windows-jdk7] // withMaven
[Pipeline] [windows-jdk7] }
[Pipeline] [windows-jdk7] // stage
[Pipeline] [windows-jdk7] }
[Pipeline] [windows-jdk7] // node
[Pipeline] [windows-jdk7] }
[windows-jdk8] Checking out Revision 3b7056f2b8f17878de451f3b8385c28a2b604b3a (master)
[windows-jdk8]  > git config core.sparsecheckout # timeout=10
[windows-jdk8]  > git checkout -f 3b7056f2b8f17878de451f3b8385c28a2b604b3a
[windows-jdk8] Commit message: "[MNGSITE-332] - Changed download templates of plugins not to reference .md5 anymore"
[windows-jdk8] Cleaning workspace
[windows-jdk8]  > git rev-parse --verify HEAD # timeout=10
[windows-jdk8] Resetting working tree
[windows-jdk8]  > git reset --hard # timeout=10
[windows-jdk8]  > git clean -fdx # timeout=10
[Pipeline] [windows-jdk8] }
[Pipeline] [windows-jdk8] // dir
[Pipeline] [windows-jdk8] }
[Pipeline] [windows-jdk8] // stage
[Pipeline] [windows-jdk8] stage
[Pipeline] [windows-jdk8] { (Build windows-jdk8)
[Pipeline] [windows-jdk8] echo
[windows-jdk8] [FAIL FAST] linux-jdk10 has failed. Skipping windows-jdk8.
[Pipeline] [windows-jdk8] }
[Pipeline] [windows-jdk8] // stage
[Pipeline] [windows-jdk8] }
[Pipeline] [windows-jdk8] // node
[Pipeline] [windows-jdk8] }
[windows-jdk8] Failed in branch windows-jdk8
[Pipeline] // parallel
[Pipeline] echo
***** FAST FAILURE *****

Fast failure triggered by linux-jdk10

***** FAST FAILURE *****
[Pipeline] stage
[Pipeline] { (Notifications)
[Pipeline] echo
Build result: FAILURE
[Pipeline] jiraIssueSelector
[Pipeline] emailext
Reply | Threaded
Open this post in threaded view
|

Build succeeded in Jenkins: Maven TLP » maven-doap-plugin » master #9

Apache Jenkins Server-2