Build failed in Jenkins: Maven TLP » maven-dist-tool » master #235

classic Classic list List threaded Threaded
7 messages Options
Reply | Threaded
Open this post in threaded view
|

Build failed in Jenkins: Maven TLP » maven-dist-tool » master #235

Apache Jenkins Server-2
See https://builds.apache.org/job/maven-box/job/maven-dist-tool/job/master/235/

Changes:

* Revert "Log unique commits"

All tests passed

Build log:
[...truncated 5032 lines...]
[2019-09-14T21:50:06.879Z] [INFO] /indexer: org.apache.maven.indexer
[2019-09-14T21:50:06.879Z] [INFO]   maven-indexer
[2019-09-14T21:50:06.879Z] [INFO] /maven-3: org.apache.maven src+bin
[2019-09-14T21:50:06.879Z] [INFO]   apache-maven [3.0,3.1.0-alpha-1)
[2019-09-14T21:50:06.879Z] [INFO]   apache-maven [3.1.0,3.2.0-alpha-1)
[2019-09-14T21:50:06.880Z] [INFO]   apache-maven
[2019-09-14T21:50:06.880Z] [INFO] /jxr: org.apache.maven.jxr
[2019-09-14T21:50:06.880Z] [INFO]   jxr
[2019-09-14T21:50:06.880Z] [INFO] /plugin-testing: org.apache.maven.plugin-testing
[2019-09-14T21:50:06.880Z] [INFO]   maven-plugin-testing
[2019-09-14T21:50:06.880Z] [INFO] /plugin-tools: org.apache.maven.plugin-tools
[2019-09-14T21:50:06.880Z] [INFO]   maven-plugin-tools
[2019-09-14T21:50:06.880Z] [INFO] /plugins: org.apache.maven.plugins http://maven.apache.org/plugins/
[2019-09-14T21:50:06.880Z] [INFO]   maven-acr-plugin
[2019-09-14T21:50:06.880Z] [INFO]   maven-antrun-plugin
[2019-09-14T21:50:06.880Z] [INFO]   * maven-archetype-plugin
[2019-09-14T21:50:06.880Z] [INFO]   maven-assembly-plugin
[2019-09-14T21:50:06.880Z] [INFO]   maven-changelog-plugin
[2019-09-14T21:50:06.880Z] [INFO]   maven-changes-plugin
[2019-09-14T21:50:06.880Z] [INFO]   maven-checkstyle-plugin
[2019-09-14T21:50:06.880Z] [INFO]   maven-clean-plugin
[2019-09-14T21:50:06.880Z] [INFO]   maven-compiler-plugin
[2019-09-14T21:50:06.880Z] [INFO]   maven-dependency-plugin
[2019-09-14T21:50:06.880Z] [INFO]   maven-deploy-plugin
[2019-09-14T21:50:06.880Z] [INFO]   maven-doap-plugin
[2019-09-14T21:50:06.880Z] [INFO]   maven-docck-plugin
[2019-09-14T21:50:06.880Z] [INFO]   maven-ear-plugin
[2019-09-14T21:50:06.880Z] [INFO]   maven-ejb-plugin
[2019-09-14T21:50:06.880Z] [INFO]   * maven-enforcer-plugin
[2019-09-14T21:50:06.880Z] [INFO]   * maven-failsafe-plugin
[2019-09-14T21:50:06.880Z] [INFO]   maven-gpg-plugin
[2019-09-14T21:50:06.880Z] [INFO]   maven-help-plugin
[2019-09-14T21:50:06.880Z] [INFO]   maven-install-plugin
[2019-09-14T21:50:06.880Z] [INFO]   maven-invoker-plugin
[2019-09-14T21:50:06.880Z] [INFO]   maven-jar-plugin
[2019-09-14T21:50:06.880Z] [INFO]   maven-jarsigner-plugin
[2019-09-14T21:50:06.880Z] [INFO]   maven-javadoc-plugin
[2019-09-14T21:50:06.880Z] [INFO]   maven-jdeps-plugin
[2019-09-14T21:50:06.880Z] [INFO]   maven-jdeprscan-plugin
[2019-09-14T21:50:06.880Z] [INFO]   maven-jlink-plugin
[2019-09-14T21:50:06.880Z] [INFO]   maven-jmod-plugin
[2019-09-14T21:50:06.880Z] [INFO]   * maven-jxr-plugin
[2019-09-14T21:50:06.880Z] [INFO]   maven-linkcheck-plugin
[2019-09-14T21:50:06.880Z] [INFO]   maven-patch-plugin
[2019-09-14T21:50:06.880Z] [INFO]   maven-pdf-plugin
[2019-09-14T21:50:06.880Z] [INFO]   * maven-plugin-plugin
[2019-09-14T21:50:06.880Z] [INFO]   maven-pmd-plugin
[2019-09-14T21:50:06.880Z] [INFO]   maven-project-info-reports-plugin
[2019-09-14T21:50:06.880Z] [INFO]   maven-rar-plugin
[2019-09-14T21:50:06.880Z] [INFO]   * maven-release-plugin  
[2019-09-14T21:50:06.880Z] [INFO]   maven-remote-resources-plugin
[2019-09-14T21:50:06.880Z] [INFO]   maven-resources-plugin
[2019-09-14T21:50:06.880Z] [INFO]   * maven-scm-plugin
[2019-09-14T21:50:06.880Z] [INFO]   maven-scm-publish-plugin
[2019-09-14T21:50:06.880Z] [INFO]   maven-shade-plugin
[2019-09-14T21:50:06.880Z] [INFO]   maven-site-plugin
[2019-09-14T21:50:07.591Z] [INFO]   maven-source-plugin
[2019-09-14T21:50:07.591Z] [INFO]   maven-stage-plugin
[2019-09-14T21:50:07.591Z] [INFO]   * maven-surefire-plugin
[2019-09-14T21:50:07.591Z] [INFO]   * maven-surefire-report-plugin
[2019-09-14T21:50:07.591Z] [INFO]   maven-toolchains-plugin
[2019-09-14T21:50:07.591Z] [INFO]   maven-verifier-plugin
[2019-09-14T21:50:07.591Z] [INFO]   maven-war-plugin
[2019-09-14T21:50:07.591Z] [INFO] /pom: org.apache http://maven.apache.org/pom/
[2019-09-14T21:50:07.591Z] [INFO] > apache index-path = /asf/
[2019-09-14T21:50:07.591Z] [INFO] > apache site = http://maven.apache.org/pom/asf/
[2019-09-14T21:50:07.591Z] [INFO]   apache
[2019-09-14T21:50:07.591Z] [INFO] /pom: org.apache.maven http://maven.apache.org/pom/
[2019-09-14T21:50:07.591Z] [INFO] > maven-parent index-path = /maven/
[2019-09-14T21:50:07.591Z] [INFO] > maven-parent site = http://maven.apache.org/pom/maven/
[2019-09-14T21:50:07.591Z] [INFO]   maven-parent
[2019-09-14T21:50:07.592Z] [INFO] /release: org.apache.maven.release
[2019-09-14T21:50:07.592Z] [INFO]   maven-release (,3)
[2019-09-14T21:50:07.592Z] [INFO] /reporting: org.apache.maven.reporting http://maven.apache.org/shared/
[2019-09-14T21:50:07.592Z] [INFO]   maven-reporting-api
[2019-09-14T21:50:07.592Z] [INFO]   maven-reporting-exec
[2019-09-14T21:50:07.592Z] [INFO]   maven-reporting-impl
[2019-09-14T21:50:07.592Z] [INFO] /resolver: org.apache.maven.resolver
[2019-09-14T21:50:07.592Z] [INFO]   maven-resolver
[2019-09-14T21:50:07.592Z] [INFO] /resources: org.apache.apache.resources
[2019-09-14T21:50:07.592Z] [INFO] > apache-source-release-assembly-descriptor site = http://maven.apache.org/apache-resource-bundles/
[2019-09-14T21:50:07.592Z] [INFO]   apache-source-release-assembly-descriptor
[2019-09-14T21:50:07.592Z] [INFO] /resources: org.apache
[2019-09-14T21:50:07.592Z] [INFO] > apache-incubator-disclaimer-resource-bundle site = http://maven.apache.org/apache-resource-bundles/
[2019-09-14T21:50:07.592Z] [INFO]   apache-incubator-disclaimer-resource-bundle (,1.1]
[2019-09-14T21:50:07.592Z] [INFO] > apache-jar-resource-bundle site = http://maven.apache.org/apache-resource-bundles/
[2019-09-14T21:50:07.592Z] [INFO]   apache-jar-resource-bundle (,1.4]
[2019-09-14T21:50:07.592Z] [INFO] > apache-license-header-resource-bundle site = http://maven.apache.org/apache-resource-bundles/
[2019-09-14T21:50:07.592Z] [INFO]   apache-license-header-resource-bundle (,1.1]
[2019-09-14T21:50:07.592Z] [INFO] /scm: org.apache.maven.scm
[2019-09-14T21:50:07.592Z] [INFO]   maven-scm
[2019-09-14T21:50:07.592Z] [INFO] /shared: org.apache.maven.shared http://maven.apache.org/shared/
[2019-09-14T21:50:07.592Z] [INFO]   file-management
[2019-09-14T21:50:07.592Z] [INFO]   maven-common-artifact-filters
[2019-09-14T21:50:07.592Z] [INFO]   maven-dependency-analyzer
[2019-09-14T21:50:07.592Z] [INFO]   maven-dependency-tree
[2019-09-14T21:50:07.592Z] [INFO]   maven-filtering
[2019-09-14T21:50:07.592Z] [INFO]   maven-invoker
[2019-09-14T21:50:07.592Z] [INFO]   maven-jarsigner
[2019-09-14T21:50:07.592Z] [INFO]   maven-mapping
[2019-09-14T21:50:07.592Z] [INFO]   maven-script-interpreter
[2019-09-14T21:50:07.592Z] [INFO]   maven-shared-incremental
[2019-09-14T21:50:07.592Z] [INFO]   maven-shared-jar
[2019-09-14T21:50:07.592Z] [INFO]   maven-shared-resources
[2019-09-14T21:50:07.592Z] [INFO]   maven-shared-utils
[2019-09-14T21:50:07.592Z] [INFO]   maven-shared-io
[2019-09-14T21:50:07.592Z] [INFO]   maven-verifier
[2019-09-14T21:50:07.592Z] [INFO] /shared: org.apache.maven http://maven.apache.org/shared/
[2019-09-14T21:50:07.592Z] [INFO]   maven-archiver
[2019-09-14T21:50:07.592Z] [INFO] > maven-skins index-path = /skins/
[2019-09-14T21:50:07.592Z] [INFO] /skins: org.apache.maven.skins http://maven.apache.org/skins/
[2019-09-14T21:50:07.592Z] [INFO]   maven-default-skin
[2019-09-14T21:50:07.592Z] [INFO]   maven-fluido-skin
[2019-09-14T21:50:07.592Z] [INFO] /surefire: org.apache.maven.surefire
[2019-09-14T21:50:07.592Z] [INFO]   surefire
[2019-09-14T21:50:07.592Z] [INFO] /wagon: org.apache.maven.wagon
[2019-09-14T21:50:07.592Z] [INFO]   wagon
[2019-09-14T21:50:07.592Z] [INFO]
[2019-09-14T21:50:07.592Z] [ERROR] maven-invoker-plugin: found 3.2.0 instead of 3.2.1 in http://maven.apache.org/plugins/
[2019-09-14T21:50:07.592Z] [INFO] Generating "Dist Tool> Check Errors" report --- dist-tool-plugin:1.0-SNAPSHOT:check-errors
[2019-09-14T21:50:07.592Z] [INFO] Generating "Dist Tool> List Plugins Prerequisites" report --- dist-tool-plugin:1.0-SNAPSHOT:list-plugins-prerequisites
[2019-09-14T21:50:12.837Z] [INFO] Generating "Dist Tool> List Master Jobs" report --- dist-tool-plugin:1.0-SNAPSHOT:list-master-jobs
[2019-09-14T21:51:18.554Z] [INFO] Generating "Dist Tool> Failure Hack" report --- dist-tool-plugin:1.0-SNAPSHOT:failure-report
[2019-09-14T21:51:18.554Z] [ERROR] check-source-release.log error log not empty:
[2019-09-14T21:51:18.554Z] Missing file for maven-invoker-plugin in http://www.apache.org/dist/maven/plugins
[2019-09-14T21:51:18.554Z]  > maven-invoker-plugin-3.2.1-source-release.zip <
[2019-09-14T21:51:18.554Z]  > maven-invoker-plugin-3.2.1-source-release.zip.asc <
[2019-09-14T21:51:18.554Z]  > maven-invoker-plugin-3.2.1-source-release.zip.sha1 or .sha512 <
[2019-09-14T21:51:18.554Z] Different version than 3.2.1 for maven-invoker-plugin available in http://www.apache.org/dist/maven/plugins
[2019-09-14T21:51:18.554Z]  > maven-invoker-plugin-3.2.0-source-release.zip <
[2019-09-14T21:51:18.554Z]  > maven-invoker-plugin-3.2.0-source-release.zip.asc <
[2019-09-14T21:51:18.554Z]  > maven-invoker-plugin-3.2.0-source-release.zip.sha512 <
[2019-09-14T21:51:18.554Z]
[2019-09-14T21:51:18.554Z] [ERROR] check-index-page.log error log not empty:
[2019-09-14T21:51:18.554Z] maven-invoker-plugin: found 3.2.0 instead of 3.2.1 in http://maven.apache.org/plugins/
[2019-09-14T21:51:18.554Z]
[2019-09-14T21:51:18.554Z] [INFO] ------------------------------------------------------------------------
[2019-09-14T21:51:18.554Z] [INFO] BUILD FAILURE
[2019-09-14T21:51:18.554Z] [INFO] ------------------------------------------------------------------------
[2019-09-14T21:51:18.554Z] [INFO] Total time:  02:59 min
[2019-09-14T21:51:18.554Z] [INFO] Finished at: 2019-09-14T21:51:06Z
[2019-09-14T21:51:18.554Z] [INFO] ------------------------------------------------------------------------
[2019-09-14T21:51:18.555Z] [WARNING] The requested profile "apache.snapshots" could not be activated because it does not exist.
[2019-09-14T21:51:18.555Z] [INFO] [jenkins-event-spy] Generated /home/jenkins/jenkins-slave/workspace/maven-box_maven-dist-tool_master@tmp/withMaven93e9c614/maven-spy-20190914-214806-6668650436923409795557.log
[2019-09-14T21:51:18.555Z] [ERROR] Failed to execute goal org.apache.maven.plugins:maven-site-plugin:3.7.1:site (default-site) on project dist-tool-plugin: Error generating dist-tool-plugin:1.0-SNAPSHOT:failure-report report: Dist Tool> Checks found inconsistencies in some released artifacts, see https://builds.apache.org/job/dist-tool-plugin/site/dist-tool-check-errors.html for more information -> [Help 1]
[2019-09-14T21:51:18.555Z] org.apache.maven.lifecycle.LifecycleExecutionException: Failed to execute goal org.apache.maven.plugins:maven-site-plugin:3.7.1:site (default-site) on project dist-tool-plugin: Error generating dist-tool-plugin:1.0-SNAPSHOT:failure-report report
[2019-09-14T21:51:18.555Z]     at org.apache.maven.lifecycle.internal.MojoExecutor.execute (MojoExecutor.java:215)
[2019-09-14T21:51:18.555Z]     at org.apache.maven.lifecycle.internal.MojoExecutor.execute (MojoExecutor.java:156)
[2019-09-14T21:51:18.555Z]     at org.apache.maven.lifecycle.internal.MojoExecutor.execute (MojoExecutor.java:148)
[2019-09-14T21:51:18.555Z]     at org.apache.maven.lifecycle.internal.LifecycleModuleBuilder.buildProject (LifecycleModuleBuilder.java:117)
[2019-09-14T21:51:18.555Z]     at org.apache.maven.lifecycle.internal.LifecycleModuleBuilder.buildProject (LifecycleModuleBuilder.java:81)
[2019-09-14T21:51:18.555Z]     at org.apache.maven.lifecycle.internal.builder.singlethreaded.SingleThreadedBuilder.build (SingleThreadedBuilder.java:56)
[2019-09-14T21:51:18.555Z]     at org.apache.maven.lifecycle.internal.LifecycleStarter.execute (LifecycleStarter.java:128)
[2019-09-14T21:51:18.555Z]     at org.apache.maven.DefaultMaven.doExecute (DefaultMaven.java:305)
[2019-09-14T21:51:18.555Z]     at org.apache.maven.DefaultMaven.doExecute (DefaultMaven.java:192)
[2019-09-14T21:51:18.555Z]     at org.apache.maven.DefaultMaven.execute (DefaultMaven.java:105)
[2019-09-14T21:51:18.555Z]     at org.apache.maven.cli.MavenCli.execute (MavenCli.java:956)
[2019-09-14T21:51:18.555Z]     at org.apache.maven.cli.MavenCli.doMain (MavenCli.java:288)
[2019-09-14T21:51:18.555Z]     at org.apache.maven.cli.MavenCli.main (MavenCli.java:192)
[2019-09-14T21:51:18.555Z]     at sun.reflect.NativeMethodAccessorImpl.invoke0 (Native Method)
[2019-09-14T21:51:18.555Z]     at sun.reflect.NativeMethodAccessorImpl.invoke (NativeMethodAccessorImpl.java:62)
[2019-09-14T21:51:18.555Z]     at sun.reflect.DelegatingMethodAccessorImpl.invoke (DelegatingMethodAccessorImpl.java:43)
[2019-09-14T21:51:18.555Z]     at java.lang.reflect.Method.invoke (Method.java:498)
[2019-09-14T21:51:18.555Z]     at org.codehaus.plexus.classworlds.launcher.Launcher.launchEnhanced (Launcher.java:282)
[2019-09-14T21:51:18.555Z]     at org.codehaus.plexus.classworlds.launcher.Launcher.launch (Launcher.java:225)
[2019-09-14T21:51:18.555Z]     at org.codehaus.plexus.classworlds.launcher.Launcher.mainWithExitCode (Launcher.java:406)
[2019-09-14T21:51:18.555Z]     at org.codehaus.plexus.classworlds.launcher.Launcher.main (Launcher.java:347)
[2019-09-14T21:51:18.555Z] Caused by: org.apache.maven.plugin.MojoExecutionException: Error generating dist-tool-plugin:1.0-SNAPSHOT:failure-report report
[2019-09-14T21:51:18.555Z]     at org.apache.maven.plugins.site.render.SiteMojo.execute (SiteMojo.java:155)
[2019-09-14T21:51:18.555Z]     at org.apache.maven.plugin.DefaultBuildPluginManager.executeMojo (DefaultBuildPluginManager.java:137)
[2019-09-14T21:51:18.555Z]     at org.apache.maven.lifecycle.internal.MojoExecutor.execute (MojoExecutor.java:210)
[2019-09-14T21:51:18.556Z]     at org.apache.maven.lifecycle.internal.MojoExecutor.execute (MojoExecutor.java:156)
[2019-09-14T21:51:18.556Z]     at org.apache.maven.lifecycle.internal.MojoExecutor.execute (MojoExecutor.java:148)
[2019-09-14T21:51:18.556Z]     at org.apache.maven.lifecycle.internal.LifecycleModuleBuilder.buildProject (LifecycleModuleBuilder.java:117)
[2019-09-14T21:51:18.556Z]     at org.apache.maven.lifecycle.internal.LifecycleModuleBuilder.buildProject (LifecycleModuleBuilder.java:81)
[2019-09-14T21:51:18.556Z]     at org.apache.maven.lifecycle.internal.builder.singlethreaded.SingleThreadedBuilder.build (SingleThreadedBuilder.java:56)
[2019-09-14T21:51:18.556Z]     at org.apache.maven.lifecycle.internal.LifecycleStarter.execute (LifecycleStarter.java:128)
[2019-09-14T21:51:18.556Z]     at org.apache.maven.DefaultMaven.doExecute (DefaultMaven.java:305)
[2019-09-14T21:51:18.556Z]     at org.apache.maven.DefaultMaven.doExecute (DefaultMaven.java:192)
[2019-09-14T21:51:18.556Z]     at org.apache.maven.DefaultMaven.execute (DefaultMaven.java:105)
[2019-09-14T21:51:18.556Z]     at org.apache.maven.cli.MavenCli.execute (MavenCli.java:956)
[2019-09-14T21:51:18.556Z]     at org.apache.maven.cli.MavenCli.doMain (MavenCli.java:288)
[2019-09-14T21:51:18.556Z]     at org.apache.maven.cli.MavenCli.main (MavenCli.java:192)
[2019-09-14T21:51:18.556Z]     at sun.reflect.NativeMethodAccessorImpl.invoke0 (Native Method)
[2019-09-14T21:51:18.556Z]     at sun.reflect.NativeMethodAccessorImpl.invoke (NativeMethodAccessorImpl.java:62)
[2019-09-14T21:51:18.556Z]     at sun.reflect.DelegatingMethodAccessorImpl.invoke (DelegatingMethodAccessorImpl.java:43)
[2019-09-14T21:51:18.556Z]     at java.lang.reflect.Method.invoke (Method.java:498)
[2019-09-14T21:51:18.556Z]     at org.codehaus.plexus.classworlds.launcher.Launcher.launchEnhanced (Launcher.java:282)
[2019-09-14T21:51:18.556Z]     at org.codehaus.plexus.classworlds.launcher.Launcher.launch (Launcher.java:225)
[2019-09-14T21:51:18.556Z]     at org.codehaus.plexus.classworlds.launcher.Launcher.mainWithExitCode (Launcher.java:406)
[2019-09-14T21:51:18.556Z]     at org.codehaus.plexus.classworlds.launcher.Launcher.main (Launcher.java:347)
[2019-09-14T21:51:18.556Z] Caused by: org.apache.maven.reporting.MavenReportException: Dist Tool> Checks found inconsistencies in some released artifacts, see https://builds.apache.org/job/dist-tool-plugin/site/dist-tool-check-errors.html for more information
[2019-09-14T21:51:18.556Z]     at org.apache.maven.dist.tools.DistCheckErrorsMojo.executeReport (DistCheckErrorsMojo.java:113)
[2019-09-14T21:51:18.556Z]     at org.apache.maven.reporting.AbstractMavenReport.generate (AbstractMavenReport.java:251)
[2019-09-14T21:51:18.556Z]     at org.apache.maven.plugins.site.render.ReportDocumentRenderer.renderDocument (ReportDocumentRenderer.java:230)
[2019-09-14T21:51:18.556Z]     at org.apache.maven.doxia.siterenderer.DefaultSiteRenderer.render (DefaultSiteRenderer.java:349)
[2019-09-14T21:51:18.556Z]     at org.apache.maven.plugins.site.render.SiteMojo.renderLocale (SiteMojo.java:198)
[2019-09-14T21:51:18.556Z]     at org.apache.maven.plugins.site.render.SiteMojo.execute (SiteMojo.java:147)
[2019-09-14T21:51:18.556Z]     at org.apache.maven.plugin.DefaultBuildPluginManager.executeMojo (DefaultBuildPluginManager.java:137)
[2019-09-14T21:51:18.556Z]     at org.apache.maven.lifecycle.internal.MojoExecutor.execute (MojoExecutor.java:210)
[2019-09-14T21:51:18.556Z]     at org.apache.maven.lifecycle.internal.MojoExecutor.execute (MojoExecutor.java:156)
[2019-09-14T21:51:18.556Z]     at org.apache.maven.lifecycle.internal.MojoExecutor.execute (MojoExecutor.java:148)
[2019-09-14T21:51:18.557Z]     at org.apache.maven.lifecycle.internal.LifecycleModuleBuilder.buildProject (LifecycleModuleBuilder.java:117)
[2019-09-14T21:51:18.557Z]     at org.apache.maven.lifecycle.internal.LifecycleModuleBuilder.buildProject (LifecycleModuleBuilder.java:81)
[2019-09-14T21:51:18.557Z]     at org.apache.maven.lifecycle.internal.builder.singlethreaded.SingleThreadedBuilder.build (SingleThreadedBuilder.java:56)
[2019-09-14T21:51:18.557Z]     at org.apache.maven.lifecycle.internal.LifecycleStarter.execute (LifecycleStarter.java:128)
[2019-09-14T21:51:18.557Z]     at org.apache.maven.DefaultMaven.doExecute (DefaultMaven.java:305)
[2019-09-14T21:51:18.557Z]     at org.apache.maven.DefaultMaven.doExecute (DefaultMaven.java:192)
[2019-09-14T21:51:18.557Z]     at org.apache.maven.DefaultMaven.execute (DefaultMaven.java:105)
[2019-09-14T21:51:18.557Z]     at org.apache.maven.cli.MavenCli.execute (MavenCli.java:956)
[2019-09-14T21:51:18.557Z]     at org.apache.maven.cli.MavenCli.doMain (MavenCli.java:288)
[2019-09-14T21:51:18.557Z]     at org.apache.maven.cli.MavenCli.main (MavenCli.java:192)
[2019-09-14T21:51:18.557Z]     at sun.reflect.NativeMethodAccessorImpl.invoke0 (Native Method)
[2019-09-14T21:51:18.557Z]     at sun.reflect.NativeMethodAccessorImpl.invoke (NativeMethodAccessorImpl.java:62)
[2019-09-14T21:51:18.557Z]     at sun.reflect.DelegatingMethodAccessorImpl.invoke (DelegatingMethodAccessorImpl.java:43)
[2019-09-14T21:51:18.557Z]     at java.lang.reflect.Method.invoke (Method.java:498)
[2019-09-14T21:51:18.557Z]     at org.codehaus.plexus.classworlds.launcher.Launcher.launchEnhanced (Launcher.java:282)
[2019-09-14T21:51:18.557Z]     at org.codehaus.plexus.classworlds.launcher.Launcher.launch (Launcher.java:225)
[2019-09-14T21:51:18.557Z]     at org.codehaus.plexus.classworlds.launcher.Launcher.mainWithExitCode (Launcher.java:406)
[2019-09-14T21:51:18.557Z]     at org.codehaus.plexus.classworlds.launcher.Launcher.main (Launcher.java:347)
[2019-09-14T21:51:18.557Z] [ERROR]
[2019-09-14T21:51:18.557Z] [ERROR] Re-run Maven using the -X switch to enable full debug logging.
[2019-09-14T21:51:18.557Z] [ERROR]
[2019-09-14T21:51:18.557Z] [ERROR] For more information about the errors and possible solutions, please read the following articles:
[2019-09-14T21:51:18.557Z] [ERROR] [Help 1] http://cwiki.apache.org/confluence/display/MAVEN/MojoExecutionException
[Pipeline] }
[2019-09-14T21:51:20.274Z] [withMaven] junitPublisher - Archive test results for Maven artifact org.apache.maven.dist.tools:dist-tool-plugin:maven-plugin:1.0-SNAPSHOT generated by maven-surefire-plugin:test (default-test): target/surefire-reports/*.xml
[2019-09-14T21:51:20.274Z] [withMaven] junitPublisher - Archive test results for Maven artifact org.apache.maven.dist.tools:dist-tool-plugin:maven-plugin:1.0-SNAPSHOT generated by maven-surefire-plugin:test (default-test): target/surefire-reports/*.xml
[2019-09-14T21:51:20.274Z] Recording test results
[2019-09-14T21:51:22.159Z] [withMaven] openTasksPublisher - Scan Tasks for Maven artifact org.apache.maven.dist.tools:dist-tool-plugin:maven-plugin:1.0-SNAPSHOT in source directory src/main/java
[2019-09-14T21:51:22.337Z] [TASKS] Scanning folder '/home/jenkins/jenkins-slave/workspace/maven-box_maven-dist-tool_master' for files matching the pattern 'src/main/java/**/*' - excludes: null
[2019-09-14T21:51:22.337Z] [TASKS] Found 22 files to scan for tasks
[2019-09-14T21:51:22.337Z] [TASKS] Found 2 open tasks.
[2019-09-14T21:51:22.337Z] Skipping warnings blame since pipelines do not have an SCM link.%n
[2019-09-14T21:51:22.369Z] [TASKS] Computing warning deltas based on reference build #231
[2019-09-14T21:51:22.524Z] [withMaven] Publishers: Pipeline Graph Publisher: 3 ms, Junit Publisher: 654 ms, Dependencies Fingerprint Publisher: 1 ms, JGiven Publisher: 1 ms, Open Task Scanner Publisher: 518 ms
[Pipeline] // withMaven
[Pipeline] }
[Pipeline] // stage
[Pipeline] stage
[Pipeline] { (Declarative: Post Actions)
[Pipeline] echo
[2019-09-14T21:51:23.062Z] Build result: FAILURE
[Pipeline] jiraIssueSelector
[Pipeline] echo
[2019-09-14T21:51:23.129Z] The authors of changes [rfscholte].
[Pipeline] echo
[2019-09-14T21:51:23.135Z] Sending email ...
[Pipeline] emailext
Reply | Threaded
Open this post in threaded view
|

Build failed in Jenkins: Maven TLP » maven-dist-tool » master #236

Apache Jenkins Server-2
See https://builds.apache.org/job/maven-box/job/maven-dist-tool/job/master/236/

No changes.

All tests passed

Build log:
[...truncated 5028 lines...]
[2019-09-15T21:50:42.955Z] [INFO]   doxia-linkcheck
[2019-09-15T21:50:42.955Z] [INFO]   doxia-sitetools
[2019-09-15T21:50:42.955Z] [INFO] /enforcer: org.apache.maven.enforcer
[2019-09-15T21:50:42.955Z] [INFO]   enforcer
[2019-09-15T21:50:42.955Z] [INFO] /indexer: org.apache.maven.indexer
[2019-09-15T21:50:42.955Z] [INFO]   maven-indexer
[2019-09-15T21:50:42.955Z] [INFO] /maven-3: org.apache.maven src+bin
[2019-09-15T21:50:42.955Z] [INFO]   apache-maven [3.0,3.1.0-alpha-1)
[2019-09-15T21:50:42.955Z] [INFO]   apache-maven [3.1.0,3.2.0-alpha-1)
[2019-09-15T21:50:42.955Z] [INFO]   apache-maven
[2019-09-15T21:50:42.955Z] [INFO] /jxr: org.apache.maven.jxr
[2019-09-15T21:50:42.955Z] [INFO]   jxr
[2019-09-15T21:50:42.955Z] [INFO] /plugin-testing: org.apache.maven.plugin-testing
[2019-09-15T21:50:42.955Z] [INFO]   maven-plugin-testing
[2019-09-15T21:50:42.955Z] [INFO] /plugin-tools: org.apache.maven.plugin-tools
[2019-09-15T21:50:42.955Z] [INFO]   maven-plugin-tools
[2019-09-15T21:50:42.955Z] [INFO] /plugins: org.apache.maven.plugins http://maven.apache.org/plugins/
[2019-09-15T21:50:42.955Z] [INFO]   maven-acr-plugin
[2019-09-15T21:50:42.955Z] [INFO]   maven-antrun-plugin
[2019-09-15T21:50:42.955Z] [INFO]   * maven-archetype-plugin
[2019-09-15T21:50:42.955Z] [INFO]   maven-assembly-plugin
[2019-09-15T21:50:42.955Z] [INFO]   maven-changelog-plugin
[2019-09-15T21:50:42.955Z] [INFO]   maven-changes-plugin
[2019-09-15T21:50:42.955Z] [INFO]   maven-checkstyle-plugin
[2019-09-15T21:50:42.955Z] [INFO]   maven-clean-plugin
[2019-09-15T21:50:42.955Z] [INFO]   maven-compiler-plugin
[2019-09-15T21:50:42.955Z] [INFO]   maven-dependency-plugin
[2019-09-15T21:50:42.955Z] [INFO]   maven-deploy-plugin
[2019-09-15T21:50:42.955Z] [INFO]   maven-doap-plugin
[2019-09-15T21:50:42.955Z] [INFO]   maven-docck-plugin
[2019-09-15T21:50:42.955Z] [INFO]   maven-ear-plugin
[2019-09-15T21:50:42.955Z] [INFO]   maven-ejb-plugin
[2019-09-15T21:50:42.955Z] [INFO]   * maven-enforcer-plugin
[2019-09-15T21:50:42.955Z] [INFO]   * maven-failsafe-plugin
[2019-09-15T21:50:42.955Z] [INFO]   maven-gpg-plugin
[2019-09-15T21:50:42.955Z] [INFO]   maven-help-plugin
[2019-09-15T21:50:42.955Z] [INFO]   maven-install-plugin
[2019-09-15T21:50:42.955Z] [INFO]   maven-invoker-plugin
[2019-09-15T21:50:42.955Z] [INFO]   maven-jar-plugin
[2019-09-15T21:50:42.955Z] [INFO]   maven-jarsigner-plugin
[2019-09-15T21:50:42.955Z] [INFO]   maven-javadoc-plugin
[2019-09-15T21:50:42.955Z] [INFO]   maven-jdeps-plugin
[2019-09-15T21:50:42.955Z] [INFO]   maven-jdeprscan-plugin
[2019-09-15T21:50:42.955Z] [INFO]   maven-jlink-plugin
[2019-09-15T21:50:42.955Z] [INFO]   maven-jmod-plugin
[2019-09-15T21:50:42.955Z] [INFO]   * maven-jxr-plugin
[2019-09-15T21:50:42.955Z] [INFO]   maven-linkcheck-plugin
[2019-09-15T21:50:42.955Z] [INFO]   maven-patch-plugin
[2019-09-15T21:50:42.955Z] [INFO]   maven-pdf-plugin
[2019-09-15T21:50:42.955Z] [INFO]   * maven-plugin-plugin
[2019-09-15T21:50:42.955Z] [INFO]   maven-pmd-plugin
[2019-09-15T21:50:42.955Z] [INFO]   maven-project-info-reports-plugin
[2019-09-15T21:50:42.955Z] [INFO]   maven-rar-plugin
[2019-09-15T21:50:42.955Z] [INFO]   * maven-release-plugin  
[2019-09-15T21:50:42.955Z] [INFO]   maven-remote-resources-plugin
[2019-09-15T21:50:42.955Z] [INFO]   maven-resources-plugin
[2019-09-15T21:50:42.955Z] [INFO]   * maven-scm-plugin
[2019-09-15T21:50:42.955Z] [INFO]   maven-scm-publish-plugin
[2019-09-15T21:50:42.955Z] [INFO]   maven-shade-plugin
[2019-09-15T21:50:42.955Z] [INFO]   maven-site-plugin
[2019-09-15T21:50:42.955Z] [INFO]   maven-source-plugin
[2019-09-15T21:50:42.955Z] [INFO]   maven-stage-plugin
[2019-09-15T21:50:42.955Z] [INFO]   * maven-surefire-plugin
[2019-09-15T21:50:42.955Z] [INFO]   * maven-surefire-report-plugin
[2019-09-15T21:50:42.955Z] [INFO]   maven-toolchains-plugin
[2019-09-15T21:50:42.955Z] [INFO]   maven-verifier-plugin
[2019-09-15T21:50:42.955Z] [INFO]   maven-war-plugin
[2019-09-15T21:50:42.956Z] [INFO] /pom: org.apache http://maven.apache.org/pom/
[2019-09-15T21:50:42.956Z] [INFO] > apache index-path = /asf/
[2019-09-15T21:50:42.956Z] [INFO] > apache site = http://maven.apache.org/pom/asf/
[2019-09-15T21:50:42.956Z] [INFO]   apache
[2019-09-15T21:50:42.956Z] [INFO] /pom: org.apache.maven http://maven.apache.org/pom/
[2019-09-15T21:50:42.956Z] [INFO] > maven-parent index-path = /maven/
[2019-09-15T21:50:42.956Z] [INFO] > maven-parent site = http://maven.apache.org/pom/maven/
[2019-09-15T21:50:42.956Z] [INFO]   maven-parent
[2019-09-15T21:50:42.956Z] [INFO] /release: org.apache.maven.release
[2019-09-15T21:50:42.956Z] [INFO]   maven-release (,3)
[2019-09-15T21:50:42.956Z] [INFO] /reporting: org.apache.maven.reporting http://maven.apache.org/shared/
[2019-09-15T21:50:42.956Z] [INFO]   maven-reporting-api
[2019-09-15T21:50:43.680Z] [INFO]   maven-reporting-exec
[2019-09-15T21:50:43.680Z] [INFO]   maven-reporting-impl
[2019-09-15T21:50:43.680Z] [INFO] /resolver: org.apache.maven.resolver
[2019-09-15T21:50:43.680Z] [INFO]   maven-resolver
[2019-09-15T21:50:43.680Z] [INFO] /resources: org.apache.apache.resources
[2019-09-15T21:50:43.680Z] [INFO] > apache-source-release-assembly-descriptor site = http://maven.apache.org/apache-resource-bundles/
[2019-09-15T21:50:43.680Z] [INFO]   apache-source-release-assembly-descriptor
[2019-09-15T21:50:43.680Z] [INFO] /resources: org.apache
[2019-09-15T21:50:43.680Z] [INFO] > apache-incubator-disclaimer-resource-bundle site = http://maven.apache.org/apache-resource-bundles/
[2019-09-15T21:50:43.680Z] [INFO]   apache-incubator-disclaimer-resource-bundle (,1.1]
[2019-09-15T21:50:43.680Z] [INFO] > apache-jar-resource-bundle site = http://maven.apache.org/apache-resource-bundles/
[2019-09-15T21:50:43.680Z] [INFO]   apache-jar-resource-bundle (,1.4]
[2019-09-15T21:50:43.680Z] [INFO] > apache-license-header-resource-bundle site = http://maven.apache.org/apache-resource-bundles/
[2019-09-15T21:50:43.680Z] [INFO]   apache-license-header-resource-bundle (,1.1]
[2019-09-15T21:50:43.680Z] [INFO] /scm: org.apache.maven.scm
[2019-09-15T21:50:43.680Z] [INFO]   maven-scm
[2019-09-15T21:50:43.680Z] [INFO] /shared: org.apache.maven.shared http://maven.apache.org/shared/
[2019-09-15T21:50:43.680Z] [INFO]   file-management
[2019-09-15T21:50:43.680Z] [INFO]   maven-common-artifact-filters
[2019-09-15T21:50:43.680Z] [INFO]   maven-dependency-analyzer
[2019-09-15T21:50:43.680Z] [INFO]   maven-dependency-tree
[2019-09-15T21:50:43.680Z] [INFO]   maven-filtering
[2019-09-15T21:50:43.680Z] [INFO]   maven-invoker
[2019-09-15T21:50:43.680Z] [INFO]   maven-jarsigner
[2019-09-15T21:50:43.680Z] [INFO]   maven-mapping
[2019-09-15T21:50:43.680Z] [INFO]   maven-script-interpreter
[2019-09-15T21:50:43.680Z] [INFO]   maven-shared-incremental
[2019-09-15T21:50:43.680Z] [INFO]   maven-shared-jar
[2019-09-15T21:50:43.680Z] [INFO]   maven-shared-resources
[2019-09-15T21:50:43.680Z] [INFO]   maven-shared-utils
[2019-09-15T21:50:43.680Z] [INFO]   maven-shared-io
[2019-09-15T21:50:43.680Z] [INFO]   maven-verifier
[2019-09-15T21:50:43.680Z] [INFO] /shared: org.apache.maven http://maven.apache.org/shared/
[2019-09-15T21:50:43.680Z] [INFO]   maven-archiver
[2019-09-15T21:50:43.680Z] [INFO] > maven-skins index-path = /skins/
[2019-09-15T21:50:43.680Z] [INFO] /skins: org.apache.maven.skins http://maven.apache.org/skins/
[2019-09-15T21:50:43.680Z] [INFO]   maven-default-skin
[2019-09-15T21:50:43.680Z] [INFO]   maven-fluido-skin
[2019-09-15T21:50:43.680Z] [INFO] /surefire: org.apache.maven.surefire
[2019-09-15T21:50:43.680Z] [INFO]   surefire
[2019-09-15T21:50:43.680Z] [INFO] /wagon: org.apache.maven.wagon
[2019-09-15T21:50:43.680Z] [INFO]   wagon
[2019-09-15T21:50:43.680Z] [INFO]
[2019-09-15T21:50:43.680Z] [INFO] Generating "Dist Tool> Check Errors" report --- dist-tool-plugin:1.0-SNAPSHOT:check-errors
[2019-09-15T21:50:43.680Z] [INFO] Generating "Dist Tool> List Plugins Prerequisites" report --- dist-tool-plugin:1.0-SNAPSHOT:list-plugins-prerequisites
[2019-09-15T21:50:55.131Z] [INFO] Generating "Dist Tool> List Master Jobs" report --- dist-tool-plugin:1.0-SNAPSHOT:list-master-jobs
[2019-09-15T21:52:01.367Z] [INFO] Generating "Dist Tool> Failure Hack" report --- dist-tool-plugin:1.0-SNAPSHOT:failure-report
[2019-09-15T21:52:01.367Z] [ERROR] check-source-release.log error log not empty:
[2019-09-15T21:52:01.367Z] Missing file for maven-invoker-plugin in http://www.apache.org/dist/maven/plugins
[2019-09-15T21:52:01.367Z]  > maven-invoker-plugin-3.2.1-source-release.zip <
[2019-09-15T21:52:01.367Z]  > maven-invoker-plugin-3.2.1-source-release.zip.asc <
[2019-09-15T21:52:01.367Z]  > maven-invoker-plugin-3.2.1-source-release.zip.sha1 or .sha512 <
[2019-09-15T21:52:01.367Z] Different version than 3.2.1 for maven-invoker-plugin available in http://www.apache.org/dist/maven/plugins
[2019-09-15T21:52:01.367Z]  > maven-invoker-plugin-3.2.0-source-release.zip <
[2019-09-15T21:52:01.367Z]  > maven-invoker-plugin-3.2.0-source-release.zip.asc <
[2019-09-15T21:52:01.367Z]  > maven-invoker-plugin-3.2.0-source-release.zip.sha512 <
[2019-09-15T21:52:01.367Z]
[2019-09-15T21:52:01.367Z] [INFO] ------------------------------------------------------------------------
[2019-09-15T21:52:01.367Z] [INFO] BUILD FAILURE
[2019-09-15T21:52:01.367Z] [INFO] ------------------------------------------------------------------------
[2019-09-15T21:52:01.367Z] [INFO] Total time:  03:44 min
[2019-09-15T21:52:01.367Z] [INFO] Finished at: 2019-09-15T21:51:04Z
[2019-09-15T21:52:01.367Z] [INFO] ------------------------------------------------------------------------
[2019-09-15T21:52:01.367Z] [WARNING] The requested profile "apache.snapshots" could not be activated because it does not exist.
[2019-09-15T21:52:01.367Z] [INFO] [jenkins-event-spy] Generated /home/jenkins/jenkins-slave/workspace/maven-box_maven-dist-tool_master@tmp/withMaven801bddab/maven-spy-20190915-214719-7848821254689783442984.log
[2019-09-15T21:52:01.367Z] [ERROR] Failed to execute goal org.apache.maven.plugins:maven-site-plugin:3.7.1:site (default-site) on project dist-tool-plugin: Error generating dist-tool-plugin:1.0-SNAPSHOT:failure-report report: Dist Tool> Checks found inconsistencies in some released artifacts, see https://builds.apache.org/job/dist-tool-plugin/site/dist-tool-check-errors.html for more information -> [Help 1]
[2019-09-15T21:52:01.367Z] org.apache.maven.lifecycle.LifecycleExecutionException: Failed to execute goal org.apache.maven.plugins:maven-site-plugin:3.7.1:site (default-site) on project dist-tool-plugin: Error generating dist-tool-plugin:1.0-SNAPSHOT:failure-report report
[2019-09-15T21:52:01.367Z]     at org.apache.maven.lifecycle.internal.MojoExecutor.execute (MojoExecutor.java:215)
[2019-09-15T21:52:01.368Z]     at org.apache.maven.lifecycle.internal.MojoExecutor.execute (MojoExecutor.java:156)
[2019-09-15T21:52:01.368Z]     at org.apache.maven.lifecycle.internal.MojoExecutor.execute (MojoExecutor.java:148)
[2019-09-15T21:52:01.368Z]     at org.apache.maven.lifecycle.internal.LifecycleModuleBuilder.buildProject (LifecycleModuleBuilder.java:117)
[2019-09-15T21:52:01.368Z]     at org.apache.maven.lifecycle.internal.LifecycleModuleBuilder.buildProject (LifecycleModuleBuilder.java:81)
[2019-09-15T21:52:01.368Z]     at org.apache.maven.lifecycle.internal.builder.singlethreaded.SingleThreadedBuilder.build (SingleThreadedBuilder.java:56)
[2019-09-15T21:52:01.368Z]     at org.apache.maven.lifecycle.internal.LifecycleStarter.execute (LifecycleStarter.java:128)
[2019-09-15T21:52:01.368Z]     at org.apache.maven.DefaultMaven.doExecute (DefaultMaven.java:305)
[2019-09-15T21:52:01.368Z]     at org.apache.maven.DefaultMaven.doExecute (DefaultMaven.java:192)
[2019-09-15T21:52:01.368Z]     at org.apache.maven.DefaultMaven.execute (DefaultMaven.java:105)
[2019-09-15T21:52:01.368Z]     at org.apache.maven.cli.MavenCli.execute (MavenCli.java:956)
[2019-09-15T21:52:01.368Z]     at org.apache.maven.cli.MavenCli.doMain (MavenCli.java:288)
[2019-09-15T21:52:01.368Z]     at org.apache.maven.cli.MavenCli.main (MavenCli.java:192)
[2019-09-15T21:52:01.368Z]     at sun.reflect.NativeMethodAccessorImpl.invoke0 (Native Method)
[2019-09-15T21:52:01.368Z]     at sun.reflect.NativeMethodAccessorImpl.invoke (NativeMethodAccessorImpl.java:62)
[2019-09-15T21:52:01.368Z]     at sun.reflect.DelegatingMethodAccessorImpl.invoke (DelegatingMethodAccessorImpl.java:43)
[2019-09-15T21:52:01.368Z]     at java.lang.reflect.Method.invoke (Method.java:498)
[2019-09-15T21:52:01.368Z]     at org.codehaus.plexus.classworlds.launcher.Launcher.launchEnhanced (Launcher.java:282)
[2019-09-15T21:52:01.368Z]     at org.codehaus.plexus.classworlds.launcher.Launcher.launch (Launcher.java:225)
[2019-09-15T21:52:01.368Z]     at org.codehaus.plexus.classworlds.launcher.Launcher.mainWithExitCode (Launcher.java:406)
[2019-09-15T21:52:01.368Z]     at org.codehaus.plexus.classworlds.launcher.Launcher.main (Launcher.java:347)
[2019-09-15T21:52:01.368Z] Caused by: org.apache.maven.plugin.MojoExecutionException: Error generating dist-tool-plugin:1.0-SNAPSHOT:failure-report report
[2019-09-15T21:52:01.368Z]     at org.apache.maven.plugins.site.render.SiteMojo.execute (SiteMojo.java:155)
[2019-09-15T21:52:01.368Z]     at org.apache.maven.plugin.DefaultBuildPluginManager.executeMojo (DefaultBuildPluginManager.java:137)
[2019-09-15T21:52:01.368Z]     at org.apache.maven.lifecycle.internal.MojoExecutor.execute (MojoExecutor.java:210)
[2019-09-15T21:52:01.368Z]     at org.apache.maven.lifecycle.internal.MojoExecutor.execute (MojoExecutor.java:156)
[2019-09-15T21:52:01.368Z]     at org.apache.maven.lifecycle.internal.MojoExecutor.execute (MojoExecutor.java:148)
[2019-09-15T21:52:01.368Z]     at org.apache.maven.lifecycle.internal.LifecycleModuleBuilder.buildProject (LifecycleModuleBuilder.java:117)
[2019-09-15T21:52:01.369Z]     at org.apache.maven.lifecycle.internal.LifecycleModuleBuilder.buildProject (LifecycleModuleBuilder.java:81)
[2019-09-15T21:52:01.369Z]     at org.apache.maven.lifecycle.internal.builder.singlethreaded.SingleThreadedBuilder.build (SingleThreadedBuilder.java:56)
[2019-09-15T21:52:01.369Z]     at org.apache.maven.lifecycle.internal.LifecycleStarter.execute (LifecycleStarter.java:128)
[2019-09-15T21:52:01.369Z]     at org.apache.maven.DefaultMaven.doExecute (DefaultMaven.java:305)
[2019-09-15T21:52:01.369Z]     at org.apache.maven.DefaultMaven.doExecute (DefaultMaven.java:192)
[2019-09-15T21:52:01.369Z]     at org.apache.maven.DefaultMaven.execute (DefaultMaven.java:105)
[2019-09-15T21:52:01.369Z]     at org.apache.maven.cli.MavenCli.execute (MavenCli.java:956)
[2019-09-15T21:52:01.369Z]     at org.apache.maven.cli.MavenCli.doMain (MavenCli.java:288)
[2019-09-15T21:52:01.369Z]     at org.apache.maven.cli.MavenCli.main (MavenCli.java:192)
[2019-09-15T21:52:01.369Z]     at sun.reflect.NativeMethodAccessorImpl.invoke0 (Native Method)
[2019-09-15T21:52:01.369Z]     at sun.reflect.NativeMethodAccessorImpl.invoke (NativeMethodAccessorImpl.java:62)
[2019-09-15T21:52:01.369Z]     at sun.reflect.DelegatingMethodAccessorImpl.invoke (DelegatingMethodAccessorImpl.java:43)
[2019-09-15T21:52:01.369Z]     at java.lang.reflect.Method.invoke (Method.java:498)
[2019-09-15T21:52:01.369Z]     at org.codehaus.plexus.classworlds.launcher.Launcher.launchEnhanced (Launcher.java:282)
[2019-09-15T21:52:01.369Z]     at org.codehaus.plexus.classworlds.launcher.Launcher.launch (Launcher.java:225)
[2019-09-15T21:52:01.369Z]     at org.codehaus.plexus.classworlds.launcher.Launcher.mainWithExitCode (Launcher.java:406)
[2019-09-15T21:52:01.369Z]     at org.codehaus.plexus.classworlds.launcher.Launcher.main (Launcher.java:347)
[2019-09-15T21:52:01.369Z] Caused by: org.apache.maven.reporting.MavenReportException: Dist Tool> Checks found inconsistencies in some released artifacts, see https://builds.apache.org/job/dist-tool-plugin/site/dist-tool-check-errors.html for more information
[2019-09-15T21:52:01.369Z]     at org.apache.maven.dist.tools.DistCheckErrorsMojo.executeReport (DistCheckErrorsMojo.java:113)
[2019-09-15T21:52:01.369Z]     at org.apache.maven.reporting.AbstractMavenReport.generate (AbstractMavenReport.java:251)
[2019-09-15T21:52:01.369Z]     at org.apache.maven.plugins.site.render.ReportDocumentRenderer.renderDocument (ReportDocumentRenderer.java:230)
[2019-09-15T21:52:01.369Z]     at org.apache.maven.doxia.siterenderer.DefaultSiteRenderer.render (DefaultSiteRenderer.java:349)
[2019-09-15T21:52:01.369Z]     at org.apache.maven.plugins.site.render.SiteMojo.renderLocale (SiteMojo.java:198)
[2019-09-15T21:52:01.369Z]     at org.apache.maven.plugins.site.render.SiteMojo.execute (SiteMojo.java:147)
[2019-09-15T21:52:01.369Z]     at org.apache.maven.plugin.DefaultBuildPluginManager.executeMojo (DefaultBuildPluginManager.java:137)
[2019-09-15T21:52:01.370Z]     at org.apache.maven.lifecycle.internal.MojoExecutor.execute (MojoExecutor.java:210)
[2019-09-15T21:52:01.370Z]     at org.apache.maven.lifecycle.internal.MojoExecutor.execute (MojoExecutor.java:156)
[2019-09-15T21:52:01.370Z]     at org.apache.maven.lifecycle.internal.MojoExecutor.execute (MojoExecutor.java:148)
[2019-09-15T21:52:01.370Z]     at org.apache.maven.lifecycle.internal.LifecycleModuleBuilder.buildProject (LifecycleModuleBuilder.java:117)
[2019-09-15T21:52:01.370Z]     at org.apache.maven.lifecycle.internal.LifecycleModuleBuilder.buildProject (LifecycleModuleBuilder.java:81)
[2019-09-15T21:52:01.370Z]     at org.apache.maven.lifecycle.internal.builder.singlethreaded.SingleThreadedBuilder.build (SingleThreadedBuilder.java:56)
[2019-09-15T21:52:01.370Z]     at org.apache.maven.lifecycle.internal.LifecycleStarter.execute (LifecycleStarter.java:128)
[2019-09-15T21:52:01.370Z]     at org.apache.maven.DefaultMaven.doExecute (DefaultMaven.java:305)
[2019-09-15T21:52:01.370Z]     at org.apache.maven.DefaultMaven.doExecute (DefaultMaven.java:192)
[2019-09-15T21:52:01.370Z]     at org.apache.maven.DefaultMaven.execute (DefaultMaven.java:105)
[2019-09-15T21:52:01.370Z]     at org.apache.maven.cli.MavenCli.execute (MavenCli.java:956)
[2019-09-15T21:52:01.370Z]     at org.apache.maven.cli.MavenCli.doMain (MavenCli.java:288)
[2019-09-15T21:52:01.370Z]     at org.apache.maven.cli.MavenCli.main (MavenCli.java:192)
[2019-09-15T21:52:01.370Z]     at sun.reflect.NativeMethodAccessorImpl.invoke0 (Native Method)
[2019-09-15T21:52:01.370Z]     at sun.reflect.NativeMethodAccessorImpl.invoke (NativeMethodAccessorImpl.java:62)
[2019-09-15T21:52:01.370Z]     at sun.reflect.DelegatingMethodAccessorImpl.invoke (DelegatingMethodAccessorImpl.java:43)
[2019-09-15T21:52:01.370Z]     at java.lang.reflect.Method.invoke (Method.java:498)
[2019-09-15T21:52:01.370Z]     at org.codehaus.plexus.classworlds.launcher.Launcher.launchEnhanced (Launcher.java:282)
[2019-09-15T21:52:01.370Z]     at org.codehaus.plexus.classworlds.launcher.Launcher.launch (Launcher.java:225)
[2019-09-15T21:52:01.371Z]     at org.codehaus.plexus.classworlds.launcher.Launcher.mainWithExitCode (Launcher.java:406)
[2019-09-15T21:52:01.371Z]     at org.codehaus.plexus.classworlds.launcher.Launcher.main (Launcher.java:347)
[2019-09-15T21:52:01.371Z] [ERROR]
[2019-09-15T21:52:01.371Z] [ERROR] Re-run Maven using the -X switch to enable full debug logging.
[2019-09-15T21:52:01.371Z] [ERROR]
[2019-09-15T21:52:01.371Z] [ERROR] For more information about the errors and possible solutions, please read the following articles:
[2019-09-15T21:52:01.371Z] [ERROR] [Help 1] http://cwiki.apache.org/confluence/display/MAVEN/MojoExecutionException
[Pipeline] }
[2019-09-15T21:52:03.112Z] [withMaven] junitPublisher - Archive test results for Maven artifact org.apache.maven.dist.tools:dist-tool-plugin:maven-plugin:1.0-SNAPSHOT generated by maven-surefire-plugin:test (default-test): target/surefire-reports/*.xml
[2019-09-15T21:52:03.112Z] [withMaven] junitPublisher - Archive test results for Maven artifact org.apache.maven.dist.tools:dist-tool-plugin:maven-plugin:1.0-SNAPSHOT generated by maven-surefire-plugin:test (default-test): target/surefire-reports/*.xml
[2019-09-15T21:52:03.112Z] Recording test results
[2019-09-15T21:52:04.982Z] [withMaven] openTasksPublisher - Scan Tasks for Maven artifact org.apache.maven.dist.tools:dist-tool-plugin:maven-plugin:1.0-SNAPSHOT in source directory src/main/java
[2019-09-15T21:52:05.162Z] [TASKS] Scanning folder '/home/jenkins/jenkins-slave/workspace/maven-box_maven-dist-tool_master' for files matching the pattern 'src/main/java/**/*' - excludes: null
[2019-09-15T21:52:05.162Z] [TASKS] Found 22 files to scan for tasks
[2019-09-15T21:52:05.162Z] [TASKS] Found 2 open tasks.
[2019-09-15T21:52:05.162Z] Skipping warnings blame since pipelines do not have an SCM link.%n
[2019-09-15T21:52:05.227Z] [TASKS] Computing warning deltas based on reference build #231
[2019-09-15T21:52:05.383Z] [withMaven] Publishers: Pipeline Graph Publisher: 3 ms, Junit Publisher: 637 ms, Open Task Scanner Publisher: 553 ms
[Pipeline] // withMaven
[Pipeline] }
[Pipeline] // stage
[Pipeline] stage
[Pipeline] { (Declarative: Post Actions)
[Pipeline] echo
[2019-09-15T21:52:05.909Z] Build result: FAILURE
[Pipeline] jiraIssueSelector
[Pipeline] echo
[2019-09-15T21:52:05.949Z] The authors of changes [].
[Pipeline] echo
[2019-09-15T21:52:05.955Z] Sending email ...
[Pipeline] emailext
Reply | Threaded
Open this post in threaded view
|

Build failed in Jenkins: Maven TLP » maven-dist-tool » master #237

Apache Jenkins Server-2
See https://builds.apache.org/job/maven-box/job/maven-dist-tool/job/master/237/

No changes.

All tests passed

Build log:
[...truncated 5034 lines...]
[2019-09-16T21:50:31.422Z] [INFO]   doxia-linkcheck
[2019-09-16T21:50:31.422Z] [INFO]   doxia-sitetools
[2019-09-16T21:50:31.422Z] [INFO] /enforcer: org.apache.maven.enforcer
[2019-09-16T21:50:31.422Z] [INFO]   enforcer
[2019-09-16T21:50:31.422Z] [INFO] /indexer: org.apache.maven.indexer
[2019-09-16T21:50:31.422Z] [INFO]   maven-indexer
[2019-09-16T21:50:31.422Z] [INFO] /maven-3: org.apache.maven src+bin
[2019-09-16T21:50:31.422Z] [INFO]   apache-maven [3.0,3.1.0-alpha-1)
[2019-09-16T21:50:31.422Z] [INFO]   apache-maven [3.1.0,3.2.0-alpha-1)
[2019-09-16T21:50:31.422Z] [INFO]   apache-maven
[2019-09-16T21:50:31.422Z] [INFO] /jxr: org.apache.maven.jxr
[2019-09-16T21:50:31.422Z] [INFO]   jxr
[2019-09-16T21:50:31.422Z] [INFO] /plugin-testing: org.apache.maven.plugin-testing
[2019-09-16T21:50:31.422Z] [INFO]   maven-plugin-testing
[2019-09-16T21:50:31.422Z] [INFO] /plugin-tools: org.apache.maven.plugin-tools
[2019-09-16T21:50:31.422Z] [INFO]   maven-plugin-tools
[2019-09-16T21:50:31.422Z] [INFO] /plugins: org.apache.maven.plugins http://maven.apache.org/plugins/
[2019-09-16T21:50:31.422Z] [INFO]   maven-acr-plugin
[2019-09-16T21:50:31.422Z] [INFO]   maven-antrun-plugin
[2019-09-16T21:50:31.422Z] [INFO]   * maven-archetype-plugin
[2019-09-16T21:50:31.422Z] [INFO]   maven-assembly-plugin
[2019-09-16T21:50:31.422Z] [INFO]   maven-changelog-plugin
[2019-09-16T21:50:31.422Z] [INFO]   maven-changes-plugin
[2019-09-16T21:50:31.422Z] [INFO]   maven-checkstyle-plugin
[2019-09-16T21:50:31.422Z] [INFO]   maven-clean-plugin
[2019-09-16T21:50:31.422Z] [INFO]   maven-compiler-plugin
[2019-09-16T21:50:31.422Z] [INFO]   maven-dependency-plugin
[2019-09-16T21:50:31.422Z] [INFO]   maven-deploy-plugin
[2019-09-16T21:50:31.422Z] [INFO]   maven-doap-plugin
[2019-09-16T21:50:31.422Z] [INFO]   maven-docck-plugin
[2019-09-16T21:50:31.422Z] [INFO]   maven-ear-plugin
[2019-09-16T21:50:31.422Z] [INFO]   maven-ejb-plugin
[2019-09-16T21:50:31.422Z] [INFO]   * maven-enforcer-plugin
[2019-09-16T21:50:31.422Z] [INFO]   * maven-failsafe-plugin
[2019-09-16T21:50:31.422Z] [INFO]   maven-gpg-plugin
[2019-09-16T21:50:31.422Z] [INFO]   maven-help-plugin
[2019-09-16T21:50:31.422Z] [INFO]   maven-install-plugin
[2019-09-16T21:50:32.132Z] [INFO]   maven-invoker-plugin
[2019-09-16T21:50:32.132Z] [INFO]   maven-jar-plugin
[2019-09-16T21:50:32.132Z] [INFO]   maven-jarsigner-plugin
[2019-09-16T21:50:32.132Z] [INFO]   maven-javadoc-plugin
[2019-09-16T21:50:32.132Z] [INFO]   maven-jdeps-plugin
[2019-09-16T21:50:32.132Z] [INFO]   maven-jdeprscan-plugin
[2019-09-16T21:50:32.132Z] [INFO]   maven-jlink-plugin
[2019-09-16T21:50:32.132Z] [INFO]   maven-jmod-plugin
[2019-09-16T21:50:32.132Z] [INFO]   * maven-jxr-plugin
[2019-09-16T21:50:32.132Z] [INFO]   maven-linkcheck-plugin
[2019-09-16T21:50:32.132Z] [INFO]   maven-patch-plugin
[2019-09-16T21:50:32.132Z] [INFO]   maven-pdf-plugin
[2019-09-16T21:50:32.132Z] [INFO]   * maven-plugin-plugin
[2019-09-16T21:50:32.132Z] [INFO]   maven-pmd-plugin
[2019-09-16T21:50:32.132Z] [INFO]   maven-project-info-reports-plugin
[2019-09-16T21:50:32.132Z] [INFO]   maven-rar-plugin
[2019-09-16T21:50:32.132Z] [INFO]   * maven-release-plugin  
[2019-09-16T21:50:32.132Z] [INFO]   maven-remote-resources-plugin
[2019-09-16T21:50:32.132Z] [INFO]   maven-resources-plugin
[2019-09-16T21:50:32.132Z] [INFO]   * maven-scm-plugin
[2019-09-16T21:50:32.132Z] [INFO]   maven-scm-publish-plugin
[2019-09-16T21:50:32.132Z] [INFO]   maven-shade-plugin
[2019-09-16T21:50:32.132Z] [INFO]   maven-site-plugin
[2019-09-16T21:50:32.132Z] [INFO]   maven-source-plugin
[2019-09-16T21:50:32.132Z] [INFO]   maven-stage-plugin
[2019-09-16T21:50:32.132Z] [INFO]   * maven-surefire-plugin
[2019-09-16T21:50:32.132Z] [INFO]   * maven-surefire-report-plugin
[2019-09-16T21:50:32.132Z] [INFO]   maven-toolchains-plugin
[2019-09-16T21:50:32.132Z] [INFO]   maven-verifier-plugin
[2019-09-16T21:50:32.133Z] [INFO]   maven-war-plugin
[2019-09-16T21:50:32.133Z] [INFO] /pom: org.apache http://maven.apache.org/pom/
[2019-09-16T21:50:32.133Z] [INFO] > apache index-path = /asf/
[2019-09-16T21:50:32.133Z] [INFO] > apache site = http://maven.apache.org/pom/asf/
[2019-09-16T21:50:32.133Z] [INFO]   apache
[2019-09-16T21:50:32.133Z] [INFO] /pom: org.apache.maven http://maven.apache.org/pom/
[2019-09-16T21:50:32.133Z] [INFO] > maven-parent index-path = /maven/
[2019-09-16T21:50:32.133Z] [INFO] > maven-parent site = http://maven.apache.org/pom/maven/
[2019-09-16T21:50:32.133Z] [INFO]   maven-parent
[2019-09-16T21:50:32.133Z] [INFO] /release: org.apache.maven.release
[2019-09-16T21:50:32.133Z] [INFO]   maven-release (,3)
[2019-09-16T21:50:32.133Z] [INFO] /reporting: org.apache.maven.reporting http://maven.apache.org/shared/
[2019-09-16T21:50:32.133Z] [INFO]   maven-reporting-api
[2019-09-16T21:50:32.133Z] [INFO]   maven-reporting-exec
[2019-09-16T21:50:32.133Z] [INFO]   maven-reporting-impl
[2019-09-16T21:50:32.133Z] [INFO] /resolver: org.apache.maven.resolver
[2019-09-16T21:50:32.133Z] [INFO]   maven-resolver
[2019-09-16T21:50:32.133Z] [INFO] /resources: org.apache.apache.resources
[2019-09-16T21:50:32.133Z] [INFO] > apache-source-release-assembly-descriptor site = http://maven.apache.org/apache-resource-bundles/
[2019-09-16T21:50:32.133Z] [INFO]   apache-source-release-assembly-descriptor
[2019-09-16T21:50:32.133Z] [INFO] /resources: org.apache
[2019-09-16T21:50:32.133Z] [INFO] > apache-incubator-disclaimer-resource-bundle site = http://maven.apache.org/apache-resource-bundles/
[2019-09-16T21:50:32.133Z] [INFO]   apache-incubator-disclaimer-resource-bundle (,1.1]
[2019-09-16T21:50:32.133Z] [INFO] > apache-jar-resource-bundle site = http://maven.apache.org/apache-resource-bundles/
[2019-09-16T21:50:32.133Z] [INFO]   apache-jar-resource-bundle (,1.4]
[2019-09-16T21:50:32.133Z] [INFO] > apache-license-header-resource-bundle site = http://maven.apache.org/apache-resource-bundles/
[2019-09-16T21:50:32.133Z] [INFO]   apache-license-header-resource-bundle (,1.1]
[2019-09-16T21:50:32.133Z] [INFO] /scm: org.apache.maven.scm
[2019-09-16T21:50:32.133Z] [INFO]   maven-scm
[2019-09-16T21:50:32.133Z] [INFO] /shared: org.apache.maven.shared http://maven.apache.org/shared/
[2019-09-16T21:50:32.133Z] [INFO]   file-management
[2019-09-16T21:50:32.133Z] [INFO]   maven-common-artifact-filters
[2019-09-16T21:50:32.133Z] [INFO]   maven-dependency-analyzer
[2019-09-16T21:50:32.133Z] [INFO]   maven-dependency-tree
[2019-09-16T21:50:32.133Z] [INFO]   maven-filtering
[2019-09-16T21:50:32.133Z] [INFO]   maven-invoker
[2019-09-16T21:50:32.133Z] [INFO]   maven-jarsigner
[2019-09-16T21:50:32.133Z] [INFO]   maven-mapping
[2019-09-16T21:50:32.133Z] [INFO]   maven-script-interpreter
[2019-09-16T21:50:32.133Z] [INFO]   maven-shared-incremental
[2019-09-16T21:50:32.133Z] [INFO]   maven-shared-jar
[2019-09-16T21:50:32.133Z] [INFO]   maven-shared-resources
[2019-09-16T21:50:32.133Z] [INFO]   maven-shared-utils
[2019-09-16T21:50:32.133Z] [INFO]   maven-shared-io
[2019-09-16T21:50:32.133Z] [INFO]   maven-verifier
[2019-09-16T21:50:32.133Z] [INFO] /shared: org.apache.maven http://maven.apache.org/shared/
[2019-09-16T21:50:32.133Z] [INFO]   maven-archiver
[2019-09-16T21:50:32.133Z] [INFO] > maven-skins index-path = /skins/
[2019-09-16T21:50:32.844Z] [INFO] /skins: org.apache.maven.skins http://maven.apache.org/skins/
[2019-09-16T21:50:32.844Z] [INFO]   maven-default-skin
[2019-09-16T21:50:32.844Z] [INFO]   maven-fluido-skin
[2019-09-16T21:50:32.844Z] [INFO] /surefire: org.apache.maven.surefire
[2019-09-16T21:50:32.844Z] [INFO]   surefire
[2019-09-16T21:50:32.844Z] [INFO] /wagon: org.apache.maven.wagon
[2019-09-16T21:50:32.844Z] [INFO]   wagon
[2019-09-16T21:50:32.844Z] [INFO]
[2019-09-16T21:50:32.844Z] [INFO] Generating "Dist Tool> Check Errors" report --- dist-tool-plugin:1.0-SNAPSHOT:check-errors
[2019-09-16T21:50:32.844Z] [INFO] Generating "Dist Tool> List Plugins Prerequisites" report --- dist-tool-plugin:1.0-SNAPSHOT:list-plugins-prerequisites
[2019-09-16T21:50:46.230Z] [INFO] Generating "Dist Tool> List Master Jobs" report --- dist-tool-plugin:1.0-SNAPSHOT:list-master-jobs
[2019-09-16T21:51:52.636Z] [INFO] Generating "Dist Tool> Failure Hack" report --- dist-tool-plugin:1.0-SNAPSHOT:failure-report
[2019-09-16T21:51:52.637Z] [ERROR] check-source-release.log error log not empty:
[2019-09-16T21:51:52.637Z] Missing file for maven-invoker-plugin in http://www.apache.org/dist/maven/plugins
[2019-09-16T21:51:52.637Z]  > maven-invoker-plugin-3.2.1-source-release.zip <
[2019-09-16T21:51:52.637Z]  > maven-invoker-plugin-3.2.1-source-release.zip.asc <
[2019-09-16T21:51:52.637Z]  > maven-invoker-plugin-3.2.1-source-release.zip.sha1 or .sha512 <
[2019-09-16T21:51:52.637Z] Different version than 3.2.1 for maven-invoker-plugin available in http://www.apache.org/dist/maven/plugins
[2019-09-16T21:51:52.637Z]  > maven-invoker-plugin-3.2.0-source-release.zip <
[2019-09-16T21:51:52.637Z]  > maven-invoker-plugin-3.2.0-source-release.zip.asc <
[2019-09-16T21:51:52.637Z]  > maven-invoker-plugin-3.2.0-source-release.zip.sha512 <
[2019-09-16T21:51:52.637Z]
[2019-09-16T21:51:52.637Z] [INFO] ------------------------------------------------------------------------
[2019-09-16T21:51:52.637Z] [INFO] BUILD FAILURE
[2019-09-16T21:51:52.637Z] [INFO] ------------------------------------------------------------------------
[2019-09-16T21:51:52.637Z] [INFO] Total time:  03:36 min
[2019-09-16T21:51:52.637Z] [INFO] Finished at: 2019-09-16T21:51:50Z
[2019-09-16T21:51:52.637Z] [INFO] ------------------------------------------------------------------------
[2019-09-16T21:51:52.637Z] [WARNING] The requested profile "apache.snapshots" could not be activated because it does not exist.
[2019-09-16T21:51:52.637Z] [INFO] [jenkins-event-spy] Generated /home/jenkins/jenkins-slave/workspace/maven-box_maven-dist-tool_master@tmp/withMaven5da1af32/maven-spy-20190916-214813-576126517251033936507.log
[2019-09-16T21:51:52.637Z] [ERROR] Failed to execute goal org.apache.maven.plugins:maven-site-plugin:3.7.1:site (default-site) on project dist-tool-plugin: Error generating dist-tool-plugin:1.0-SNAPSHOT:failure-report report: Dist Tool> Checks found inconsistencies in some released artifacts, see https://builds.apache.org/job/dist-tool-plugin/site/dist-tool-check-errors.html for more information -> [Help 1]
[2019-09-16T21:51:52.637Z] org.apache.maven.lifecycle.LifecycleExecutionException: Failed to execute goal org.apache.maven.plugins:maven-site-plugin:3.7.1:site (default-site) on project dist-tool-plugin: Error generating dist-tool-plugin:1.0-SNAPSHOT:failure-report report
[2019-09-16T21:51:52.637Z]     at org.apache.maven.lifecycle.internal.MojoExecutor.execute (MojoExecutor.java:215)
[2019-09-16T21:51:52.637Z]     at org.apache.maven.lifecycle.internal.MojoExecutor.execute (MojoExecutor.java:156)
[2019-09-16T21:51:52.637Z]     at org.apache.maven.lifecycle.internal.MojoExecutor.execute (MojoExecutor.java:148)
[2019-09-16T21:51:52.637Z]     at org.apache.maven.lifecycle.internal.LifecycleModuleBuilder.buildProject (LifecycleModuleBuilder.java:117)
[2019-09-16T21:51:52.637Z]     at org.apache.maven.lifecycle.internal.LifecycleModuleBuilder.buildProject (LifecycleModuleBuilder.java:81)
[2019-09-16T21:51:52.637Z]     at org.apache.maven.lifecycle.internal.builder.singlethreaded.SingleThreadedBuilder.build (SingleThreadedBuilder.java:56)
[2019-09-16T21:51:52.637Z]     at org.apache.maven.lifecycle.internal.LifecycleStarter.execute (LifecycleStarter.java:128)
[2019-09-16T21:51:52.637Z]     at org.apache.maven.DefaultMaven.doExecute (DefaultMaven.java:305)
[2019-09-16T21:51:52.637Z]     at org.apache.maven.DefaultMaven.doExecute (DefaultMaven.java:192)
[2019-09-16T21:51:52.637Z]     at org.apache.maven.DefaultMaven.execute (DefaultMaven.java:105)
[2019-09-16T21:51:52.638Z]     at org.apache.maven.cli.MavenCli.execute (MavenCli.java:956)
[2019-09-16T21:51:52.638Z]     at org.apache.maven.cli.MavenCli.doMain (MavenCli.java:288)
[2019-09-16T21:51:52.638Z]     at org.apache.maven.cli.MavenCli.main (MavenCli.java:192)
[2019-09-16T21:51:52.638Z]     at sun.reflect.NativeMethodAccessorImpl.invoke0 (Native Method)
[2019-09-16T21:51:52.638Z]     at sun.reflect.NativeMethodAccessorImpl.invoke (NativeMethodAccessorImpl.java:62)
[2019-09-16T21:51:52.638Z]     at sun.reflect.DelegatingMethodAccessorImpl.invoke (DelegatingMethodAccessorImpl.java:43)
[2019-09-16T21:51:52.638Z]     at java.lang.reflect.Method.invoke (Method.java:498)
[2019-09-16T21:51:52.638Z]     at org.codehaus.plexus.classworlds.launcher.Launcher.launchEnhanced (Launcher.java:282)
[2019-09-16T21:51:52.638Z]     at org.codehaus.plexus.classworlds.launcher.Launcher.launch (Launcher.java:225)
[2019-09-16T21:51:52.638Z]     at org.codehaus.plexus.classworlds.launcher.Launcher.mainWithExitCode (Launcher.java:406)
[2019-09-16T21:51:52.638Z]     at org.codehaus.plexus.classworlds.launcher.Launcher.main (Launcher.java:347)
[2019-09-16T21:51:52.638Z] Caused by: org.apache.maven.plugin.MojoExecutionException: Error generating dist-tool-plugin:1.0-SNAPSHOT:failure-report report
[2019-09-16T21:51:52.638Z]     at org.apache.maven.plugins.site.render.SiteMojo.execute (SiteMojo.java:155)
[2019-09-16T21:51:52.638Z]     at org.apache.maven.plugin.DefaultBuildPluginManager.executeMojo (DefaultBuildPluginManager.java:137)
[2019-09-16T21:51:52.638Z]     at org.apache.maven.lifecycle.internal.MojoExecutor.execute (MojoExecutor.java:210)
[2019-09-16T21:51:52.638Z]     at org.apache.maven.lifecycle.internal.MojoExecutor.execute (MojoExecutor.java:156)
[2019-09-16T21:51:52.638Z]     at org.apache.maven.lifecycle.internal.MojoExecutor.execute (MojoExecutor.java:148)
[2019-09-16T21:51:52.638Z]     at org.apache.maven.lifecycle.internal.LifecycleModuleBuilder.buildProject (LifecycleModuleBuilder.java:117)
[2019-09-16T21:51:52.638Z]     at org.apache.maven.lifecycle.internal.LifecycleModuleBuilder.buildProject (LifecycleModuleBuilder.java:81)
[2019-09-16T21:51:52.638Z]     at org.apache.maven.lifecycle.internal.builder.singlethreaded.SingleThreadedBuilder.build (SingleThreadedBuilder.java:56)
[2019-09-16T21:51:52.638Z]     at org.apache.maven.lifecycle.internal.LifecycleStarter.execute (LifecycleStarter.java:128)
[2019-09-16T21:51:52.638Z]     at org.apache.maven.DefaultMaven.doExecute (DefaultMaven.java:305)
[2019-09-16T21:51:52.638Z]     at org.apache.maven.DefaultMaven.doExecute (DefaultMaven.java:192)
[2019-09-16T21:51:52.638Z]     at org.apache.maven.DefaultMaven.execute (DefaultMaven.java:105)
[2019-09-16T21:51:52.638Z]     at org.apache.maven.cli.MavenCli.execute (MavenCli.java:956)
[2019-09-16T21:51:52.638Z]     at org.apache.maven.cli.MavenCli.doMain (MavenCli.java:288)
[2019-09-16T21:51:52.638Z]     at org.apache.maven.cli.MavenCli.main (MavenCli.java:192)
[2019-09-16T21:51:52.638Z]     at sun.reflect.NativeMethodAccessorImpl.invoke0 (Native Method)
[2019-09-16T21:51:52.638Z]     at sun.reflect.NativeMethodAccessorImpl.invoke (NativeMethodAccessorImpl.java:62)
[2019-09-16T21:51:52.638Z]     at sun.reflect.DelegatingMethodAccessorImpl.invoke (DelegatingMethodAccessorImpl.java:43)
[2019-09-16T21:51:52.638Z]     at java.lang.reflect.Method.invoke (Method.java:498)
[2019-09-16T21:51:52.638Z]     at org.codehaus.plexus.classworlds.launcher.Launcher.launchEnhanced (Launcher.java:282)
[2019-09-16T21:51:52.638Z]     at org.codehaus.plexus.classworlds.launcher.Launcher.launch (Launcher.java:225)
[2019-09-16T21:51:52.638Z]     at org.codehaus.plexus.classworlds.launcher.Launcher.mainWithExitCode (Launcher.java:406)
[2019-09-16T21:51:52.638Z]     at org.codehaus.plexus.classworlds.launcher.Launcher.main (Launcher.java:347)
[2019-09-16T21:51:52.639Z] Caused by: org.apache.maven.reporting.MavenReportException: Dist Tool> Checks found inconsistencies in some released artifacts, see https://builds.apache.org/job/dist-tool-plugin/site/dist-tool-check-errors.html for more information
[2019-09-16T21:51:52.639Z]     at org.apache.maven.dist.tools.DistCheckErrorsMojo.executeReport (DistCheckErrorsMojo.java:113)
[2019-09-16T21:51:52.639Z]     at org.apache.maven.reporting.AbstractMavenReport.generate (AbstractMavenReport.java:251)
[2019-09-16T21:51:52.639Z]     at org.apache.maven.plugins.site.render.ReportDocumentRenderer.renderDocument (ReportDocumentRenderer.java:230)
[2019-09-16T21:51:52.639Z]     at org.apache.maven.doxia.siterenderer.DefaultSiteRenderer.render (DefaultSiteRenderer.java:349)
[2019-09-16T21:51:52.639Z]     at org.apache.maven.plugins.site.render.SiteMojo.renderLocale (SiteMojo.java:198)
[2019-09-16T21:51:52.639Z]     at org.apache.maven.plugins.site.render.SiteMojo.execute (SiteMojo.java:147)
[2019-09-16T21:51:52.639Z]     at org.apache.maven.plugin.DefaultBuildPluginManager.executeMojo (DefaultBuildPluginManager.java:137)
[2019-09-16T21:51:52.639Z]     at org.apache.maven.lifecycle.internal.MojoExecutor.execute (MojoExecutor.java:210)
[2019-09-16T21:51:52.639Z]     at org.apache.maven.lifecycle.internal.MojoExecutor.execute (MojoExecutor.java:156)
[2019-09-16T21:51:52.639Z]     at org.apache.maven.lifecycle.internal.MojoExecutor.execute (MojoExecutor.java:148)
[2019-09-16T21:51:52.639Z]     at org.apache.maven.lifecycle.internal.LifecycleModuleBuilder.buildProject (LifecycleModuleBuilder.java:117)
[2019-09-16T21:51:52.639Z]     at org.apache.maven.lifecycle.internal.LifecycleModuleBuilder.buildProject (LifecycleModuleBuilder.java:81)
[2019-09-16T21:51:52.639Z]     at org.apache.maven.lifecycle.internal.builder.singlethreaded.SingleThreadedBuilder.build (SingleThreadedBuilder.java:56)
[2019-09-16T21:51:52.639Z]     at org.apache.maven.lifecycle.internal.LifecycleStarter.execute (LifecycleStarter.java:128)
[2019-09-16T21:51:52.639Z]     at org.apache.maven.DefaultMaven.doExecute (DefaultMaven.java:305)
[2019-09-16T21:51:52.639Z]     at org.apache.maven.DefaultMaven.doExecute (DefaultMaven.java:192)
[2019-09-16T21:51:52.639Z]     at org.apache.maven.DefaultMaven.execute (DefaultMaven.java:105)
[2019-09-16T21:51:52.639Z]     at org.apache.maven.cli.MavenCli.execute (MavenCli.java:956)
[2019-09-16T21:51:52.639Z]     at org.apache.maven.cli.MavenCli.doMain (MavenCli.java:288)
[2019-09-16T21:51:52.639Z]     at org.apache.maven.cli.MavenCli.main (MavenCli.java:192)
[2019-09-16T21:51:52.639Z]     at sun.reflect.NativeMethodAccessorImpl.invoke0 (Native Method)
[2019-09-16T21:51:52.639Z]     at sun.reflect.NativeMethodAccessorImpl.invoke (NativeMethodAccessorImpl.java:62)
[2019-09-16T21:51:52.639Z]     at sun.reflect.DelegatingMethodAccessorImpl.invoke (DelegatingMethodAccessorImpl.java:43)
[2019-09-16T21:51:52.639Z]     at java.lang.reflect.Method.invoke (Method.java:498)
[2019-09-16T21:51:52.639Z]     at org.codehaus.plexus.classworlds.launcher.Launcher.launchEnhanced (Launcher.java:282)
[2019-09-16T21:51:52.640Z]     at org.codehaus.plexus.classworlds.launcher.Launcher.launch (Launcher.java:225)
[2019-09-16T21:51:52.640Z]     at org.codehaus.plexus.classworlds.launcher.Launcher.mainWithExitCode (Launcher.java:406)
[2019-09-16T21:51:52.640Z]     at org.codehaus.plexus.classworlds.launcher.Launcher.main (Launcher.java:347)
[2019-09-16T21:51:52.640Z] [ERROR]
[2019-09-16T21:51:52.640Z] [ERROR] Re-run Maven using the -X switch to enable full debug logging.
[2019-09-16T21:51:52.640Z] [ERROR]
[2019-09-16T21:51:52.640Z] [ERROR] For more information about the errors and possible solutions, please read the following articles:
[2019-09-16T21:51:52.640Z] [ERROR] [Help 1] http://cwiki.apache.org/confluence/display/MAVEN/MojoExecutionException
[Pipeline] }
[2019-09-16T21:51:54.377Z] [withMaven] junitPublisher - Archive test results for Maven artifact org.apache.maven.dist.tools:dist-tool-plugin:maven-plugin:1.0-SNAPSHOT generated by maven-surefire-plugin:test (default-test): target/surefire-reports/*.xml
[2019-09-16T21:51:54.378Z] [withMaven] junitPublisher - Archive test results for Maven artifact org.apache.maven.dist.tools:dist-tool-plugin:maven-plugin:1.0-SNAPSHOT generated by maven-surefire-plugin:test (default-test): target/surefire-reports/*.xml
[2019-09-16T21:51:54.378Z] Recording test results
[2019-09-16T21:51:56.240Z] [withMaven] openTasksPublisher - Scan Tasks for Maven artifact org.apache.maven.dist.tools:dist-tool-plugin:maven-plugin:1.0-SNAPSHOT in source directory src/main/java
[2019-09-16T21:51:56.416Z] [TASKS] Scanning folder '/home/jenkins/jenkins-slave/workspace/maven-box_maven-dist-tool_master' for files matching the pattern 'src/main/java/**/*' - excludes: null
[2019-09-16T21:51:56.416Z] [TASKS] Found 22 files to scan for tasks
[2019-09-16T21:51:56.416Z] [TASKS] Found 2 open tasks.
[2019-09-16T21:51:56.416Z] Skipping warnings blame since pipelines do not have an SCM link.%n
[2019-09-16T21:51:56.481Z] [TASKS] Computing warning deltas based on reference build #231
[2019-09-16T21:51:56.636Z] [withMaven] Publishers: Pipeline Graph Publisher: 3 ms, Junit Publisher: 630 ms, Open Task Scanner Publisher: 550 ms
[Pipeline] // withMaven
[Pipeline] }
[Pipeline] // stage
[Pipeline] stage
[Pipeline] { (Declarative: Post Actions)
[Pipeline] echo
[2019-09-16T21:51:57.170Z] Build result: FAILURE
[Pipeline] jiraIssueSelector
[Pipeline] echo
[2019-09-16T21:51:57.220Z] The authors of changes [].
[Pipeline] echo
[2019-09-16T21:51:57.224Z] Sending email ...
[Pipeline] emailext
Reply | Threaded
Open this post in threaded view
|

Build failed in Jenkins: Maven TLP » maven-dist-tool » master #238

Apache Jenkins Server-2
See https://builds.apache.org/job/maven-box/job/maven-dist-tool/job/master/238/

No changes.

All tests passed

Build log:
[...truncated 5030 lines...]
[2019-09-17T22:01:14.412Z] [INFO]   doxia-linkcheck
[2019-09-17T22:01:14.412Z] [INFO]   doxia-sitetools
[2019-09-17T22:01:14.412Z] [INFO] /enforcer: org.apache.maven.enforcer
[2019-09-17T22:01:14.412Z] [INFO]   enforcer
[2019-09-17T22:01:14.412Z] [INFO] /indexer: org.apache.maven.indexer
[2019-09-17T22:01:14.413Z] [INFO]   maven-indexer
[2019-09-17T22:01:14.413Z] [INFO] /maven-3: org.apache.maven src+bin
[2019-09-17T22:01:14.413Z] [INFO]   apache-maven [3.0,3.1.0-alpha-1)
[2019-09-17T22:01:14.413Z] [INFO]   apache-maven [3.1.0,3.2.0-alpha-1)
[2019-09-17T22:01:14.413Z] [INFO]   apache-maven
[2019-09-17T22:01:14.413Z] [INFO] /jxr: org.apache.maven.jxr
[2019-09-17T22:01:14.413Z] [INFO]   jxr
[2019-09-17T22:01:14.413Z] [INFO] /plugin-testing: org.apache.maven.plugin-testing
[2019-09-17T22:01:14.413Z] [INFO]   maven-plugin-testing
[2019-09-17T22:01:14.413Z] [INFO] /plugin-tools: org.apache.maven.plugin-tools
[2019-09-17T22:01:14.413Z] [INFO]   maven-plugin-tools
[2019-09-17T22:01:14.413Z] [INFO] /plugins: org.apache.maven.plugins http://maven.apache.org/plugins/
[2019-09-17T22:01:14.413Z] [INFO]   maven-acr-plugin
[2019-09-17T22:01:14.413Z] [INFO]   maven-antrun-plugin
[2019-09-17T22:01:14.413Z] [INFO]   * maven-archetype-plugin
[2019-09-17T22:01:14.413Z] [INFO]   maven-assembly-plugin
[2019-09-17T22:01:14.413Z] [INFO]   maven-changelog-plugin
[2019-09-17T22:01:14.413Z] [INFO]   maven-changes-plugin
[2019-09-17T22:01:14.413Z] [INFO]   maven-checkstyle-plugin
[2019-09-17T22:01:14.413Z] [INFO]   maven-clean-plugin
[2019-09-17T22:01:14.413Z] [INFO]   maven-compiler-plugin
[2019-09-17T22:01:14.413Z] [INFO]   maven-dependency-plugin
[2019-09-17T22:01:14.413Z] [INFO]   maven-deploy-plugin
[2019-09-17T22:01:14.413Z] [INFO]   maven-doap-plugin
[2019-09-17T22:01:14.413Z] [INFO]   maven-docck-plugin
[2019-09-17T22:01:14.413Z] [INFO]   maven-ear-plugin
[2019-09-17T22:01:14.413Z] [INFO]   maven-ejb-plugin
[2019-09-17T22:01:14.413Z] [INFO]   * maven-enforcer-plugin
[2019-09-17T22:01:14.413Z] [INFO]   * maven-failsafe-plugin
[2019-09-17T22:01:14.413Z] [INFO]   maven-gpg-plugin
[2019-09-17T22:01:14.413Z] [INFO]   maven-help-plugin
[2019-09-17T22:01:14.413Z] [INFO]   maven-install-plugin
[2019-09-17T22:01:14.413Z] [INFO]   maven-invoker-plugin
[2019-09-17T22:01:14.413Z] [INFO]   maven-jar-plugin
[2019-09-17T22:01:14.413Z] [INFO]   maven-jarsigner-plugin
[2019-09-17T22:01:14.413Z] [INFO]   maven-javadoc-plugin
[2019-09-17T22:01:14.413Z] [INFO]   maven-jdeps-plugin
[2019-09-17T22:01:14.413Z] [INFO]   maven-jdeprscan-plugin
[2019-09-17T22:01:14.413Z] [INFO]   maven-jlink-plugin
[2019-09-17T22:01:14.413Z] [INFO]   maven-jmod-plugin
[2019-09-17T22:01:14.413Z] [INFO]   * maven-jxr-plugin
[2019-09-17T22:01:14.413Z] [INFO]   maven-linkcheck-plugin
[2019-09-17T22:01:14.413Z] [INFO]   maven-patch-plugin
[2019-09-17T22:01:14.413Z] [INFO]   maven-pdf-plugin
[2019-09-17T22:01:14.413Z] [INFO]   * maven-plugin-plugin
[2019-09-17T22:01:14.413Z] [INFO]   maven-pmd-plugin
[2019-09-17T22:01:14.413Z] [INFO]   maven-project-info-reports-plugin
[2019-09-17T22:01:14.413Z] [INFO]   maven-rar-plugin
[2019-09-17T22:01:14.413Z] [INFO]   * maven-release-plugin  
[2019-09-17T22:01:14.413Z] [INFO]   maven-remote-resources-plugin
[2019-09-17T22:01:14.413Z] [INFO]   maven-resources-plugin
[2019-09-17T22:01:14.413Z] [INFO]   * maven-scm-plugin
[2019-09-17T22:01:14.413Z] [INFO]   maven-scm-publish-plugin
[2019-09-17T22:01:14.413Z] [INFO]   maven-shade-plugin
[2019-09-17T22:01:14.413Z] [INFO]   maven-site-plugin
[2019-09-17T22:01:14.413Z] [INFO]   maven-source-plugin
[2019-09-17T22:01:14.413Z] [INFO]   maven-stage-plugin
[2019-09-17T22:01:14.413Z] [INFO]   * maven-surefire-plugin
[2019-09-17T22:01:14.413Z] [INFO]   * maven-surefire-report-plugin
[2019-09-17T22:01:14.413Z] [INFO]   maven-toolchains-plugin
[2019-09-17T22:01:14.413Z] [INFO]   maven-verifier-plugin
[2019-09-17T22:01:14.413Z] [INFO]   maven-war-plugin
[2019-09-17T22:01:14.413Z] [INFO] /pom: org.apache http://maven.apache.org/pom/
[2019-09-17T22:01:14.413Z] [INFO] > apache index-path = /asf/
[2019-09-17T22:01:14.413Z] [INFO] > apache site = http://maven.apache.org/pom/asf/
[2019-09-17T22:01:14.413Z] [INFO]   apache
[2019-09-17T22:01:15.126Z] [INFO] /pom: org.apache.maven http://maven.apache.org/pom/
[2019-09-17T22:01:15.126Z] [INFO] > maven-parent index-path = /maven/
[2019-09-17T22:01:15.126Z] [INFO] > maven-parent site = http://maven.apache.org/pom/maven/
[2019-09-17T22:01:15.126Z] [INFO]   maven-parent
[2019-09-17T22:01:15.126Z] [INFO] /release: org.apache.maven.release
[2019-09-17T22:01:15.126Z] [INFO]   maven-release (,3)
[2019-09-17T22:01:15.126Z] [INFO] /reporting: org.apache.maven.reporting http://maven.apache.org/shared/
[2019-09-17T22:01:15.126Z] [INFO]   maven-reporting-api
[2019-09-17T22:01:15.126Z] [INFO]   maven-reporting-exec
[2019-09-17T22:01:15.126Z] [INFO]   maven-reporting-impl
[2019-09-17T22:01:15.126Z] [INFO] /resolver: org.apache.maven.resolver
[2019-09-17T22:01:15.126Z] [INFO]   maven-resolver
[2019-09-17T22:01:15.126Z] [INFO] /resources: org.apache.apache.resources
[2019-09-17T22:01:15.126Z] [INFO] > apache-source-release-assembly-descriptor site = http://maven.apache.org/apache-resource-bundles/
[2019-09-17T22:01:15.126Z] [INFO]   apache-source-release-assembly-descriptor
[2019-09-17T22:01:15.126Z] [INFO] /resources: org.apache
[2019-09-17T22:01:15.126Z] [INFO] > apache-incubator-disclaimer-resource-bundle site = http://maven.apache.org/apache-resource-bundles/
[2019-09-17T22:01:15.126Z] [INFO]   apache-incubator-disclaimer-resource-bundle (,1.1]
[2019-09-17T22:01:15.126Z] [INFO] > apache-jar-resource-bundle site = http://maven.apache.org/apache-resource-bundles/
[2019-09-17T22:01:15.126Z] [INFO]   apache-jar-resource-bundle (,1.4]
[2019-09-17T22:01:15.126Z] [INFO] > apache-license-header-resource-bundle site = http://maven.apache.org/apache-resource-bundles/
[2019-09-17T22:01:15.126Z] [INFO]   apache-license-header-resource-bundle (,1.1]
[2019-09-17T22:01:15.126Z] [INFO] /scm: org.apache.maven.scm
[2019-09-17T22:01:15.126Z] [INFO]   maven-scm
[2019-09-17T22:01:15.126Z] [INFO] /shared: org.apache.maven.shared http://maven.apache.org/shared/
[2019-09-17T22:01:15.126Z] [INFO]   file-management
[2019-09-17T22:01:15.126Z] [INFO]   maven-common-artifact-filters
[2019-09-17T22:01:15.126Z] [INFO]   maven-dependency-analyzer
[2019-09-17T22:01:15.126Z] [INFO]   maven-dependency-tree
[2019-09-17T22:01:15.126Z] [INFO]   maven-filtering
[2019-09-17T22:01:15.126Z] [INFO]   maven-invoker
[2019-09-17T22:01:15.126Z] [INFO]   maven-jarsigner
[2019-09-17T22:01:15.126Z] [INFO]   maven-mapping
[2019-09-17T22:01:15.126Z] [INFO]   maven-script-interpreter
[2019-09-17T22:01:15.126Z] [INFO]   maven-shared-incremental
[2019-09-17T22:01:15.126Z] [INFO]   maven-shared-jar
[2019-09-17T22:01:15.127Z] [INFO]   maven-shared-resources
[2019-09-17T22:01:15.127Z] [INFO]   maven-shared-utils
[2019-09-17T22:01:15.127Z] [INFO]   maven-shared-io
[2019-09-17T22:01:15.127Z] [INFO]   maven-verifier
[2019-09-17T22:01:15.127Z] [INFO] /shared: org.apache.maven http://maven.apache.org/shared/
[2019-09-17T22:01:15.127Z] [INFO]   maven-archiver
[2019-09-17T22:01:15.127Z] [INFO] > maven-skins index-path = /skins/
[2019-09-17T22:01:15.127Z] [INFO] /skins: org.apache.maven.skins http://maven.apache.org/skins/
[2019-09-17T22:01:15.127Z] [INFO]   maven-default-skin
[2019-09-17T22:01:15.127Z] [INFO]   maven-fluido-skin
[2019-09-17T22:01:15.127Z] [INFO] /surefire: org.apache.maven.surefire
[2019-09-17T22:01:15.127Z] [INFO]   surefire
[2019-09-17T22:01:15.127Z] [INFO] /wagon: org.apache.maven.wagon
[2019-09-17T22:01:15.127Z] [INFO]   wagon
[2019-09-17T22:01:15.127Z] [INFO]
[2019-09-17T22:01:15.127Z] [INFO] Generating "Dist Tool> Check Errors" report --- dist-tool-plugin:1.0-SNAPSHOT:check-errors
[2019-09-17T22:01:15.127Z] [INFO] Generating "Dist Tool> List Plugins Prerequisites" report --- dist-tool-plugin:1.0-SNAPSHOT:list-plugins-prerequisites
[2019-09-17T22:01:20.382Z] [INFO] Generating "Dist Tool> List Master Jobs" report --- dist-tool-plugin:1.0-SNAPSHOT:list-master-jobs
[2019-09-17T22:02:38.422Z] [INFO] Generating "Dist Tool> Failure Hack" report --- dist-tool-plugin:1.0-SNAPSHOT:failure-report
[2019-09-17T22:02:38.422Z] [ERROR] check-source-release.log error log not empty:
[2019-09-17T22:02:38.422Z] Missing file for maven-invoker-plugin in http://www.apache.org/dist/maven/plugins
[2019-09-17T22:02:38.422Z]  > maven-invoker-plugin-3.2.1-source-release.zip <
[2019-09-17T22:02:38.422Z]  > maven-invoker-plugin-3.2.1-source-release.zip.asc <
[2019-09-17T22:02:38.422Z]  > maven-invoker-plugin-3.2.1-source-release.zip.sha1 or .sha512 <
[2019-09-17T22:02:38.422Z] Different version than 3.2.1 for maven-invoker-plugin available in http://www.apache.org/dist/maven/plugins
[2019-09-17T22:02:38.422Z]  > maven-invoker-plugin-3.2.0-source-release.zip <
[2019-09-17T22:02:38.422Z]  > maven-invoker-plugin-3.2.0-source-release.zip.asc <
[2019-09-17T22:02:38.422Z]  > maven-invoker-plugin-3.2.0-source-release.zip.sha512 <
[2019-09-17T22:02:38.422Z]
[2019-09-17T22:02:38.422Z] [INFO] ------------------------------------------------------------------------
[2019-09-17T22:02:38.422Z] [INFO] BUILD FAILURE
[2019-09-17T22:02:38.422Z] [INFO] ------------------------------------------------------------------------
[2019-09-17T22:02:38.422Z] [INFO] Total time:  04:03 min
[2019-09-17T22:02:38.422Z] [INFO] Finished at: 2019-09-17T22:02:37Z
[2019-09-17T22:02:38.422Z] [INFO] ------------------------------------------------------------------------
[2019-09-17T22:02:38.422Z] [WARNING] The requested profile "apache.snapshots" could not be activated because it does not exist.
[2019-09-17T22:02:38.422Z] [INFO] [jenkins-event-spy] Generated /home/jenkins/jenkins-slave/workspace/maven-box_maven-dist-tool_master@tmp/withMaven7df85871/maven-spy-20190917-215833-6551052567297108814351.log
[2019-09-17T22:02:38.423Z] [ERROR] Failed to execute goal org.apache.maven.plugins:maven-site-plugin:3.7.1:site (default-site) on project dist-tool-plugin: Error generating dist-tool-plugin:1.0-SNAPSHOT:failure-report report: Dist Tool> Checks found inconsistencies in some released artifacts, see https://builds.apache.org/job/dist-tool-plugin/site/dist-tool-check-errors.html for more information -> [Help 1]
[2019-09-17T22:02:38.423Z] org.apache.maven.lifecycle.LifecycleExecutionException: Failed to execute goal org.apache.maven.plugins:maven-site-plugin:3.7.1:site (default-site) on project dist-tool-plugin: Error generating dist-tool-plugin:1.0-SNAPSHOT:failure-report report
[2019-09-17T22:02:38.423Z]     at org.apache.maven.lifecycle.internal.MojoExecutor.execute (MojoExecutor.java:215)
[2019-09-17T22:02:38.423Z]     at org.apache.maven.lifecycle.internal.MojoExecutor.execute (MojoExecutor.java:156)
[2019-09-17T22:02:38.423Z]     at org.apache.maven.lifecycle.internal.MojoExecutor.execute (MojoExecutor.java:148)
[2019-09-17T22:02:38.423Z]     at org.apache.maven.lifecycle.internal.LifecycleModuleBuilder.buildProject (LifecycleModuleBuilder.java:117)
[2019-09-17T22:02:38.423Z]     at org.apache.maven.lifecycle.internal.LifecycleModuleBuilder.buildProject (LifecycleModuleBuilder.java:81)
[2019-09-17T22:02:38.423Z]     at org.apache.maven.lifecycle.internal.builder.singlethreaded.SingleThreadedBuilder.build (SingleThreadedBuilder.java:56)
[2019-09-17T22:02:38.423Z]     at org.apache.maven.lifecycle.internal.LifecycleStarter.execute (LifecycleStarter.java:128)
[2019-09-17T22:02:38.423Z]     at org.apache.maven.DefaultMaven.doExecute (DefaultMaven.java:305)
[2019-09-17T22:02:38.423Z]     at org.apache.maven.DefaultMaven.doExecute (DefaultMaven.java:192)
[2019-09-17T22:02:38.423Z]     at org.apache.maven.DefaultMaven.execute (DefaultMaven.java:105)
[2019-09-17T22:02:38.423Z]     at org.apache.maven.cli.MavenCli.execute (MavenCli.java:956)
[2019-09-17T22:02:38.423Z]     at org.apache.maven.cli.MavenCli.doMain (MavenCli.java:288)
[2019-09-17T22:02:38.423Z]     at org.apache.maven.cli.MavenCli.main (MavenCli.java:192)
[2019-09-17T22:02:38.423Z]     at sun.reflect.NativeMethodAccessorImpl.invoke0 (Native Method)
[2019-09-17T22:02:38.423Z]     at sun.reflect.NativeMethodAccessorImpl.invoke (NativeMethodAccessorImpl.java:62)
[2019-09-17T22:02:38.423Z]     at sun.reflect.DelegatingMethodAccessorImpl.invoke (DelegatingMethodAccessorImpl.java:43)
[2019-09-17T22:02:38.423Z]     at java.lang.reflect.Method.invoke (Method.java:498)
[2019-09-17T22:02:38.423Z]     at org.codehaus.plexus.classworlds.launcher.Launcher.launchEnhanced (Launcher.java:282)
[2019-09-17T22:02:38.423Z]     at org.codehaus.plexus.classworlds.launcher.Launcher.launch (Launcher.java:225)
[2019-09-17T22:02:38.423Z]     at org.codehaus.plexus.classworlds.launcher.Launcher.mainWithExitCode (Launcher.java:406)
[2019-09-17T22:02:38.423Z]     at org.codehaus.plexus.classworlds.launcher.Launcher.main (Launcher.java:347)
[2019-09-17T22:02:38.423Z] Caused by: org.apache.maven.plugin.MojoExecutionException: Error generating dist-tool-plugin:1.0-SNAPSHOT:failure-report report
[2019-09-17T22:02:38.423Z]     at org.apache.maven.plugins.site.render.SiteMojo.execute (SiteMojo.java:155)
[2019-09-17T22:02:38.423Z]     at org.apache.maven.plugin.DefaultBuildPluginManager.executeMojo (DefaultBuildPluginManager.java:137)
[2019-09-17T22:02:38.423Z]     at org.apache.maven.lifecycle.internal.MojoExecutor.execute (MojoExecutor.java:210)
[2019-09-17T22:02:38.423Z]     at org.apache.maven.lifecycle.internal.MojoExecutor.execute (MojoExecutor.java:156)
[2019-09-17T22:02:38.423Z]     at org.apache.maven.lifecycle.internal.MojoExecutor.execute (MojoExecutor.java:148)
[2019-09-17T22:02:38.423Z]     at org.apache.maven.lifecycle.internal.LifecycleModuleBuilder.buildProject (LifecycleModuleBuilder.java:117)
[2019-09-17T22:02:38.423Z]     at org.apache.maven.lifecycle.internal.LifecycleModuleBuilder.buildProject (LifecycleModuleBuilder.java:81)
[2019-09-17T22:02:38.424Z]     at org.apache.maven.lifecycle.internal.builder.singlethreaded.SingleThreadedBuilder.build (SingleThreadedBuilder.java:56)
[2019-09-17T22:02:38.424Z]     at org.apache.maven.lifecycle.internal.LifecycleStarter.execute (LifecycleStarter.java:128)
[2019-09-17T22:02:38.424Z]     at org.apache.maven.DefaultMaven.doExecute (DefaultMaven.java:305)
[2019-09-17T22:02:38.424Z]     at org.apache.maven.DefaultMaven.doExecute (DefaultMaven.java:192)
[2019-09-17T22:02:38.424Z]     at org.apache.maven.DefaultMaven.execute (DefaultMaven.java:105)
[2019-09-17T22:02:38.424Z]     at org.apache.maven.cli.MavenCli.execute (MavenCli.java:956)
[2019-09-17T22:02:38.424Z]     at org.apache.maven.cli.MavenCli.doMain (MavenCli.java:288)
[2019-09-17T22:02:38.424Z]     at org.apache.maven.cli.MavenCli.main (MavenCli.java:192)
[2019-09-17T22:02:38.424Z]     at sun.reflect.NativeMethodAccessorImpl.invoke0 (Native Method)
[2019-09-17T22:02:38.424Z]     at sun.reflect.NativeMethodAccessorImpl.invoke (NativeMethodAccessorImpl.java:62)
[2019-09-17T22:02:38.424Z]     at sun.reflect.DelegatingMethodAccessorImpl.invoke (DelegatingMethodAccessorImpl.java:43)
[2019-09-17T22:02:38.424Z]     at java.lang.reflect.Method.invoke (Method.java:498)
[2019-09-17T22:02:38.424Z]     at org.codehaus.plexus.classworlds.launcher.Launcher.launchEnhanced (Launcher.java:282)
[2019-09-17T22:02:38.424Z]     at org.codehaus.plexus.classworlds.launcher.Launcher.launch (Launcher.java:225)
[2019-09-17T22:02:38.424Z]     at org.codehaus.plexus.classworlds.launcher.Launcher.mainWithExitCode (Launcher.java:406)
[2019-09-17T22:02:38.424Z]     at org.codehaus.plexus.classworlds.launcher.Launcher.main (Launcher.java:347)
[2019-09-17T22:02:38.424Z] Caused by: org.apache.maven.reporting.MavenReportException: Dist Tool> Checks found inconsistencies in some released artifacts, see https://builds.apache.org/job/dist-tool-plugin/site/dist-tool-check-errors.html for more information
[2019-09-17T22:02:38.424Z]     at org.apache.maven.dist.tools.DistCheckErrorsMojo.executeReport (DistCheckErrorsMojo.java:113)
[2019-09-17T22:02:38.424Z]     at org.apache.maven.reporting.AbstractMavenReport.generate (AbstractMavenReport.java:251)
[2019-09-17T22:02:38.424Z]     at org.apache.maven.plugins.site.render.ReportDocumentRenderer.renderDocument (ReportDocumentRenderer.java:230)
[2019-09-17T22:02:38.424Z]     at org.apache.maven.doxia.siterenderer.DefaultSiteRenderer.render (DefaultSiteRenderer.java:349)
[2019-09-17T22:02:38.424Z]     at org.apache.maven.plugins.site.render.SiteMojo.renderLocale (SiteMojo.java:198)
[2019-09-17T22:02:38.424Z]     at org.apache.maven.plugins.site.render.SiteMojo.execute (SiteMojo.java:147)
[2019-09-17T22:02:38.424Z]     at org.apache.maven.plugin.DefaultBuildPluginManager.executeMojo (DefaultBuildPluginManager.java:137)
[2019-09-17T22:02:38.424Z]     at org.apache.maven.lifecycle.internal.MojoExecutor.execute (MojoExecutor.java:210)
[2019-09-17T22:02:38.424Z]     at org.apache.maven.lifecycle.internal.MojoExecutor.execute (MojoExecutor.java:156)
[2019-09-17T22:02:38.424Z]     at org.apache.maven.lifecycle.internal.MojoExecutor.execute (MojoExecutor.java:148)
[2019-09-17T22:02:38.424Z]     at org.apache.maven.lifecycle.internal.LifecycleModuleBuilder.buildProject (LifecycleModuleBuilder.java:117)
[2019-09-17T22:02:38.424Z]     at org.apache.maven.lifecycle.internal.LifecycleModuleBuilder.buildProject (LifecycleModuleBuilder.java:81)
[2019-09-17T22:02:38.424Z]     at org.apache.maven.lifecycle.internal.builder.singlethreaded.SingleThreadedBuilder.build (SingleThreadedBuilder.java:56)
[2019-09-17T22:02:38.424Z]     at org.apache.maven.lifecycle.internal.LifecycleStarter.execute (LifecycleStarter.java:128)
[2019-09-17T22:02:38.425Z]     at org.apache.maven.DefaultMaven.doExecute (DefaultMaven.java:305)
[2019-09-17T22:02:38.425Z]     at org.apache.maven.DefaultMaven.doExecute (DefaultMaven.java:192)
[2019-09-17T22:02:38.425Z]     at org.apache.maven.DefaultMaven.execute (DefaultMaven.java:105)
[2019-09-17T22:02:38.425Z]     at org.apache.maven.cli.MavenCli.execute (MavenCli.java:956)
[2019-09-17T22:02:38.425Z]     at org.apache.maven.cli.MavenCli.doMain (MavenCli.java:288)
[2019-09-17T22:02:38.425Z]     at org.apache.maven.cli.MavenCli.main (MavenCli.java:192)
[2019-09-17T22:02:38.425Z]     at sun.reflect.NativeMethodAccessorImpl.invoke0 (Native Method)
[2019-09-17T22:02:38.425Z]     at sun.reflect.NativeMethodAccessorImpl.invoke (NativeMethodAccessorImpl.java:62)
[2019-09-17T22:02:38.425Z]     at sun.reflect.DelegatingMethodAccessorImpl.invoke (DelegatingMethodAccessorImpl.java:43)
[2019-09-17T22:02:38.425Z]     at java.lang.reflect.Method.invoke (Method.java:498)
[2019-09-17T22:02:38.425Z]     at org.codehaus.plexus.classworlds.launcher.Launcher.launchEnhanced (Launcher.java:282)
[2019-09-17T22:02:38.425Z]     at org.codehaus.plexus.classworlds.launcher.Launcher.launch (Launcher.java:225)
[2019-09-17T22:02:38.425Z]     at org.codehaus.plexus.classworlds.launcher.Launcher.mainWithExitCode (Launcher.java:406)
[2019-09-17T22:02:38.425Z]     at org.codehaus.plexus.classworlds.launcher.Launcher.main (Launcher.java:347)
[2019-09-17T22:02:38.425Z] [ERROR]
[2019-09-17T22:02:38.425Z] [ERROR] Re-run Maven using the -X switch to enable full debug logging.
[2019-09-17T22:02:38.425Z] [ERROR]
[2019-09-17T22:02:38.425Z] [ERROR] For more information about the errors and possible solutions, please read the following articles:
[2019-09-17T22:02:38.426Z] [ERROR] [Help 1] http://cwiki.apache.org/confluence/display/MAVEN/MojoExecutionException
[Pipeline] }
[2019-09-17T22:02:40.205Z] [withMaven] junitPublisher - Archive test results for Maven artifact org.apache.maven.dist.tools:dist-tool-plugin:maven-plugin:1.0-SNAPSHOT generated by maven-surefire-plugin:test (default-test): target/surefire-reports/*.xml
[2019-09-17T22:02:40.205Z] [withMaven] junitPublisher - Archive test results for Maven artifact org.apache.maven.dist.tools:dist-tool-plugin:maven-plugin:1.0-SNAPSHOT generated by maven-surefire-plugin:test (default-test): target/surefire-reports/*.xml
[2019-09-17T22:02:40.205Z] Recording test results
[2019-09-17T22:02:42.071Z] [withMaven] openTasksPublisher - Scan Tasks for Maven artifact org.apache.maven.dist.tools:dist-tool-plugin:maven-plugin:1.0-SNAPSHOT in source directory src/main/java
[2019-09-17T22:02:42.261Z] [TASKS] Scanning folder '/home/jenkins/jenkins-slave/workspace/maven-box_maven-dist-tool_master' for files matching the pattern 'src/main/java/**/*' - excludes: null
[2019-09-17T22:02:42.261Z] [TASKS] Found 22 files to scan for tasks
[2019-09-17T22:02:42.261Z] [TASKS] Found 2 open tasks.
[2019-09-17T22:02:42.261Z] Skipping warnings blame since pipelines do not have an SCM link.%n
[2019-09-17T22:02:42.300Z] [TASKS] Computing warning deltas based on reference build #231
[2019-09-17T22:02:42.455Z] [withMaven] Publishers: Pipeline Graph Publisher: 41 ms, Invoker Publisher: 1 ms, Junit Publisher: 631 ms, Dependencies Fingerprint Publisher: 2 ms, JGiven Publisher: 1 ms, Open Task Scanner Publisher: 539 ms
[Pipeline] // withMaven
[Pipeline] }
[Pipeline] // stage
[Pipeline] stage
[Pipeline] { (Declarative: Post Actions)
[Pipeline] echo
[2019-09-17T22:02:43.061Z] Build result: FAILURE
[Pipeline] jiraIssueSelector
[Pipeline] echo
[2019-09-17T22:02:43.112Z] The authors of changes [].
[Pipeline] echo
[2019-09-17T22:02:43.118Z] Sending email ...
[Pipeline] emailext
Reply | Threaded
Open this post in threaded view
|

Build failed in Jenkins: Maven TLP » maven-dist-tool » master #239

Apache Jenkins Server-2
See https://builds.apache.org/job/maven-box/job/maven-dist-tool/job/master/239/

No changes.

All tests passed

Build log:
[...truncated 5032 lines...]
[2019-09-18T21:50:12.595Z] [INFO]   doxia-linkcheck
[2019-09-18T21:50:12.595Z] [INFO]   doxia-sitetools
[2019-09-18T21:50:12.595Z] [INFO] /enforcer: org.apache.maven.enforcer
[2019-09-18T21:50:12.595Z] [INFO]   enforcer
[2019-09-18T21:50:12.595Z] [INFO] /indexer: org.apache.maven.indexer
[2019-09-18T21:50:12.595Z] [INFO]   maven-indexer
[2019-09-18T21:50:12.595Z] [INFO] /maven-3: org.apache.maven src+bin
[2019-09-18T21:50:12.595Z] [INFO]   apache-maven [3.0,3.1.0-alpha-1)
[2019-09-18T21:50:12.595Z] [INFO]   apache-maven [3.1.0,3.2.0-alpha-1)
[2019-09-18T21:50:12.595Z] [INFO]   apache-maven
[2019-09-18T21:50:12.595Z] [INFO] /jxr: org.apache.maven.jxr
[2019-09-18T21:50:12.595Z] [INFO]   jxr
[2019-09-18T21:50:12.595Z] [INFO] /plugin-testing: org.apache.maven.plugin-testing
[2019-09-18T21:50:12.595Z] [INFO]   maven-plugin-testing
[2019-09-18T21:50:12.595Z] [INFO] /plugin-tools: org.apache.maven.plugin-tools
[2019-09-18T21:50:12.595Z] [INFO]   maven-plugin-tools
[2019-09-18T21:50:12.595Z] [INFO] /plugins: org.apache.maven.plugins http://maven.apache.org/plugins/
[2019-09-18T21:50:12.595Z] [INFO]   maven-acr-plugin
[2019-09-18T21:50:12.595Z] [INFO]   maven-antrun-plugin
[2019-09-18T21:50:12.595Z] [INFO]   * maven-archetype-plugin
[2019-09-18T21:50:12.595Z] [INFO]   maven-assembly-plugin
[2019-09-18T21:50:12.595Z] [INFO]   maven-changelog-plugin
[2019-09-18T21:50:12.595Z] [INFO]   maven-changes-plugin
[2019-09-18T21:50:12.595Z] [INFO]   maven-checkstyle-plugin
[2019-09-18T21:50:12.595Z] [INFO]   maven-clean-plugin
[2019-09-18T21:50:12.595Z] [INFO]   maven-compiler-plugin
[2019-09-18T21:50:12.595Z] [INFO]   maven-dependency-plugin
[2019-09-18T21:50:12.595Z] [INFO]   maven-deploy-plugin
[2019-09-18T21:50:12.595Z] [INFO]   maven-doap-plugin
[2019-09-18T21:50:12.595Z] [INFO]   maven-docck-plugin
[2019-09-18T21:50:12.595Z] [INFO]   maven-ear-plugin
[2019-09-18T21:50:12.595Z] [INFO]   maven-ejb-plugin
[2019-09-18T21:50:12.595Z] [INFO]   * maven-enforcer-plugin
[2019-09-18T21:50:12.595Z] [INFO]   * maven-failsafe-plugin
[2019-09-18T21:50:12.595Z] [INFO]   maven-gpg-plugin
[2019-09-18T21:50:12.595Z] [INFO]   maven-help-plugin
[2019-09-18T21:50:12.595Z] [INFO]   maven-install-plugin
[2019-09-18T21:50:12.595Z] [INFO]   maven-invoker-plugin
[2019-09-18T21:50:12.595Z] [INFO]   maven-jar-plugin
[2019-09-18T21:50:12.595Z] [INFO]   maven-jarsigner-plugin
[2019-09-18T21:50:12.595Z] [INFO]   maven-javadoc-plugin
[2019-09-18T21:50:12.595Z] [INFO]   maven-jdeps-plugin
[2019-09-18T21:50:12.595Z] [INFO]   maven-jdeprscan-plugin
[2019-09-18T21:50:12.595Z] [INFO]   maven-jlink-plugin
[2019-09-18T21:50:12.595Z] [INFO]   maven-jmod-plugin
[2019-09-18T21:50:12.595Z] [INFO]   * maven-jxr-plugin
[2019-09-18T21:50:12.595Z] [INFO]   maven-linkcheck-plugin
[2019-09-18T21:50:12.595Z] [INFO]   maven-patch-plugin
[2019-09-18T21:50:12.595Z] [INFO]   maven-pdf-plugin
[2019-09-18T21:50:12.595Z] [INFO]   * maven-plugin-plugin
[2019-09-18T21:50:12.595Z] [INFO]   maven-pmd-plugin
[2019-09-18T21:50:12.595Z] [INFO]   maven-project-info-reports-plugin
[2019-09-18T21:50:12.595Z] [INFO]   maven-rar-plugin
[2019-09-18T21:50:12.595Z] [INFO]   * maven-release-plugin  
[2019-09-18T21:50:12.595Z] [INFO]   maven-remote-resources-plugin
[2019-09-18T21:50:12.595Z] [INFO]   maven-resources-plugin
[2019-09-18T21:50:12.595Z] [INFO]   * maven-scm-plugin
[2019-09-18T21:50:12.595Z] [INFO]   maven-scm-publish-plugin
[2019-09-18T21:50:12.595Z] [INFO]   maven-shade-plugin
[2019-09-18T21:50:13.308Z] [INFO]   maven-site-plugin
[2019-09-18T21:50:13.308Z] [INFO]   maven-source-plugin
[2019-09-18T21:50:13.308Z] [INFO]   maven-stage-plugin
[2019-09-18T21:50:13.308Z] [INFO]   * maven-surefire-plugin
[2019-09-18T21:50:13.308Z] [INFO]   * maven-surefire-report-plugin
[2019-09-18T21:50:13.308Z] [INFO]   maven-toolchains-plugin
[2019-09-18T21:50:13.308Z] [INFO]   maven-verifier-plugin
[2019-09-18T21:50:13.308Z] [INFO]   maven-war-plugin
[2019-09-18T21:50:13.308Z] [INFO] /pom: org.apache http://maven.apache.org/pom/
[2019-09-18T21:50:13.308Z] [INFO] > apache index-path = /asf/
[2019-09-18T21:50:13.308Z] [INFO] > apache site = http://maven.apache.org/pom/asf/
[2019-09-18T21:50:13.308Z] [INFO]   apache
[2019-09-18T21:50:13.308Z] [INFO] /pom: org.apache.maven http://maven.apache.org/pom/
[2019-09-18T21:50:13.308Z] [INFO] > maven-parent index-path = /maven/
[2019-09-18T21:50:13.308Z] [INFO] > maven-parent site = http://maven.apache.org/pom/maven/
[2019-09-18T21:50:13.308Z] [INFO]   maven-parent
[2019-09-18T21:50:13.308Z] [INFO] /release: org.apache.maven.release
[2019-09-18T21:50:13.308Z] [INFO]   maven-release (,3)
[2019-09-18T21:50:13.308Z] [INFO] /reporting: org.apache.maven.reporting http://maven.apache.org/shared/
[2019-09-18T21:50:13.308Z] [INFO]   maven-reporting-api
[2019-09-18T21:50:13.308Z] [INFO]   maven-reporting-exec
[2019-09-18T21:50:13.308Z] [INFO]   maven-reporting-impl
[2019-09-18T21:50:13.308Z] [INFO] /resolver: org.apache.maven.resolver
[2019-09-18T21:50:13.308Z] [INFO]   maven-resolver
[2019-09-18T21:50:13.308Z] [INFO] /resources: org.apache.apache.resources
[2019-09-18T21:50:13.308Z] [INFO] > apache-source-release-assembly-descriptor site = http://maven.apache.org/apache-resource-bundles/
[2019-09-18T21:50:13.308Z] [INFO]   apache-source-release-assembly-descriptor
[2019-09-18T21:50:13.308Z] [INFO] /resources: org.apache
[2019-09-18T21:50:13.308Z] [INFO] > apache-incubator-disclaimer-resource-bundle site = http://maven.apache.org/apache-resource-bundles/
[2019-09-18T21:50:13.308Z] [INFO]   apache-incubator-disclaimer-resource-bundle (,1.1]
[2019-09-18T21:50:13.308Z] [INFO] > apache-jar-resource-bundle site = http://maven.apache.org/apache-resource-bundles/
[2019-09-18T21:50:13.308Z] [INFO]   apache-jar-resource-bundle (,1.4]
[2019-09-18T21:50:13.309Z] [INFO] > apache-license-header-resource-bundle site = http://maven.apache.org/apache-resource-bundles/
[2019-09-18T21:50:13.309Z] [INFO]   apache-license-header-resource-bundle (,1.1]
[2019-09-18T21:50:13.309Z] [INFO] /scm: org.apache.maven.scm
[2019-09-18T21:50:13.309Z] [INFO]   maven-scm
[2019-09-18T21:50:13.309Z] [INFO] /shared: org.apache.maven.shared http://maven.apache.org/shared/
[2019-09-18T21:50:13.309Z] [INFO]   file-management
[2019-09-18T21:50:13.309Z] [INFO]   maven-common-artifact-filters
[2019-09-18T21:50:13.309Z] [INFO]   maven-dependency-analyzer
[2019-09-18T21:50:13.309Z] [INFO]   maven-dependency-tree
[2019-09-18T21:50:13.309Z] [INFO]   maven-filtering
[2019-09-18T21:50:13.309Z] [INFO]   maven-invoker
[2019-09-18T21:50:13.309Z] [INFO]   maven-jarsigner
[2019-09-18T21:50:13.309Z] [INFO]   maven-mapping
[2019-09-18T21:50:13.309Z] [INFO]   maven-script-interpreter
[2019-09-18T21:50:13.309Z] [INFO]   maven-shared-incremental
[2019-09-18T21:50:13.309Z] [INFO]   maven-shared-jar
[2019-09-18T21:50:13.309Z] [INFO]   maven-shared-resources
[2019-09-18T21:50:13.309Z] [INFO]   maven-shared-utils
[2019-09-18T21:50:13.309Z] [INFO]   maven-shared-io
[2019-09-18T21:50:13.309Z] [INFO]   maven-verifier
[2019-09-18T21:50:13.309Z] [INFO] /shared: org.apache.maven http://maven.apache.org/shared/
[2019-09-18T21:50:13.309Z] [INFO]   maven-archiver
[2019-09-18T21:50:13.309Z] [INFO] > maven-skins index-path = /skins/
[2019-09-18T21:50:13.309Z] [INFO] /skins: org.apache.maven.skins http://maven.apache.org/skins/
[2019-09-18T21:50:13.309Z] [INFO]   maven-default-skin
[2019-09-18T21:50:13.309Z] [INFO]   maven-fluido-skin
[2019-09-18T21:50:13.309Z] [INFO] /surefire: org.apache.maven.surefire
[2019-09-18T21:50:13.309Z] [INFO]   surefire
[2019-09-18T21:50:13.309Z] [INFO] /wagon: org.apache.maven.wagon
[2019-09-18T21:50:13.309Z] [INFO]   wagon
[2019-09-18T21:50:13.309Z] [INFO]
[2019-09-18T21:50:13.309Z] [INFO] Generating "Dist Tool> Check Errors" report --- dist-tool-plugin:1.0-SNAPSHOT:check-errors
[2019-09-18T21:50:13.309Z] [INFO] Generating "Dist Tool> List Plugins Prerequisites" report --- dist-tool-plugin:1.0-SNAPSHOT:list-plugins-prerequisites
[2019-09-18T21:50:18.755Z] [INFO] Generating "Dist Tool> List Master Jobs" report --- dist-tool-plugin:1.0-SNAPSHOT:list-master-jobs
[2019-09-18T21:51:37.116Z] [INFO] Generating "Dist Tool> Failure Hack" report --- dist-tool-plugin:1.0-SNAPSHOT:failure-report
[2019-09-18T21:51:37.116Z] [ERROR] check-source-release.log error log not empty:
[2019-09-18T21:51:37.117Z] Missing file for maven-invoker-plugin in http://www.apache.org/dist/maven/plugins
[2019-09-18T21:51:37.117Z]  > maven-invoker-plugin-3.2.1-source-release.zip <
[2019-09-18T21:51:37.117Z]  > maven-invoker-plugin-3.2.1-source-release.zip.asc <
[2019-09-18T21:51:37.117Z]  > maven-invoker-plugin-3.2.1-source-release.zip.sha1 or .sha512 <
[2019-09-18T21:51:37.117Z] Different version than 3.2.1 for maven-invoker-plugin available in http://www.apache.org/dist/maven/plugins
[2019-09-18T21:51:37.117Z]  > maven-invoker-plugin-3.2.0-source-release.zip <
[2019-09-18T21:51:37.117Z]  > maven-invoker-plugin-3.2.0-source-release.zip.asc <
[2019-09-18T21:51:37.117Z]  > maven-invoker-plugin-3.2.0-source-release.zip.sha512 <
[2019-09-18T21:51:37.117Z]
[2019-09-18T21:51:37.117Z] [INFO] ------------------------------------------------------------------------
[2019-09-18T21:51:37.117Z] [INFO] BUILD FAILURE
[2019-09-18T21:51:37.117Z] [INFO] ------------------------------------------------------------------------
[2019-09-18T21:51:37.117Z] [INFO] Total time:  03:24 min
[2019-09-18T21:51:37.117Z] [INFO] Finished at: 2019-09-18T21:50:30Z
[2019-09-18T21:51:37.117Z] [INFO] ------------------------------------------------------------------------
[2019-09-18T21:51:37.117Z] [WARNING] The requested profile "apache.snapshots" could not be activated because it does not exist.
[2019-09-18T21:51:37.117Z] [INFO] [jenkins-event-spy] Generated /home/jenkins/jenkins-slave/workspace/maven-box_maven-dist-tool_master@tmp/withMaven92c8e961/maven-spy-20190918-214706-1242052113269757005487.log
[2019-09-18T21:51:37.117Z] [ERROR] Failed to execute goal org.apache.maven.plugins:maven-site-plugin:3.7.1:site (default-site) on project dist-tool-plugin: Error generating dist-tool-plugin:1.0-SNAPSHOT:failure-report report: Dist Tool> Checks found inconsistencies in some released artifacts, see https://builds.apache.org/job/dist-tool-plugin/site/dist-tool-check-errors.html for more information -> [Help 1]
[2019-09-18T21:51:37.117Z] org.apache.maven.lifecycle.LifecycleExecutionException: Failed to execute goal org.apache.maven.plugins:maven-site-plugin:3.7.1:site (default-site) on project dist-tool-plugin: Error generating dist-tool-plugin:1.0-SNAPSHOT:failure-report report
[2019-09-18T21:51:37.117Z]     at org.apache.maven.lifecycle.internal.MojoExecutor.execute (MojoExecutor.java:215)
[2019-09-18T21:51:37.117Z]     at org.apache.maven.lifecycle.internal.MojoExecutor.execute (MojoExecutor.java:156)
[2019-09-18T21:51:37.117Z]     at org.apache.maven.lifecycle.internal.MojoExecutor.execute (MojoExecutor.java:148)
[2019-09-18T21:51:37.117Z]     at org.apache.maven.lifecycle.internal.LifecycleModuleBuilder.buildProject (LifecycleModuleBuilder.java:117)
[2019-09-18T21:51:37.117Z]     at org.apache.maven.lifecycle.internal.LifecycleModuleBuilder.buildProject (LifecycleModuleBuilder.java:81)
[2019-09-18T21:51:37.117Z]     at org.apache.maven.lifecycle.internal.builder.singlethreaded.SingleThreadedBuilder.build (SingleThreadedBuilder.java:56)
[2019-09-18T21:51:37.117Z]     at org.apache.maven.lifecycle.internal.LifecycleStarter.execute (LifecycleStarter.java:128)
[2019-09-18T21:51:37.117Z]     at org.apache.maven.DefaultMaven.doExecute (DefaultMaven.java:305)
[2019-09-18T21:51:37.117Z]     at org.apache.maven.DefaultMaven.doExecute (DefaultMaven.java:192)
[2019-09-18T21:51:37.117Z]     at org.apache.maven.DefaultMaven.execute (DefaultMaven.java:105)
[2019-09-18T21:51:37.117Z]     at org.apache.maven.cli.MavenCli.execute (MavenCli.java:956)
[2019-09-18T21:51:37.118Z]     at org.apache.maven.cli.MavenCli.doMain (MavenCli.java:288)
[2019-09-18T21:51:37.118Z]     at org.apache.maven.cli.MavenCli.main (MavenCli.java:192)
[2019-09-18T21:51:37.118Z]     at sun.reflect.NativeMethodAccessorImpl.invoke0 (Native Method)
[2019-09-18T21:51:37.118Z]     at sun.reflect.NativeMethodAccessorImpl.invoke (NativeMethodAccessorImpl.java:62)
[2019-09-18T21:51:37.118Z]     at sun.reflect.DelegatingMethodAccessorImpl.invoke (DelegatingMethodAccessorImpl.java:43)
[2019-09-18T21:51:37.118Z]     at java.lang.reflect.Method.invoke (Method.java:498)
[2019-09-18T21:51:37.118Z]     at org.codehaus.plexus.classworlds.launcher.Launcher.launchEnhanced (Launcher.java:289)
[2019-09-18T21:51:37.118Z]     at org.codehaus.plexus.classworlds.launcher.Launcher.launch (Launcher.java:229)
[2019-09-18T21:51:37.118Z]     at org.codehaus.plexus.classworlds.launcher.Launcher.mainWithExitCode (Launcher.java:415)
[2019-09-18T21:51:37.118Z]     at org.codehaus.plexus.classworlds.launcher.Launcher.main (Launcher.java:356)
[2019-09-18T21:51:37.118Z] Caused by: org.apache.maven.plugin.MojoExecutionException: Error generating dist-tool-plugin:1.0-SNAPSHOT:failure-report report
[2019-09-18T21:51:37.118Z]     at org.apache.maven.plugins.site.render.SiteMojo.execute (SiteMojo.java:155)
[2019-09-18T21:51:37.118Z]     at org.apache.maven.plugin.DefaultBuildPluginManager.executeMojo (DefaultBuildPluginManager.java:137)
[2019-09-18T21:51:37.118Z]     at org.apache.maven.lifecycle.internal.MojoExecutor.execute (MojoExecutor.java:210)
[2019-09-18T21:51:37.118Z]     at org.apache.maven.lifecycle.internal.MojoExecutor.execute (MojoExecutor.java:156)
[2019-09-18T21:51:37.118Z]     at org.apache.maven.lifecycle.internal.MojoExecutor.execute (MojoExecutor.java:148)
[2019-09-18T21:51:37.118Z]     at org.apache.maven.lifecycle.internal.LifecycleModuleBuilder.buildProject (LifecycleModuleBuilder.java:117)
[2019-09-18T21:51:37.118Z]     at org.apache.maven.lifecycle.internal.LifecycleModuleBuilder.buildProject (LifecycleModuleBuilder.java:81)
[2019-09-18T21:51:37.118Z]     at org.apache.maven.lifecycle.internal.builder.singlethreaded.SingleThreadedBuilder.build (SingleThreadedBuilder.java:56)
[2019-09-18T21:51:37.118Z]     at org.apache.maven.lifecycle.internal.LifecycleStarter.execute (LifecycleStarter.java:128)
[2019-09-18T21:51:37.118Z]     at org.apache.maven.DefaultMaven.doExecute (DefaultMaven.java:305)
[2019-09-18T21:51:37.118Z]     at org.apache.maven.DefaultMaven.doExecute (DefaultMaven.java:192)
[2019-09-18T21:51:37.118Z]     at org.apache.maven.DefaultMaven.execute (DefaultMaven.java:105)
[2019-09-18T21:51:37.118Z]     at org.apache.maven.cli.MavenCli.execute (MavenCli.java:956)
[2019-09-18T21:51:37.118Z]     at org.apache.maven.cli.MavenCli.doMain (MavenCli.java:288)
[2019-09-18T21:51:37.118Z]     at org.apache.maven.cli.MavenCli.main (MavenCli.java:192)
[2019-09-18T21:51:37.118Z]     at sun.reflect.NativeMethodAccessorImpl.invoke0 (Native Method)
[2019-09-18T21:51:37.118Z]     at sun.reflect.NativeMethodAccessorImpl.invoke (NativeMethodAccessorImpl.java:62)
[2019-09-18T21:51:37.118Z]     at sun.reflect.DelegatingMethodAccessorImpl.invoke (DelegatingMethodAccessorImpl.java:43)
[2019-09-18T21:51:37.118Z]     at java.lang.reflect.Method.invoke (Method.java:498)
[2019-09-18T21:51:37.118Z]     at org.codehaus.plexus.classworlds.launcher.Launcher.launchEnhanced (Launcher.java:289)
[2019-09-18T21:51:37.118Z]     at org.codehaus.plexus.classworlds.launcher.Launcher.launch (Launcher.java:229)
[2019-09-18T21:51:37.118Z]     at org.codehaus.plexus.classworlds.launcher.Launcher.mainWithExitCode (Launcher.java:415)
[2019-09-18T21:51:37.118Z]     at org.codehaus.plexus.classworlds.launcher.Launcher.main (Launcher.java:356)
[2019-09-18T21:51:37.118Z] Caused by: org.apache.maven.reporting.MavenReportException: Dist Tool> Checks found inconsistencies in some released artifacts, see https://builds.apache.org/job/dist-tool-plugin/site/dist-tool-check-errors.html for more information
[2019-09-18T21:51:37.119Z]     at org.apache.maven.dist.tools.DistCheckErrorsMojo.executeReport (DistCheckErrorsMojo.java:113)
[2019-09-18T21:51:37.119Z]     at org.apache.maven.reporting.AbstractMavenReport.generate (AbstractMavenReport.java:251)
[2019-09-18T21:51:37.119Z]     at org.apache.maven.plugins.site.render.ReportDocumentRenderer.renderDocument (ReportDocumentRenderer.java:230)
[2019-09-18T21:51:37.119Z]     at org.apache.maven.doxia.siterenderer.DefaultSiteRenderer.render (DefaultSiteRenderer.java:349)
[2019-09-18T21:51:37.119Z]     at org.apache.maven.plugins.site.render.SiteMojo.renderLocale (SiteMojo.java:198)
[2019-09-18T21:51:37.119Z]     at org.apache.maven.plugins.site.render.SiteMojo.execute (SiteMojo.java:147)
[2019-09-18T21:51:37.119Z]     at org.apache.maven.plugin.DefaultBuildPluginManager.executeMojo (DefaultBuildPluginManager.java:137)
[2019-09-18T21:51:37.119Z]     at org.apache.maven.lifecycle.internal.MojoExecutor.execute (MojoExecutor.java:210)
[2019-09-18T21:51:37.119Z]     at org.apache.maven.lifecycle.internal.MojoExecutor.execute (MojoExecutor.java:156)
[2019-09-18T21:51:37.119Z]     at org.apache.maven.lifecycle.internal.MojoExecutor.execute (MojoExecutor.java:148)
[2019-09-18T21:51:37.119Z]     at org.apache.maven.lifecycle.internal.LifecycleModuleBuilder.buildProject (LifecycleModuleBuilder.java:117)
[2019-09-18T21:51:37.119Z]     at org.apache.maven.lifecycle.internal.LifecycleModuleBuilder.buildProject (LifecycleModuleBuilder.java:81)
[2019-09-18T21:51:37.119Z]     at org.apache.maven.lifecycle.internal.builder.singlethreaded.SingleThreadedBuilder.build (SingleThreadedBuilder.java:56)
[2019-09-18T21:51:37.119Z]     at org.apache.maven.lifecycle.internal.LifecycleStarter.execute (LifecycleStarter.java:128)
[2019-09-18T21:51:37.119Z]     at org.apache.maven.DefaultMaven.doExecute (DefaultMaven.java:305)
[2019-09-18T21:51:37.119Z]     at org.apache.maven.DefaultMaven.doExecute (DefaultMaven.java:192)
[2019-09-18T21:51:37.119Z]     at org.apache.maven.DefaultMaven.execute (DefaultMaven.java:105)
[2019-09-18T21:51:37.119Z]     at org.apache.maven.cli.MavenCli.execute (MavenCli.java:956)
[2019-09-18T21:51:37.119Z]     at org.apache.maven.cli.MavenCli.doMain (MavenCli.java:288)
[2019-09-18T21:51:37.119Z]     at org.apache.maven.cli.MavenCli.main (MavenCli.java:192)
[2019-09-18T21:51:37.119Z]     at sun.reflect.NativeMethodAccessorImpl.invoke0 (Native Method)
[2019-09-18T21:51:37.119Z]     at sun.reflect.NativeMethodAccessorImpl.invoke (NativeMethodAccessorImpl.java:62)
[2019-09-18T21:51:37.119Z]     at sun.reflect.DelegatingMethodAccessorImpl.invoke (DelegatingMethodAccessorImpl.java:43)
[2019-09-18T21:51:37.119Z]     at java.lang.reflect.Method.invoke (Method.java:498)
[2019-09-18T21:51:37.119Z]     at org.codehaus.plexus.classworlds.launcher.Launcher.launchEnhanced (Launcher.java:289)
[2019-09-18T21:51:37.120Z]     at org.codehaus.plexus.classworlds.launcher.Launcher.launch (Launcher.java:229)
[2019-09-18T21:51:37.120Z]     at org.codehaus.plexus.classworlds.launcher.Launcher.mainWithExitCode (Launcher.java:415)
[2019-09-18T21:51:37.120Z]     at org.codehaus.plexus.classworlds.launcher.Launcher.main (Launcher.java:356)
[2019-09-18T21:51:37.120Z] [ERROR]
[2019-09-18T21:51:37.120Z] [ERROR] Re-run Maven using the -X switch to enable full debug logging.
[2019-09-18T21:51:37.120Z] [ERROR]
[2019-09-18T21:51:37.120Z] [ERROR] For more information about the errors and possible solutions, please read the following articles:
[2019-09-18T21:51:37.120Z] [ERROR] [Help 1] http://cwiki.apache.org/confluence/display/MAVEN/MojoExecutionException
[Pipeline] }
[2019-09-18T21:51:39.577Z] [withMaven] junitPublisher - Archive test results for Maven artifact org.apache.maven.dist.tools:dist-tool-plugin:maven-plugin:1.0-SNAPSHOT generated by maven-surefire-plugin:test (default-test): target/surefire-reports/*.xml
[2019-09-18T21:51:39.577Z] [withMaven] junitPublisher - Archive test results for Maven artifact org.apache.maven.dist.tools:dist-tool-plugin:maven-plugin:1.0-SNAPSHOT generated by maven-surefire-plugin:test (default-test): target/surefire-reports/*.xml
[2019-09-18T21:51:39.578Z] Recording test results
[2019-09-18T21:51:41.451Z] [withMaven] openTasksPublisher - Scan Tasks for Maven artifact org.apache.maven.dist.tools:dist-tool-plugin:maven-plugin:1.0-SNAPSHOT in source directory src/main/java
[2019-09-18T21:51:41.629Z] [TASKS] Scanning folder '/home/jenkins/jenkins-slave/workspace/maven-box_maven-dist-tool_master' for files matching the pattern 'src/main/java/**/*' - excludes: null
[2019-09-18T21:51:41.629Z] [TASKS] Found 22 files to scan for tasks
[2019-09-18T21:51:41.629Z] [TASKS] Found 2 open tasks.
[2019-09-18T21:51:41.629Z] Skipping warnings blame since pipelines do not have an SCM link.%n
[2019-09-18T21:51:41.670Z] [TASKS] Computing warning deltas based on reference build #231
[2019-09-18T21:51:41.825Z] [withMaven] Publishers: Pipeline Graph Publisher: 4 ms, Junit Publisher: 628 ms, Dependencies Fingerprint Publisher: 1 ms, Open Task Scanner Publisher: 527 ms
[Pipeline] // withMaven
[Pipeline] }
[Pipeline] // stage
[Pipeline] stage
[Pipeline] { (Declarative: Post Actions)
[Pipeline] echo
[2019-09-18T21:51:42.403Z] Build result: FAILURE
[Pipeline] jiraIssueSelector
[Pipeline] echo
[2019-09-18T21:51:42.439Z] The authors of changes [].
[Pipeline] echo
[2019-09-18T21:51:42.445Z] Sending email ...
[Pipeline] emailext
Reply | Threaded
Open this post in threaded view
|

Build failed in Jenkins: Maven TLP » maven-dist-tool » master #240

Apache Jenkins Server-2
See https://builds.apache.org/job/maven-box/job/maven-dist-tool/job/master/240/

No changes.

All tests passed

Build log:
[...truncated 5040 lines...]
[2019-09-19T21:54:52.943Z] [INFO]   doxia-linkcheck
[2019-09-19T21:54:52.943Z] [INFO]   doxia-sitetools
[2019-09-19T21:54:52.943Z] [INFO] /enforcer: org.apache.maven.enforcer
[2019-09-19T21:54:52.943Z] [INFO]   enforcer
[2019-09-19T21:54:52.943Z] [INFO] /indexer: org.apache.maven.indexer
[2019-09-19T21:54:52.943Z] [INFO]   maven-indexer
[2019-09-19T21:54:52.943Z] [INFO] /maven-3: org.apache.maven src+bin
[2019-09-19T21:54:52.943Z] [INFO]   apache-maven [3.0,3.1.0-alpha-1)
[2019-09-19T21:54:52.943Z] [INFO]   apache-maven [3.1.0,3.2.0-alpha-1)
[2019-09-19T21:54:52.943Z] [INFO]   apache-maven
[2019-09-19T21:54:52.943Z] [INFO] /jxr: org.apache.maven.jxr
[2019-09-19T21:54:52.943Z] [INFO]   jxr
[2019-09-19T21:54:52.943Z] [INFO] /plugin-testing: org.apache.maven.plugin-testing
[2019-09-19T21:54:52.943Z] [INFO]   maven-plugin-testing
[2019-09-19T21:54:52.943Z] [INFO] /plugin-tools: org.apache.maven.plugin-tools
[2019-09-19T21:54:52.943Z] [INFO]   maven-plugin-tools
[2019-09-19T21:54:52.943Z] [INFO] /plugins: org.apache.maven.plugins http://maven.apache.org/plugins/
[2019-09-19T21:54:52.943Z] [INFO]   maven-acr-plugin
[2019-09-19T21:54:52.943Z] [INFO]   maven-antrun-plugin
[2019-09-19T21:54:52.943Z] [INFO]   * maven-archetype-plugin
[2019-09-19T21:54:52.943Z] [INFO]   maven-assembly-plugin
[2019-09-19T21:54:52.943Z] [INFO]   maven-changelog-plugin
[2019-09-19T21:54:52.943Z] [INFO]   maven-changes-plugin
[2019-09-19T21:54:52.943Z] [INFO]   maven-checkstyle-plugin
[2019-09-19T21:54:52.943Z] [INFO]   maven-clean-plugin
[2019-09-19T21:54:52.943Z] [INFO]   maven-compiler-plugin
[2019-09-19T21:54:52.943Z] [INFO]   maven-dependency-plugin
[2019-09-19T21:54:52.943Z] [INFO]   maven-deploy-plugin
[2019-09-19T21:54:52.943Z] [INFO]   maven-doap-plugin
[2019-09-19T21:54:52.943Z] [INFO]   maven-docck-plugin
[2019-09-19T21:54:52.943Z] [INFO]   maven-ear-plugin
[2019-09-19T21:54:52.943Z] [INFO]   maven-ejb-plugin
[2019-09-19T21:54:52.943Z] [INFO]   * maven-enforcer-plugin
[2019-09-19T21:54:52.943Z] [INFO]   * maven-failsafe-plugin
[2019-09-19T21:54:52.943Z] [INFO]   maven-gpg-plugin
[2019-09-19T21:54:52.943Z] [INFO]   maven-help-plugin
[2019-09-19T21:54:52.944Z] [INFO]   maven-install-plugin
[2019-09-19T21:54:52.944Z] [INFO]   maven-invoker-plugin
[2019-09-19T21:54:52.944Z] [INFO]   maven-jar-plugin
[2019-09-19T21:54:52.944Z] [INFO]   maven-jarsigner-plugin
[2019-09-19T21:54:52.944Z] [INFO]   maven-javadoc-plugin
[2019-09-19T21:54:52.944Z] [INFO]   maven-jdeps-plugin
[2019-09-19T21:54:52.944Z] [INFO]   maven-jdeprscan-plugin
[2019-09-19T21:54:52.944Z] [INFO]   maven-jlink-plugin
[2019-09-19T21:54:52.944Z] [INFO]   maven-jmod-plugin
[2019-09-19T21:54:52.944Z] [INFO]   * maven-jxr-plugin
[2019-09-19T21:54:52.944Z] [INFO]   maven-linkcheck-plugin
[2019-09-19T21:54:52.944Z] [INFO]   maven-patch-plugin
[2019-09-19T21:54:52.944Z] [INFO]   maven-pdf-plugin
[2019-09-19T21:54:52.944Z] [INFO]   * maven-plugin-plugin
[2019-09-19T21:54:52.944Z] [INFO]   maven-pmd-plugin
[2019-09-19T21:54:52.944Z] [INFO]   maven-project-info-reports-plugin
[2019-09-19T21:54:52.944Z] [INFO]   maven-rar-plugin
[2019-09-19T21:54:52.944Z] [INFO]   * maven-release-plugin  
[2019-09-19T21:54:52.944Z] [INFO]   maven-remote-resources-plugin
[2019-09-19T21:54:52.944Z] [INFO]   maven-resources-plugin
[2019-09-19T21:54:52.944Z] [INFO]   * maven-scm-plugin
[2019-09-19T21:54:53.658Z] [INFO]   maven-scm-publish-plugin
[2019-09-19T21:54:53.658Z] [INFO]   maven-shade-plugin
[2019-09-19T21:54:53.658Z] [INFO]   maven-site-plugin
[2019-09-19T21:54:53.658Z] [INFO]   maven-source-plugin
[2019-09-19T21:54:53.658Z] [INFO]   maven-stage-plugin
[2019-09-19T21:54:53.658Z] [INFO]   * maven-surefire-plugin
[2019-09-19T21:54:53.658Z] [INFO]   * maven-surefire-report-plugin
[2019-09-19T21:54:53.658Z] [INFO]   maven-toolchains-plugin
[2019-09-19T21:54:53.658Z] [INFO]   maven-verifier-plugin
[2019-09-19T21:54:53.658Z] [INFO]   maven-war-plugin
[2019-09-19T21:54:53.658Z] [INFO] /pom: org.apache http://maven.apache.org/pom/
[2019-09-19T21:54:53.658Z] [INFO] > apache index-path = /asf/
[2019-09-19T21:54:53.658Z] [INFO] > apache site = http://maven.apache.org/pom/asf/
[2019-09-19T21:54:53.658Z] [INFO]   apache
[2019-09-19T21:54:53.658Z] [INFO] /pom: org.apache.maven http://maven.apache.org/pom/
[2019-09-19T21:54:53.658Z] [INFO] > maven-parent index-path = /maven/
[2019-09-19T21:54:53.658Z] [INFO] > maven-parent site = http://maven.apache.org/pom/maven/
[2019-09-19T21:54:53.658Z] [INFO]   maven-parent
[2019-09-19T21:54:53.658Z] [INFO] /release: org.apache.maven.release
[2019-09-19T21:54:53.658Z] [INFO]   maven-release (,3)
[2019-09-19T21:54:53.658Z] [INFO] /reporting: org.apache.maven.reporting http://maven.apache.org/shared/
[2019-09-19T21:54:53.658Z] [INFO]   maven-reporting-api
[2019-09-19T21:54:53.658Z] [INFO]   maven-reporting-exec
[2019-09-19T21:54:53.658Z] [INFO]   maven-reporting-impl
[2019-09-19T21:54:53.658Z] [INFO] /resolver: org.apache.maven.resolver
[2019-09-19T21:54:53.658Z] [INFO]   maven-resolver
[2019-09-19T21:54:53.658Z] [INFO] /resources: org.apache.apache.resources
[2019-09-19T21:54:53.658Z] [INFO] > apache-source-release-assembly-descriptor site = http://maven.apache.org/apache-resource-bundles/
[2019-09-19T21:54:53.658Z] [INFO]   apache-source-release-assembly-descriptor
[2019-09-19T21:54:53.658Z] [INFO] /resources: org.apache
[2019-09-19T21:54:53.658Z] [INFO] > apache-incubator-disclaimer-resource-bundle site = http://maven.apache.org/apache-resource-bundles/
[2019-09-19T21:54:53.659Z] [INFO]   apache-incubator-disclaimer-resource-bundle (,1.1]
[2019-09-19T21:54:53.659Z] [INFO] > apache-jar-resource-bundle site = http://maven.apache.org/apache-resource-bundles/
[2019-09-19T21:54:53.659Z] [INFO]   apache-jar-resource-bundle (,1.4]
[2019-09-19T21:54:53.659Z] [INFO] > apache-license-header-resource-bundle site = http://maven.apache.org/apache-resource-bundles/
[2019-09-19T21:54:53.659Z] [INFO]   apache-license-header-resource-bundle (,1.1]
[2019-09-19T21:54:53.659Z] [INFO] /scm: org.apache.maven.scm
[2019-09-19T21:54:53.659Z] [INFO]   maven-scm
[2019-09-19T21:54:53.659Z] [INFO] /shared: org.apache.maven.shared http://maven.apache.org/shared/
[2019-09-19T21:54:53.659Z] [INFO]   file-management
[2019-09-19T21:54:53.659Z] [INFO]   maven-common-artifact-filters
[2019-09-19T21:54:53.659Z] [INFO]   maven-dependency-analyzer
[2019-09-19T21:54:53.659Z] [INFO]   maven-dependency-tree
[2019-09-19T21:54:53.659Z] [INFO]   maven-filtering
[2019-09-19T21:54:53.659Z] [INFO]   maven-invoker
[2019-09-19T21:54:53.659Z] [INFO]   maven-jarsigner
[2019-09-19T21:54:53.659Z] [INFO]   maven-mapping
[2019-09-19T21:54:53.659Z] [INFO]   maven-script-interpreter
[2019-09-19T21:54:53.659Z] [INFO]   maven-shared-incremental
[2019-09-19T21:54:53.659Z] [INFO]   maven-shared-jar
[2019-09-19T21:54:53.659Z] [INFO]   maven-shared-resources
[2019-09-19T21:54:53.659Z] [INFO]   maven-shared-utils
[2019-09-19T21:54:53.659Z] [INFO]   maven-shared-io
[2019-09-19T21:54:53.659Z] [INFO]   maven-verifier
[2019-09-19T21:54:53.659Z] [INFO] /shared: org.apache.maven http://maven.apache.org/shared/
[2019-09-19T21:54:53.659Z] [INFO]   maven-archiver
[2019-09-19T21:54:53.659Z] [INFO] > maven-skins index-path = /skins/
[2019-09-19T21:54:53.659Z] [INFO] /skins: org.apache.maven.skins http://maven.apache.org/skins/
[2019-09-19T21:54:53.659Z] [INFO]   maven-default-skin
[2019-09-19T21:54:54.373Z] [INFO]   maven-fluido-skin
[2019-09-19T21:54:54.373Z] [INFO] /surefire: org.apache.maven.surefire
[2019-09-19T21:54:54.373Z] [INFO]   surefire
[2019-09-19T21:54:54.373Z] [INFO] /wagon: org.apache.maven.wagon
[2019-09-19T21:54:54.373Z] [INFO]   wagon
[2019-09-19T21:54:54.373Z] [INFO]
[2019-09-19T21:54:54.373Z] [INFO] Generating "Dist Tool> Check Errors" report --- dist-tool-plugin:1.0-SNAPSHOT:check-errors
[2019-09-19T21:54:54.373Z] [INFO] Generating "Dist Tool> List Plugins Prerequisites" report --- dist-tool-plugin:1.0-SNAPSHOT:list-plugins-prerequisites
[2019-09-19T21:55:06.977Z] [INFO] Generating "Dist Tool> List Master Jobs" report --- dist-tool-plugin:1.0-SNAPSHOT:list-master-jobs
[2019-09-19T21:56:25.449Z] [INFO] Generating "Dist Tool> Failure Hack" report --- dist-tool-plugin:1.0-SNAPSHOT:failure-report
[2019-09-19T21:56:25.449Z] [ERROR] check-source-release.log error log not empty:
[2019-09-19T21:56:25.449Z] Missing file for maven-invoker-plugin in http://www.apache.org/dist/maven/plugins
[2019-09-19T21:56:25.449Z]  > maven-invoker-plugin-3.2.1-source-release.zip <
[2019-09-19T21:56:25.449Z]  > maven-invoker-plugin-3.2.1-source-release.zip.asc <
[2019-09-19T21:56:25.449Z]  > maven-invoker-plugin-3.2.1-source-release.zip.sha1 or .sha512 <
[2019-09-19T21:56:25.449Z] Different version than 3.2.1 for maven-invoker-plugin available in http://www.apache.org/dist/maven/plugins
[2019-09-19T21:56:25.449Z]  > maven-invoker-plugin-3.2.0-source-release.zip <
[2019-09-19T21:56:25.449Z]  > maven-invoker-plugin-3.2.0-source-release.zip.asc <
[2019-09-19T21:56:25.449Z]  > maven-invoker-plugin-3.2.0-source-release.zip.sha512 <
[2019-09-19T21:56:25.449Z]
[2019-09-19T21:56:25.449Z] [INFO] ------------------------------------------------------------------------
[2019-09-19T21:56:25.449Z] [INFO] BUILD FAILURE
[2019-09-19T21:56:25.449Z] [INFO] ------------------------------------------------------------------------
[2019-09-19T21:56:25.449Z] [INFO] Total time:  03:59 min
[2019-09-19T21:56:25.449Z] [INFO] Finished at: 2019-09-19T21:56:21Z
[2019-09-19T21:56:25.449Z] [INFO] ------------------------------------------------------------------------
[2019-09-19T21:56:25.449Z] [WARNING] The requested profile "apache.snapshots" could not be activated because it does not exist.
[2019-09-19T21:56:25.449Z] [INFO] [jenkins-event-spy] Generated /home/jenkins/jenkins-slave/workspace/maven-box_maven-dist-tool_master@tmp/withMaven3f2512cc/maven-spy-20190919-215221-3087272183656970133386.log
[2019-09-19T21:56:25.449Z] [ERROR] Failed to execute goal org.apache.maven.plugins:maven-site-plugin:3.7.1:site (default-site) on project dist-tool-plugin: Error generating dist-tool-plugin:1.0-SNAPSHOT:failure-report report: Dist Tool> Checks found inconsistencies in some released artifacts, see https://builds.apache.org/job/dist-tool-plugin/site/dist-tool-check-errors.html for more information -> [Help 1]
[2019-09-19T21:56:25.449Z] org.apache.maven.lifecycle.LifecycleExecutionException: Failed to execute goal org.apache.maven.plugins:maven-site-plugin:3.7.1:site (default-site) on project dist-tool-plugin: Error generating dist-tool-plugin:1.0-SNAPSHOT:failure-report report
[2019-09-19T21:56:25.449Z]     at org.apache.maven.lifecycle.internal.MojoExecutor.execute (MojoExecutor.java:215)
[2019-09-19T21:56:25.450Z]     at org.apache.maven.lifecycle.internal.MojoExecutor.execute (MojoExecutor.java:156)
[2019-09-19T21:56:25.450Z]     at org.apache.maven.lifecycle.internal.MojoExecutor.execute (MojoExecutor.java:148)
[2019-09-19T21:56:25.450Z]     at org.apache.maven.lifecycle.internal.LifecycleModuleBuilder.buildProject (LifecycleModuleBuilder.java:117)
[2019-09-19T21:56:25.450Z]     at org.apache.maven.lifecycle.internal.LifecycleModuleBuilder.buildProject (LifecycleModuleBuilder.java:81)
[2019-09-19T21:56:25.450Z]     at org.apache.maven.lifecycle.internal.builder.singlethreaded.SingleThreadedBuilder.build (SingleThreadedBuilder.java:56)
[2019-09-19T21:56:25.450Z]     at org.apache.maven.lifecycle.internal.LifecycleStarter.execute (LifecycleStarter.java:128)
[2019-09-19T21:56:25.450Z]     at org.apache.maven.DefaultMaven.doExecute (DefaultMaven.java:305)
[2019-09-19T21:56:25.450Z]     at org.apache.maven.DefaultMaven.doExecute (DefaultMaven.java:192)
[2019-09-19T21:56:25.450Z]     at org.apache.maven.DefaultMaven.execute (DefaultMaven.java:105)
[2019-09-19T21:56:25.450Z]     at org.apache.maven.cli.MavenCli.execute (MavenCli.java:956)
[2019-09-19T21:56:25.450Z]     at org.apache.maven.cli.MavenCli.doMain (MavenCli.java:288)
[2019-09-19T21:56:25.450Z]     at org.apache.maven.cli.MavenCli.main (MavenCli.java:192)
[2019-09-19T21:56:25.450Z]     at sun.reflect.NativeMethodAccessorImpl.invoke0 (Native Method)
[2019-09-19T21:56:25.450Z]     at sun.reflect.NativeMethodAccessorImpl.invoke (NativeMethodAccessorImpl.java:62)
[2019-09-19T21:56:25.450Z]     at sun.reflect.DelegatingMethodAccessorImpl.invoke (DelegatingMethodAccessorImpl.java:43)
[2019-09-19T21:56:25.450Z]     at java.lang.reflect.Method.invoke (Method.java:498)
[2019-09-19T21:56:25.450Z]     at org.codehaus.plexus.classworlds.launcher.Launcher.launchEnhanced (Launcher.java:289)
[2019-09-19T21:56:25.450Z]     at org.codehaus.plexus.classworlds.launcher.Launcher.launch (Launcher.java:229)
[2019-09-19T21:56:25.450Z]     at org.codehaus.plexus.classworlds.launcher.Launcher.mainWithExitCode (Launcher.java:415)
[2019-09-19T21:56:25.450Z]     at org.codehaus.plexus.classworlds.launcher.Launcher.main (Launcher.java:356)
[2019-09-19T21:56:25.450Z] Caused by: org.apache.maven.plugin.MojoExecutionException: Error generating dist-tool-plugin:1.0-SNAPSHOT:failure-report report
[2019-09-19T21:56:25.450Z]     at org.apache.maven.plugins.site.render.SiteMojo.execute (SiteMojo.java:155)
[2019-09-19T21:56:25.450Z]     at org.apache.maven.plugin.DefaultBuildPluginManager.executeMojo (DefaultBuildPluginManager.java:137)
[2019-09-19T21:56:25.450Z]     at org.apache.maven.lifecycle.internal.MojoExecutor.execute (MojoExecutor.java:210)
[2019-09-19T21:56:25.450Z]     at org.apache.maven.lifecycle.internal.MojoExecutor.execute (MojoExecutor.java:156)
[2019-09-19T21:56:25.450Z]     at org.apache.maven.lifecycle.internal.MojoExecutor.execute (MojoExecutor.java:148)
[2019-09-19T21:56:25.450Z]     at org.apache.maven.lifecycle.internal.LifecycleModuleBuilder.buildProject (LifecycleModuleBuilder.java:117)
[2019-09-19T21:56:25.450Z]     at org.apache.maven.lifecycle.internal.LifecycleModuleBuilder.buildProject (LifecycleModuleBuilder.java:81)
[2019-09-19T21:56:25.450Z]     at org.apache.maven.lifecycle.internal.builder.singlethreaded.SingleThreadedBuilder.build (SingleThreadedBuilder.java:56)
[2019-09-19T21:56:25.450Z]     at org.apache.maven.lifecycle.internal.LifecycleStarter.execute (LifecycleStarter.java:128)
[2019-09-19T21:56:25.450Z]     at org.apache.maven.DefaultMaven.doExecute (DefaultMaven.java:305)
[2019-09-19T21:56:25.450Z]     at org.apache.maven.DefaultMaven.doExecute (DefaultMaven.java:192)
[2019-09-19T21:56:25.450Z]     at org.apache.maven.DefaultMaven.execute (DefaultMaven.java:105)
[2019-09-19T21:56:25.450Z]     at org.apache.maven.cli.MavenCli.execute (MavenCli.java:956)
[2019-09-19T21:56:25.450Z]     at org.apache.maven.cli.MavenCli.doMain (MavenCli.java:288)
[2019-09-19T21:56:25.451Z]     at org.apache.maven.cli.MavenCli.main (MavenCli.java:192)
[2019-09-19T21:56:25.451Z]     at sun.reflect.NativeMethodAccessorImpl.invoke0 (Native Method)
[2019-09-19T21:56:25.451Z]     at sun.reflect.NativeMethodAccessorImpl.invoke (NativeMethodAccessorImpl.java:62)
[2019-09-19T21:56:25.451Z]     at sun.reflect.DelegatingMethodAccessorImpl.invoke (DelegatingMethodAccessorImpl.java:43)
[2019-09-19T21:56:25.451Z]     at java.lang.reflect.Method.invoke (Method.java:498)
[2019-09-19T21:56:25.451Z]     at org.codehaus.plexus.classworlds.launcher.Launcher.launchEnhanced (Launcher.java:289)
[2019-09-19T21:56:25.451Z]     at org.codehaus.plexus.classworlds.launcher.Launcher.launch (Launcher.java:229)
[2019-09-19T21:56:25.451Z]     at org.codehaus.plexus.classworlds.launcher.Launcher.mainWithExitCode (Launcher.java:415)
[2019-09-19T21:56:25.451Z]     at org.codehaus.plexus.classworlds.launcher.Launcher.main (Launcher.java:356)
[2019-09-19T21:56:25.451Z] Caused by: org.apache.maven.reporting.MavenReportException: Dist Tool> Checks found inconsistencies in some released artifacts, see https://builds.apache.org/job/dist-tool-plugin/site/dist-tool-check-errors.html for more information
[2019-09-19T21:56:25.451Z]     at org.apache.maven.dist.tools.DistCheckErrorsMojo.executeReport (DistCheckErrorsMojo.java:113)
[2019-09-19T21:56:25.451Z]     at org.apache.maven.reporting.AbstractMavenReport.generate (AbstractMavenReport.java:251)
[2019-09-19T21:56:25.451Z]     at org.apache.maven.plugins.site.render.ReportDocumentRenderer.renderDocument (ReportDocumentRenderer.java:230)
[2019-09-19T21:56:25.451Z]     at org.apache.maven.doxia.siterenderer.DefaultSiteRenderer.render (DefaultSiteRenderer.java:349)
[2019-09-19T21:56:25.451Z]     at org.apache.maven.plugins.site.render.SiteMojo.renderLocale (SiteMojo.java:198)
[2019-09-19T21:56:25.451Z]     at org.apache.maven.plugins.site.render.SiteMojo.execute (SiteMojo.java:147)
[2019-09-19T21:56:25.451Z]     at org.apache.maven.plugin.DefaultBuildPluginManager.executeMojo (DefaultBuildPluginManager.java:137)
[2019-09-19T21:56:25.451Z]     at org.apache.maven.lifecycle.internal.MojoExecutor.execute (MojoExecutor.java:210)
[2019-09-19T21:56:25.451Z]     at org.apache.maven.lifecycle.internal.MojoExecutor.execute (MojoExecutor.java:156)
[2019-09-19T21:56:25.451Z]     at org.apache.maven.lifecycle.internal.MojoExecutor.execute (MojoExecutor.java:148)
[2019-09-19T21:56:25.451Z]     at org.apache.maven.lifecycle.internal.LifecycleModuleBuilder.buildProject (LifecycleModuleBuilder.java:117)
[2019-09-19T21:56:25.451Z]     at org.apache.maven.lifecycle.internal.LifecycleModuleBuilder.buildProject (LifecycleModuleBuilder.java:81)
[2019-09-19T21:56:25.451Z]     at org.apache.maven.lifecycle.internal.builder.singlethreaded.SingleThreadedBuilder.build (SingleThreadedBuilder.java:56)
[2019-09-19T21:56:25.451Z]     at org.apache.maven.lifecycle.internal.LifecycleStarter.execute (LifecycleStarter.java:128)
[2019-09-19T21:56:25.451Z]     at org.apache.maven.DefaultMaven.doExecute (DefaultMaven.java:305)
[2019-09-19T21:56:25.451Z]     at org.apache.maven.DefaultMaven.doExecute (DefaultMaven.java:192)
[2019-09-19T21:56:25.451Z]     at org.apache.maven.DefaultMaven.execute (DefaultMaven.java:105)
[2019-09-19T21:56:25.451Z]     at org.apache.maven.cli.MavenCli.execute (MavenCli.java:956)
[2019-09-19T21:56:25.451Z]     at org.apache.maven.cli.MavenCli.doMain (MavenCli.java:288)
[2019-09-19T21:56:25.451Z]     at org.apache.maven.cli.MavenCli.main (MavenCli.java:192)
[2019-09-19T21:56:25.451Z]     at sun.reflect.NativeMethodAccessorImpl.invoke0 (Native Method)
[2019-09-19T21:56:25.451Z]     at sun.reflect.NativeMethodAccessorImpl.invoke (NativeMethodAccessorImpl.java:62)
[2019-09-19T21:56:25.451Z]     at sun.reflect.DelegatingMethodAccessorImpl.invoke (DelegatingMethodAccessorImpl.java:43)
[2019-09-19T21:56:25.451Z]     at java.lang.reflect.Method.invoke (Method.java:498)
[2019-09-19T21:56:25.452Z]     at org.codehaus.plexus.classworlds.launcher.Launcher.launchEnhanced (Launcher.java:289)
[2019-09-19T21:56:25.452Z]     at org.codehaus.plexus.classworlds.launcher.Launcher.launch (Launcher.java:229)
[2019-09-19T21:56:25.452Z]     at org.codehaus.plexus.classworlds.launcher.Launcher.mainWithExitCode (Launcher.java:415)
[2019-09-19T21:56:25.452Z]     at org.codehaus.plexus.classworlds.launcher.Launcher.main (Launcher.java:356)
[2019-09-19T21:56:25.452Z] [ERROR]
[2019-09-19T21:56:25.452Z] [ERROR] Re-run Maven using the -X switch to enable full debug logging.
[2019-09-19T21:56:25.452Z] [ERROR]
[2019-09-19T21:56:25.452Z] [ERROR] For more information about the errors and possible solutions, please read the following articles:
[2019-09-19T21:56:25.452Z] [ERROR] [Help 1] http://cwiki.apache.org/confluence/display/MAVEN/MojoExecutionException
[Pipeline] }
[2019-09-19T21:56:27.219Z] [withMaven] junitPublisher - Archive test results for Maven artifact org.apache.maven.dist.tools:dist-tool-plugin:maven-plugin:1.0-SNAPSHOT generated by maven-surefire-plugin:test (default-test): target/surefire-reports/*.xml
[2019-09-19T21:56:27.219Z] [withMaven] junitPublisher - Archive test results for Maven artifact org.apache.maven.dist.tools:dist-tool-plugin:maven-plugin:1.0-SNAPSHOT generated by maven-surefire-plugin:test (default-test): target/surefire-reports/*.xml
[2019-09-19T21:56:27.219Z] Recording test results
[2019-09-19T21:56:29.092Z] [withMaven] openTasksPublisher - Scan Tasks for Maven artifact org.apache.maven.dist.tools:dist-tool-plugin:maven-plugin:1.0-SNAPSHOT in source directory src/main/java
[2019-09-19T21:56:29.268Z] [TASKS] Scanning folder '/home/jenkins/jenkins-slave/workspace/maven-box_maven-dist-tool_master' for files matching the pattern 'src/main/java/**/*' - excludes: null
[2019-09-19T21:56:29.268Z] [TASKS] Found 22 files to scan for tasks
[2019-09-19T21:56:29.269Z] [TASKS] Found 2 open tasks.
[2019-09-19T21:56:29.269Z] Skipping warnings blame since pipelines do not have an SCM link.%n
[2019-09-19T21:56:29.308Z] [TASKS] Computing warning deltas based on reference build #231
[2019-09-19T21:56:29.465Z] [withMaven] Publishers: Pipeline Graph Publisher: 3 ms, Junit Publisher: 631 ms, Dependencies Fingerprint Publisher: 1 ms, JGiven Publisher: 1 ms, Open Task Scanner Publisher: 527 ms
[Pipeline] // withMaven
[Pipeline] }
[Pipeline] // stage
[Pipeline] stage
[Pipeline] { (Declarative: Post Actions)
[Pipeline] echo
[2019-09-19T21:56:29.991Z] Build result: FAILURE
[Pipeline] jiraIssueSelector
[Pipeline] echo
[2019-09-19T21:56:30.041Z] The authors of changes [].
[Pipeline] echo
[2019-09-19T21:56:30.049Z] Sending email ...
[Pipeline] emailext
Reply | Threaded
Open this post in threaded view
|

Build succeeded in Jenkins: Maven TLP » maven-dist-tool » master #241

Apache Jenkins Server-2