Build failed in Jenkins: Maven TLP » maven-dist-tool » master #232

classic Classic list List threaded Threaded
1 message Options
Reply | Threaded
Open this post in threaded view
|

Build failed in Jenkins: Maven TLP » maven-dist-tool » master #232

Apache Jenkins Server-2
See https://builds.apache.org/job/maven-box/job/maven-dist-tool/job/master/232/

No changes.

All tests passed

Build log:
[...truncated 5036 lines...]
[2019-09-13T21:50:37.520Z] [INFO] /indexer: org.apache.maven.indexer
[2019-09-13T21:50:37.520Z] [INFO]   maven-indexer
[2019-09-13T21:50:37.520Z] [INFO] /maven-3: org.apache.maven src+bin
[2019-09-13T21:50:37.520Z] [INFO]   apache-maven [3.0,3.1.0-alpha-1)
[2019-09-13T21:50:37.520Z] [INFO]   apache-maven [3.1.0,3.2.0-alpha-1)
[2019-09-13T21:50:37.520Z] [INFO]   apache-maven
[2019-09-13T21:50:37.520Z] [INFO] /jxr: org.apache.maven.jxr
[2019-09-13T21:50:37.520Z] [INFO]   jxr
[2019-09-13T21:50:37.520Z] [INFO] /plugin-testing: org.apache.maven.plugin-testing
[2019-09-13T21:50:37.520Z] [INFO]   maven-plugin-testing
[2019-09-13T21:50:37.520Z] [INFO] /plugin-tools: org.apache.maven.plugin-tools
[2019-09-13T21:50:37.520Z] [INFO]   maven-plugin-tools
[2019-09-13T21:50:37.520Z] [INFO] /plugins: org.apache.maven.plugins http://maven.apache.org/plugins/
[2019-09-13T21:50:37.520Z] [INFO]   maven-acr-plugin
[2019-09-13T21:50:37.520Z] [INFO]   maven-antrun-plugin
[2019-09-13T21:50:37.520Z] [INFO]   * maven-archetype-plugin
[2019-09-13T21:50:37.520Z] [INFO]   maven-assembly-plugin
[2019-09-13T21:50:37.520Z] [INFO]   maven-changelog-plugin
[2019-09-13T21:50:37.520Z] [INFO]   maven-changes-plugin
[2019-09-13T21:50:37.520Z] [INFO]   maven-checkstyle-plugin
[2019-09-13T21:50:37.520Z] [INFO]   maven-clean-plugin
[2019-09-13T21:50:37.520Z] [INFO]   maven-compiler-plugin
[2019-09-13T21:50:37.520Z] [INFO]   maven-dependency-plugin
[2019-09-13T21:50:37.520Z] [INFO]   maven-deploy-plugin
[2019-09-13T21:50:37.520Z] [INFO]   maven-doap-plugin
[2019-09-13T21:50:37.520Z] [INFO]   maven-docck-plugin
[2019-09-13T21:50:37.520Z] [INFO]   maven-ear-plugin
[2019-09-13T21:50:37.521Z] [INFO]   maven-ejb-plugin
[2019-09-13T21:50:37.521Z] [INFO]   * maven-enforcer-plugin
[2019-09-13T21:50:37.521Z] [INFO]   * maven-failsafe-plugin
[2019-09-13T21:50:37.521Z] [INFO]   maven-gpg-plugin
[2019-09-13T21:50:37.521Z] [INFO]   maven-help-plugin
[2019-09-13T21:50:37.521Z] [INFO]   maven-install-plugin
[2019-09-13T21:50:37.521Z] [INFO]   maven-invoker-plugin
[2019-09-13T21:50:37.521Z] [INFO]   maven-jar-plugin
[2019-09-13T21:50:37.521Z] [INFO]   maven-jarsigner-plugin
[2019-09-13T21:50:37.521Z] [INFO]   maven-javadoc-plugin
[2019-09-13T21:50:37.521Z] [INFO]   maven-jdeps-plugin
[2019-09-13T21:50:37.521Z] [INFO]   maven-jdeprscan-plugin
[2019-09-13T21:50:37.521Z] [INFO]   maven-jlink-plugin
[2019-09-13T21:50:37.521Z] [INFO]   maven-jmod-plugin
[2019-09-13T21:50:37.521Z] [INFO]   * maven-jxr-plugin
[2019-09-13T21:50:37.521Z] [INFO]   maven-linkcheck-plugin
[2019-09-13T21:50:37.521Z] [INFO]   maven-patch-plugin
[2019-09-13T21:50:37.521Z] [INFO]   maven-pdf-plugin
[2019-09-13T21:50:37.521Z] [INFO]   * maven-plugin-plugin
[2019-09-13T21:50:37.521Z] [INFO]   maven-pmd-plugin
[2019-09-13T21:50:37.521Z] [INFO]   maven-project-info-reports-plugin
[2019-09-13T21:50:37.521Z] [INFO]   maven-rar-plugin
[2019-09-13T21:50:38.232Z] [INFO]   * maven-release-plugin  
[2019-09-13T21:50:38.232Z] [INFO]   maven-remote-resources-plugin
[2019-09-13T21:50:38.232Z] [INFO]   maven-resources-plugin
[2019-09-13T21:50:38.232Z] [INFO]   * maven-scm-plugin
[2019-09-13T21:50:38.232Z] [INFO]   maven-scm-publish-plugin
[2019-09-13T21:50:38.232Z] [INFO]   maven-shade-plugin
[2019-09-13T21:50:38.232Z] [INFO]   maven-site-plugin
[2019-09-13T21:50:38.232Z] [INFO]   maven-source-plugin
[2019-09-13T21:50:38.232Z] [INFO]   maven-stage-plugin
[2019-09-13T21:50:38.232Z] [INFO]   * maven-surefire-plugin
[2019-09-13T21:50:38.232Z] [INFO]   * maven-surefire-report-plugin
[2019-09-13T21:50:38.232Z] [INFO]   maven-toolchains-plugin
[2019-09-13T21:50:38.232Z] [INFO]   maven-verifier-plugin
[2019-09-13T21:50:38.232Z] [INFO]   maven-war-plugin
[2019-09-13T21:50:38.232Z] [INFO] /pom: org.apache http://maven.apache.org/pom/
[2019-09-13T21:50:38.232Z] [INFO] > apache index-path = /asf/
[2019-09-13T21:50:38.232Z] [INFO] > apache site = http://maven.apache.org/pom/asf/
[2019-09-13T21:50:38.232Z] [INFO]   apache
[2019-09-13T21:50:38.232Z] [INFO] /pom: org.apache.maven http://maven.apache.org/pom/
[2019-09-13T21:50:38.232Z] [INFO] > maven-parent index-path = /maven/
[2019-09-13T21:50:38.232Z] [INFO] > maven-parent site = http://maven.apache.org/pom/maven/
[2019-09-13T21:50:38.232Z] [INFO]   maven-parent
[2019-09-13T21:50:38.232Z] [INFO] /release: org.apache.maven.release
[2019-09-13T21:50:38.232Z] [INFO]   maven-release (,3)
[2019-09-13T21:50:38.232Z] [INFO] /reporting: org.apache.maven.reporting http://maven.apache.org/shared/
[2019-09-13T21:50:38.232Z] [INFO]   maven-reporting-api
[2019-09-13T21:50:38.232Z] [INFO]   maven-reporting-exec
[2019-09-13T21:50:38.232Z] [INFO]   maven-reporting-impl
[2019-09-13T21:50:38.232Z] [INFO] /resolver: org.apache.maven.resolver
[2019-09-13T21:50:38.232Z] [INFO]   maven-resolver
[2019-09-13T21:50:38.232Z] [INFO] /resources: org.apache.apache.resources
[2019-09-13T21:50:38.232Z] [INFO] > apache-source-release-assembly-descriptor site = http://maven.apache.org/apache-resource-bundles/
[2019-09-13T21:50:38.232Z] [INFO]   apache-source-release-assembly-descriptor
[2019-09-13T21:50:38.232Z] [INFO] /resources: org.apache
[2019-09-13T21:50:38.232Z] [INFO] > apache-incubator-disclaimer-resource-bundle site = http://maven.apache.org/apache-resource-bundles/
[2019-09-13T21:50:38.232Z] [INFO]   apache-incubator-disclaimer-resource-bundle (,1.1]
[2019-09-13T21:50:38.232Z] [INFO] > apache-jar-resource-bundle site = http://maven.apache.org/apache-resource-bundles/
[2019-09-13T21:50:38.232Z] [INFO]   apache-jar-resource-bundle (,1.4]
[2019-09-13T21:50:38.232Z] [INFO] > apache-license-header-resource-bundle site = http://maven.apache.org/apache-resource-bundles/
[2019-09-13T21:50:38.233Z] [INFO]   apache-license-header-resource-bundle (,1.1]
[2019-09-13T21:50:38.233Z] [INFO] /scm: org.apache.maven.scm
[2019-09-13T21:50:38.233Z] [INFO]   maven-scm
[2019-09-13T21:50:38.233Z] [INFO] /shared: org.apache.maven.shared http://maven.apache.org/shared/
[2019-09-13T21:50:38.233Z] [INFO]   file-management
[2019-09-13T21:50:38.233Z] [INFO]   maven-common-artifact-filters
[2019-09-13T21:50:38.233Z] [INFO]   maven-dependency-analyzer
[2019-09-13T21:50:38.233Z] [INFO]   maven-dependency-tree
[2019-09-13T21:50:38.233Z] [INFO]   maven-filtering
[2019-09-13T21:50:38.233Z] [INFO]   maven-invoker
[2019-09-13T21:50:38.233Z] [INFO]   maven-jarsigner
[2019-09-13T21:50:38.233Z] [INFO]   maven-mapping
[2019-09-13T21:50:38.233Z] [INFO]   maven-script-interpreter
[2019-09-13T21:50:38.233Z] [INFO]   maven-shared-incremental
[2019-09-13T21:50:38.233Z] [INFO]   maven-shared-jar
[2019-09-13T21:50:38.233Z] [INFO]   maven-shared-resources
[2019-09-13T21:50:38.233Z] [INFO]   maven-shared-utils
[2019-09-13T21:50:38.233Z] [INFO]   maven-shared-io
[2019-09-13T21:50:38.233Z] [INFO]   maven-verifier
[2019-09-13T21:50:38.233Z] [INFO] /shared: org.apache.maven http://maven.apache.org/shared/
[2019-09-13T21:50:38.233Z] [INFO]   maven-archiver
[2019-09-13T21:50:38.233Z] [INFO] > maven-skins index-path = /skins/
[2019-09-13T21:50:38.233Z] [INFO] /skins: org.apache.maven.skins http://maven.apache.org/skins/
[2019-09-13T21:50:38.233Z] [INFO]   maven-default-skin
[2019-09-13T21:50:38.943Z] [INFO]   maven-fluido-skin
[2019-09-13T21:50:38.943Z] [INFO] /surefire: org.apache.maven.surefire
[2019-09-13T21:50:38.943Z] [INFO]   surefire
[2019-09-13T21:50:38.943Z] [INFO] /wagon: org.apache.maven.wagon
[2019-09-13T21:50:38.943Z] [INFO]   wagon
[2019-09-13T21:50:38.943Z] [INFO]
[2019-09-13T21:50:38.943Z] [ERROR] maven-invoker-plugin: found 3.2.0 instead of 3.2.1 in http://maven.apache.org/plugins/
[2019-09-13T21:50:38.943Z] [INFO] Generating "Dist Tool> Check Errors" report --- dist-tool-plugin:1.0-SNAPSHOT:check-errors
[2019-09-13T21:50:38.943Z] [INFO] Generating "Dist Tool> List Plugins Prerequisites" report --- dist-tool-plugin:1.0-SNAPSHOT:list-plugins-prerequisites
[2019-09-13T21:50:52.226Z] [INFO] Generating "Dist Tool> List Master Jobs" report --- dist-tool-plugin:1.0-SNAPSHOT:list-master-jobs
[2019-09-13T21:52:09.847Z] [INFO] Generating "Dist Tool> Failure Hack" report --- dist-tool-plugin:1.0-SNAPSHOT:failure-report
[2019-09-13T21:52:09.847Z] [ERROR] check-source-release.log error log not empty:
[2019-09-13T21:52:09.847Z] Missing file for maven-invoker-plugin in http://www.apache.org/dist/maven/plugins
[2019-09-13T21:52:09.847Z]  > maven-invoker-plugin-3.2.1-source-release.zip <
[2019-09-13T21:52:09.847Z]  > maven-invoker-plugin-3.2.1-source-release.zip.asc <
[2019-09-13T21:52:09.847Z]  > maven-invoker-plugin-3.2.1-source-release.zip.sha1 or .sha512 <
[2019-09-13T21:52:09.847Z] Different version than 3.2.1 for maven-invoker-plugin available in http://www.apache.org/dist/maven/plugins
[2019-09-13T21:52:09.847Z]  > maven-invoker-plugin-3.2.0-source-release.zip <
[2019-09-13T21:52:09.847Z]  > maven-invoker-plugin-3.2.0-source-release.zip.asc <
[2019-09-13T21:52:09.847Z]  > maven-invoker-plugin-3.2.0-source-release.zip.sha512 <
[2019-09-13T21:52:09.847Z]
[2019-09-13T21:52:09.847Z] [ERROR] check-index-page.log error log not empty:
[2019-09-13T21:52:09.847Z] maven-invoker-plugin: found 3.2.0 instead of 3.2.1 in http://maven.apache.org/plugins/
[2019-09-13T21:52:09.847Z]
[2019-09-13T21:52:09.847Z] [INFO] ------------------------------------------------------------------------
[2019-09-13T21:52:09.847Z] [INFO] BUILD FAILURE
[2019-09-13T21:52:09.847Z] [INFO] ------------------------------------------------------------------------
[2019-09-13T21:52:09.847Z] [INFO] Total time:  03:45 min
[2019-09-13T21:52:09.847Z] [INFO] Finished at: 2019-09-13T21:51:51Z
[2019-09-13T21:52:09.847Z] [INFO] ------------------------------------------------------------------------
[2019-09-13T21:52:09.847Z] [WARNING] The requested profile "apache.snapshots" could not be activated because it does not exist.
[2019-09-13T21:52:09.847Z] [INFO] [jenkins-event-spy] Generated /home/jenkins/jenkins-slave/workspace/maven-box_maven-dist-tool_master@tmp/withMaven8f0ce6cc/maven-spy-20190913-214806-2245962644319453894523.log
[2019-09-13T21:52:09.847Z] [ERROR] Failed to execute goal org.apache.maven.plugins:maven-site-plugin:3.7.1:site (default-site) on project dist-tool-plugin: Error generating dist-tool-plugin:1.0-SNAPSHOT:failure-report report: Dist Tool> Checks found inconsistencies in some released artifacts, see https://builds.apache.org/job/dist-tool-plugin/site/dist-tool-check-errors.html for more information -> [Help 1]
[2019-09-13T21:52:09.848Z] org.apache.maven.lifecycle.LifecycleExecutionException: Failed to execute goal org.apache.maven.plugins:maven-site-plugin:3.7.1:site (default-site) on project dist-tool-plugin: Error generating dist-tool-plugin:1.0-SNAPSHOT:failure-report report
[2019-09-13T21:52:09.848Z]     at org.apache.maven.lifecycle.internal.MojoExecutor.execute (MojoExecutor.java:215)
[2019-09-13T21:52:09.848Z]     at org.apache.maven.lifecycle.internal.MojoExecutor.execute (MojoExecutor.java:156)
[2019-09-13T21:52:09.848Z]     at org.apache.maven.lifecycle.internal.MojoExecutor.execute (MojoExecutor.java:148)
[2019-09-13T21:52:09.848Z]     at org.apache.maven.lifecycle.internal.LifecycleModuleBuilder.buildProject (LifecycleModuleBuilder.java:117)
[2019-09-13T21:52:09.848Z]     at org.apache.maven.lifecycle.internal.LifecycleModuleBuilder.buildProject (LifecycleModuleBuilder.java:81)
[2019-09-13T21:52:09.848Z]     at org.apache.maven.lifecycle.internal.builder.singlethreaded.SingleThreadedBuilder.build (SingleThreadedBuilder.java:56)
[2019-09-13T21:52:09.848Z]     at org.apache.maven.lifecycle.internal.LifecycleStarter.execute (LifecycleStarter.java:128)
[2019-09-13T21:52:09.848Z]     at org.apache.maven.DefaultMaven.doExecute (DefaultMaven.java:305)
[2019-09-13T21:52:09.848Z]     at org.apache.maven.DefaultMaven.doExecute (DefaultMaven.java:192)
[2019-09-13T21:52:09.848Z]     at org.apache.maven.DefaultMaven.execute (DefaultMaven.java:105)
[2019-09-13T21:52:09.848Z]     at org.apache.maven.cli.MavenCli.execute (MavenCli.java:956)
[2019-09-13T21:52:09.848Z]     at org.apache.maven.cli.MavenCli.doMain (MavenCli.java:288)
[2019-09-13T21:52:09.848Z]     at org.apache.maven.cli.MavenCli.main (MavenCli.java:192)
[2019-09-13T21:52:09.848Z]     at sun.reflect.NativeMethodAccessorImpl.invoke0 (Native Method)
[2019-09-13T21:52:09.848Z]     at sun.reflect.NativeMethodAccessorImpl.invoke (NativeMethodAccessorImpl.java:62)
[2019-09-13T21:52:09.848Z]     at sun.reflect.DelegatingMethodAccessorImpl.invoke (DelegatingMethodAccessorImpl.java:43)
[2019-09-13T21:52:09.848Z]     at java.lang.reflect.Method.invoke (Method.java:498)
[2019-09-13T21:52:09.848Z]     at org.codehaus.plexus.classworlds.launcher.Launcher.launchEnhanced (Launcher.java:289)
[2019-09-13T21:52:09.848Z]     at org.codehaus.plexus.classworlds.launcher.Launcher.launch (Launcher.java:229)
[2019-09-13T21:52:09.848Z]     at org.codehaus.plexus.classworlds.launcher.Launcher.mainWithExitCode (Launcher.java:415)
[2019-09-13T21:52:09.848Z]     at org.codehaus.plexus.classworlds.launcher.Launcher.main (Launcher.java:356)
[2019-09-13T21:52:09.848Z] Caused by: org.apache.maven.plugin.MojoExecutionException: Error generating dist-tool-plugin:1.0-SNAPSHOT:failure-report report
[2019-09-13T21:52:09.848Z]     at org.apache.maven.plugins.site.render.SiteMojo.execute (SiteMojo.java:155)
[2019-09-13T21:52:09.848Z]     at org.apache.maven.plugin.DefaultBuildPluginManager.executeMojo (DefaultBuildPluginManager.java:137)
[2019-09-13T21:52:09.848Z]     at org.apache.maven.lifecycle.internal.MojoExecutor.execute (MojoExecutor.java:210)
[2019-09-13T21:52:09.848Z]     at org.apache.maven.lifecycle.internal.MojoExecutor.execute (MojoExecutor.java:156)
[2019-09-13T21:52:09.848Z]     at org.apache.maven.lifecycle.internal.MojoExecutor.execute (MojoExecutor.java:148)
[2019-09-13T21:52:09.848Z]     at org.apache.maven.lifecycle.internal.LifecycleModuleBuilder.buildProject (LifecycleModuleBuilder.java:117)
[2019-09-13T21:52:09.848Z]     at org.apache.maven.lifecycle.internal.LifecycleModuleBuilder.buildProject (LifecycleModuleBuilder.java:81)
[2019-09-13T21:52:09.848Z]     at org.apache.maven.lifecycle.internal.builder.singlethreaded.SingleThreadedBuilder.build (SingleThreadedBuilder.java:56)
[2019-09-13T21:52:09.848Z]     at org.apache.maven.lifecycle.internal.LifecycleStarter.execute (LifecycleStarter.java:128)
[2019-09-13T21:52:09.849Z]     at org.apache.maven.DefaultMaven.doExecute (DefaultMaven.java:305)
[2019-09-13T21:52:09.849Z]     at org.apache.maven.DefaultMaven.doExecute (DefaultMaven.java:192)
[2019-09-13T21:52:09.849Z]     at org.apache.maven.DefaultMaven.execute (DefaultMaven.java:105)
[2019-09-13T21:52:09.849Z]     at org.apache.maven.cli.MavenCli.execute (MavenCli.java:956)
[2019-09-13T21:52:09.849Z]     at org.apache.maven.cli.MavenCli.doMain (MavenCli.java:288)
[2019-09-13T21:52:09.849Z]     at org.apache.maven.cli.MavenCli.main (MavenCli.java:192)
[2019-09-13T21:52:09.849Z]     at sun.reflect.NativeMethodAccessorImpl.invoke0 (Native Method)
[2019-09-13T21:52:09.849Z]     at sun.reflect.NativeMethodAccessorImpl.invoke (NativeMethodAccessorImpl.java:62)
[2019-09-13T21:52:09.849Z]     at sun.reflect.DelegatingMethodAccessorImpl.invoke (DelegatingMethodAccessorImpl.java:43)
[2019-09-13T21:52:09.849Z]     at java.lang.reflect.Method.invoke (Method.java:498)
[2019-09-13T21:52:09.849Z]     at org.codehaus.plexus.classworlds.launcher.Launcher.launchEnhanced (Launcher.java:289)
[2019-09-13T21:52:09.849Z]     at org.codehaus.plexus.classworlds.launcher.Launcher.launch (Launcher.java:229)
[2019-09-13T21:52:09.849Z]     at org.codehaus.plexus.classworlds.launcher.Launcher.mainWithExitCode (Launcher.java:415)
[2019-09-13T21:52:09.849Z]     at org.codehaus.plexus.classworlds.launcher.Launcher.main (Launcher.java:356)
[2019-09-13T21:52:09.849Z] Caused by: org.apache.maven.reporting.MavenReportException: Dist Tool> Checks found inconsistencies in some released artifacts, see https://builds.apache.org/job/dist-tool-plugin/site/dist-tool-check-errors.html for more information
[2019-09-13T21:52:09.849Z]     at org.apache.maven.dist.tools.DistCheckErrorsMojo.executeReport (DistCheckErrorsMojo.java:113)
[2019-09-13T21:52:09.849Z]     at org.apache.maven.reporting.AbstractMavenReport.generate (AbstractMavenReport.java:251)
[2019-09-13T21:52:09.849Z]     at org.apache.maven.plugins.site.render.ReportDocumentRenderer.renderDocument (ReportDocumentRenderer.java:230)
[2019-09-13T21:52:09.849Z]     at org.apache.maven.doxia.siterenderer.DefaultSiteRenderer.render (DefaultSiteRenderer.java:349)
[2019-09-13T21:52:09.849Z]     at org.apache.maven.plugins.site.render.SiteMojo.renderLocale (SiteMojo.java:198)
[2019-09-13T21:52:09.849Z]     at org.apache.maven.plugins.site.render.SiteMojo.execute (SiteMojo.java:147)
[2019-09-13T21:52:09.849Z]     at org.apache.maven.plugin.DefaultBuildPluginManager.executeMojo (DefaultBuildPluginManager.java:137)
[2019-09-13T21:52:09.849Z]     at org.apache.maven.lifecycle.internal.MojoExecutor.execute (MojoExecutor.java:210)
[2019-09-13T21:52:09.849Z]     at org.apache.maven.lifecycle.internal.MojoExecutor.execute (MojoExecutor.java:156)
[2019-09-13T21:52:09.849Z]     at org.apache.maven.lifecycle.internal.MojoExecutor.execute (MojoExecutor.java:148)
[2019-09-13T21:52:09.849Z]     at org.apache.maven.lifecycle.internal.LifecycleModuleBuilder.buildProject (LifecycleModuleBuilder.java:117)
[2019-09-13T21:52:09.849Z]     at org.apache.maven.lifecycle.internal.LifecycleModuleBuilder.buildProject (LifecycleModuleBuilder.java:81)
[2019-09-13T21:52:09.849Z]     at org.apache.maven.lifecycle.internal.builder.singlethreaded.SingleThreadedBuilder.build (SingleThreadedBuilder.java:56)
[2019-09-13T21:52:09.849Z]     at org.apache.maven.lifecycle.internal.LifecycleStarter.execute (LifecycleStarter.java:128)
[2019-09-13T21:52:09.849Z]     at org.apache.maven.DefaultMaven.doExecute (DefaultMaven.java:305)
[2019-09-13T21:52:09.849Z]     at org.apache.maven.DefaultMaven.doExecute (DefaultMaven.java:192)
[2019-09-13T21:52:09.849Z]     at org.apache.maven.DefaultMaven.execute (DefaultMaven.java:105)
[2019-09-13T21:52:09.849Z]     at org.apache.maven.cli.MavenCli.execute (MavenCli.java:956)
[2019-09-13T21:52:09.849Z]     at org.apache.maven.cli.MavenCli.doMain (MavenCli.java:288)
[2019-09-13T21:52:09.849Z]     at org.apache.maven.cli.MavenCli.main (MavenCli.java:192)
[2019-09-13T21:52:09.850Z]     at sun.reflect.NativeMethodAccessorImpl.invoke0 (Native Method)
[2019-09-13T21:52:09.850Z]     at sun.reflect.NativeMethodAccessorImpl.invoke (NativeMethodAccessorImpl.java:62)
[2019-09-13T21:52:09.850Z]     at sun.reflect.DelegatingMethodAccessorImpl.invoke (DelegatingMethodAccessorImpl.java:43)
[2019-09-13T21:52:09.850Z]     at java.lang.reflect.Method.invoke (Method.java:498)
[2019-09-13T21:52:09.850Z]     at org.codehaus.plexus.classworlds.launcher.Launcher.launchEnhanced (Launcher.java:289)
[2019-09-13T21:52:09.850Z]     at org.codehaus.plexus.classworlds.launcher.Launcher.launch (Launcher.java:229)
[2019-09-13T21:52:09.850Z]     at org.codehaus.plexus.classworlds.launcher.Launcher.mainWithExitCode (Launcher.java:415)
[2019-09-13T21:52:09.850Z]     at org.codehaus.plexus.classworlds.launcher.Launcher.main (Launcher.java:356)
[2019-09-13T21:52:09.850Z] [ERROR]
[2019-09-13T21:52:09.850Z] [ERROR] Re-run Maven using the -X switch to enable full debug logging.
[2019-09-13T21:52:09.850Z] [ERROR]
[2019-09-13T21:52:09.850Z] [ERROR] For more information about the errors and possible solutions, please read the following articles:
[2019-09-13T21:52:09.850Z] [ERROR] [Help 1] http://cwiki.apache.org/confluence/display/MAVEN/MojoExecutionException
[Pipeline] }
[2019-09-13T21:52:11.584Z] [withMaven] junitPublisher - Archive test results for Maven artifact org.apache.maven.dist.tools:dist-tool-plugin:maven-plugin:1.0-SNAPSHOT generated by maven-surefire-plugin:test (default-test): target/surefire-reports/*.xml
[2019-09-13T21:52:11.584Z] [withMaven] junitPublisher - Archive test results for Maven artifact org.apache.maven.dist.tools:dist-tool-plugin:maven-plugin:1.0-SNAPSHOT generated by maven-surefire-plugin:test (default-test): target/surefire-reports/*.xml
[2019-09-13T21:52:11.584Z] Recording test results
[2019-09-13T21:52:13.481Z] [withMaven] openTasksPublisher - Scan Tasks for Maven artifact org.apache.maven.dist.tools:dist-tool-plugin:maven-plugin:1.0-SNAPSHOT in source directory src/main/java
[2019-09-13T21:52:13.660Z] [TASKS] Scanning folder '/home/jenkins/jenkins-slave/workspace/maven-box_maven-dist-tool_master' for files matching the pattern 'src/main/java/**/*' - excludes: null
[2019-09-13T21:52:13.660Z] [TASKS] Found 22 files to scan for tasks
[2019-09-13T21:52:13.660Z] [TASKS] Found 2 open tasks.
[2019-09-13T21:52:13.660Z] Skipping warnings blame since pipelines do not have an SCM link.%n
[2019-09-13T21:52:13.702Z] [TASKS] Computing warning deltas based on reference build #231
[2019-09-13T21:52:13.856Z] [withMaven] Publishers: Pipeline Graph Publisher: 11 ms, Junit Publisher: 669 ms, Dependencies Fingerprint Publisher: 1 ms, JGiven Publisher: 2 ms, Open Task Scanner Publisher: 527 ms
[Pipeline] // withMaven
[Pipeline] }
[Pipeline] // stage
[Pipeline] stage
[Pipeline] { (Declarative: Post Actions)
[Pipeline] echo
[2019-09-13T21:52:14.302Z] Build result: FAILURE
[Pipeline] jiraIssueSelector
[Pipeline] echo
[2019-09-13T21:52:14.352Z] The authors of changes [].
[Pipeline] echo
[2019-09-13T21:52:14.358Z] Sending email ...
[Pipeline] emailext