Build failed in Jenkins: Maven TLP » maven-dist-tool » master #202

classic Classic list List threaded Threaded
2 messages Options
Reply | Threaded
Open this post in threaded view
|

Build failed in Jenkins: Maven TLP » maven-dist-tool » master #202

Apache Jenkins Server-2
See https://builds.apache.org/job/maven-box/job/maven-dist-tool/job/master/202/

No changes.

All tests passed

Build log:
[...truncated 2.22 MB...]
[INFO]   doxia-converter
[INFO]   doxia-linkcheck
[INFO]   doxia-sitetools
[INFO] /enforcer: org.apache.maven.enforcer
[INFO]   enforcer
[INFO] /indexer: org.apache.maven.indexer
[INFO]   maven-indexer
[INFO] /maven-3: org.apache.maven src+bin
[INFO]   apache-maven [3.0,3.1.0-alpha-1)
[INFO]   apache-maven [3.1.0,3.2.0-alpha-1)
[INFO]   apache-maven
[INFO] /jxr: org.apache.maven.jxr
[INFO]   jxr
[INFO] /plugin-testing: org.apache.maven.plugin-testing
[INFO]   maven-plugin-testing
[INFO] /plugin-tools: org.apache.maven.plugin-tools
[INFO]   maven-plugin-tools
[INFO] /plugins: org.apache.maven.plugins http://maven.apache.org/plugins/
[INFO]   maven-acr-plugin
[INFO]   maven-ant-plugin
[INFO]   maven-antrun-plugin
[INFO]   * maven-archetype-plugin
[INFO]   maven-assembly-plugin
[INFO]   maven-changelog-plugin
[INFO]   maven-changes-plugin
[INFO]   maven-checkstyle-plugin
[INFO]   maven-clean-plugin
[INFO]   maven-compiler-plugin
[INFO]   maven-dependency-plugin
[INFO]   maven-deploy-plugin
[INFO]   maven-doap-plugin
[INFO]   maven-docck-plugin
[INFO]   maven-ear-plugin
[INFO]   maven-ejb-plugin
[INFO]   * maven-enforcer-plugin
[INFO]   * maven-failsafe-plugin
[INFO]   maven-gpg-plugin
[INFO]   maven-help-plugin
[INFO]   maven-install-plugin
[INFO]   maven-invoker-plugin
[INFO]   maven-jar-plugin
[INFO]   maven-jarsigner-plugin
[INFO]   maven-javadoc-plugin
[INFO]   maven-jdeps-plugin
[INFO]   maven-jdeprscan-plugin
[INFO]   maven-jlink-plugin
[INFO]   maven-jmod-plugin
[INFO]   * maven-jxr-plugin
[INFO]   maven-linkcheck-plugin
[INFO]   maven-patch-plugin
[INFO]   maven-pdf-plugin
[INFO]   * maven-plugin-plugin
[INFO]   maven-pmd-plugin
[INFO]   maven-project-info-reports-plugin
[INFO]   maven-rar-plugin
[INFO]   * maven-release-plugin  
[INFO]   maven-remote-resources-plugin
[INFO]   maven-repository-plugin
[INFO]   maven-resources-plugin
[INFO]   * maven-scm-plugin
[INFO]   maven-scm-publish-plugin
[INFO]   maven-shade-plugin
[INFO]   maven-site-plugin
[INFO]   maven-source-plugin
[INFO]   maven-stage-plugin
[INFO]   * maven-surefire-plugin
[INFO]   * maven-surefire-report-plugin
[INFO]   maven-toolchains-plugin
[INFO]   maven-verifier-plugin
[INFO]   maven-war-plugin
[INFO] /pom: org.apache http://maven.apache.org/pom/
[INFO] > apache index-path = /asf/
[INFO] > apache site = http://maven.apache.org/pom/asf/
[INFO]   apache
[INFO] /pom: org.apache.maven http://maven.apache.org/pom/
[INFO] > maven-parent index-path = /maven/
[INFO] > maven-parent site = http://maven.apache.org/pom/maven/
[INFO]   maven-parent
[INFO] /release: org.apache.maven.release
[INFO]   maven-release (,3)
[INFO] /reporting: org.apache.maven.reporting http://maven.apache.org/shared/
[INFO]   maven-reporting-api
[INFO]   maven-reporting-exec
[INFO]   maven-reporting-impl
[INFO] /resolver: org.apache.maven.resolver
[INFO]   maven-resolver
[INFO] /resources: org.apache.apache.resources
[INFO] > apache-source-release-assembly-descriptor site = http://maven.apache.org/apache-resource-bundles/
[INFO]   apache-source-release-assembly-descriptor
[INFO] /resources: org.apache
[INFO] > apache-incubator-disclaimer-resource-bundle site = http://maven.apache.org/apache-resource-bundles/
[INFO]   apache-incubator-disclaimer-resource-bundle (,1.1]
[INFO] > apache-jar-resource-bundle site = http://maven.apache.org/apache-resource-bundles/
[INFO]   apache-jar-resource-bundle (,1.4]
[INFO] > apache-license-header-resource-bundle site = http://maven.apache.org/apache-resource-bundles/
[INFO]   apache-license-header-resource-bundle (,1.1]
[INFO] /scm: org.apache.maven.scm
[INFO]   maven-scm
[INFO] /shared: org.apache.maven.shared http://maven.apache.org/shared/
[INFO]   file-management
[INFO]   maven-artifact-resolver
[INFO]   maven-common-artifact-filters
[INFO]   maven-dependency-analyzer
[INFO]   maven-dependency-tree
[INFO]   maven-filtering
[INFO]   maven-invoker
[INFO]   maven-jarsigner
[INFO]   maven-mapping
[INFO]   maven-repository-builder
[INFO]   maven-runtime
[INFO]   maven-script-interpreter
[INFO]   maven-shared-incremental
[INFO]   maven-shared-jar
[INFO]   maven-shared-resources
[INFO]   maven-shared-utils
[INFO]   maven-shared-io
[INFO]   maven-verifier
[INFO] /shared: org.apache.maven http://maven.apache.org/shared/
[INFO]   maven-archiver
[INFO] > maven-skins index-path = /skins/
[INFO] /skins: org.apache.maven.skins http://maven.apache.org/skins/
[INFO]   maven-default-skin
[INFO]   maven-fluido-skin
[INFO] /surefire: org.apache.maven.surefire
[INFO]   surefire
[INFO] /wagon: org.apache.maven.wagon
[INFO]   wagon
[INFO]
[INFO] Generating "Dist Tool> Check Errors" report --- dist-tool-plugin:1.0-SNAPSHOT:check-errors
[INFO] Generating "Dist Tool> List Plugins Prerequisites" report --- dist-tool-plugin:1.0-SNAPSHOT:list-plugins-prerequisites
[INFO] Generating "Dist Tool> Failure Hack" report --- dist-tool-plugin:1.0-SNAPSHOT:failure-report
[ERROR] check-source-release.log error log not empty:
Missing file for surefire in http://www.apache.org/dist/maven/surefire
 > surefire-3.0.0-M1-source-release.zip <
 > surefire-3.0.0-M1-source-release.zip.asc <
 > surefire-3.0.0-M1-source-release.zip.sha1 or .sha512 <
Different version than 3.0.0-M1 for surefire available in http://www.apache.org/dist/maven/surefire
 > surefire-2.22.1-source-release.zip <
 > surefire-2.22.1-source-release.zip.asc <
 > surefire-2.22.1-source-release.zip.sha512 <

[INFO] ------------------------------------------------------------------------
[INFO] BUILD FAILURE
[INFO] ------------------------------------------------------------------------
[INFO] Total time: 02:44 min
[INFO] Finished at: 2018-11-07T21:59:26Z
[INFO] ------------------------------------------------------------------------
[WARNING] The requested profile "apache.snapshots" could not be activated because it does not exist.
[INFO] [jenkins-event-spy] Generated /home/jenkins/jenkins-slave/workspace/-box_maven-dist-tool_master-CY5OLI3WBN7RDP53GNNEJXBSIBPIQFGOFRLFZCQDGUGWQHO5YYGQ@tmp/withMavenda6aea17/maven-spy-20181107-215642-4097639436504580196826.log
[ERROR] Failed to execute goal org.apache.maven.plugins:maven-site-plugin:3.7.1:site (default-site) on project dist-tool-plugin: Error generating dist-tool-plugin:1.0-SNAPSHOT:failure-report report: Dist Tool> Checks found inconsistencies in some released artifacts, see https://builds.apache.org/job/dist-tool-plugin/site/dist-tool-check-errors.html for more information -> [Help 1]
org.apache.maven.lifecycle.LifecycleExecutionException: Failed to execute goal org.apache.maven.plugins:maven-site-plugin:3.7.1:site (default-site) on project dist-tool-plugin: Error generating dist-tool-plugin:1.0-SNAPSHOT:failure-report report
    at org.apache.maven.lifecycle.internal.MojoExecutor.execute (MojoExecutor.java:213)
    at org.apache.maven.lifecycle.internal.MojoExecutor.execute (MojoExecutor.java:154)
    at org.apache.maven.lifecycle.internal.MojoExecutor.execute (MojoExecutor.java:146)
    at org.apache.maven.lifecycle.internal.LifecycleModuleBuilder.buildProject (LifecycleModuleBuilder.java:117)
    at org.apache.maven.lifecycle.internal.LifecycleModuleBuilder.buildProject (LifecycleModuleBuilder.java:81)
    at org.apache.maven.lifecycle.internal.builder.singlethreaded.SingleThreadedBuilder.build (SingleThreadedBuilder.java:56)
    at org.apache.maven.lifecycle.internal.LifecycleStarter.execute (LifecycleStarter.java:128)
    at org.apache.maven.DefaultMaven.doExecute (DefaultMaven.java:305)
    at org.apache.maven.DefaultMaven.doExecute (DefaultMaven.java:192)
    at org.apache.maven.DefaultMaven.execute (DefaultMaven.java:105)
    at org.apache.maven.cli.MavenCli.execute (MavenCli.java:954)
    at org.apache.maven.cli.MavenCli.doMain (MavenCli.java:288)
    at org.apache.maven.cli.MavenCli.main (MavenCli.java:192)
    at sun.reflect.NativeMethodAccessorImpl.invoke0 (Native Method)
    at sun.reflect.NativeMethodAccessorImpl.invoke (NativeMethodAccessorImpl.java:62)
    at sun.reflect.DelegatingMethodAccessorImpl.invoke (DelegatingMethodAccessorImpl.java:43)
    at java.lang.reflect.Method.invoke (Method.java:498)
    at org.codehaus.plexus.classworlds.launcher.Launcher.launchEnhanced (Launcher.java:289)
    at org.codehaus.plexus.classworlds.launcher.Launcher.launch (Launcher.java:229)
    at org.codehaus.plexus.classworlds.launcher.Launcher.mainWithExitCode (Launcher.java:415)
    at org.codehaus.plexus.classworlds.launcher.Launcher.main (Launcher.java:356)
Caused by: org.apache.maven.plugin.MojoExecutionException: Error generating dist-tool-plugin:1.0-SNAPSHOT:failure-report report
    at org.apache.maven.plugins.site.render.SiteMojo.execute (SiteMojo.java:155)
    at org.apache.maven.plugin.DefaultBuildPluginManager.executeMojo (DefaultBuildPluginManager.java:137)
    at org.apache.maven.lifecycle.internal.MojoExecutor.execute (MojoExecutor.java:208)
    at org.apache.maven.lifecycle.internal.MojoExecutor.execute (MojoExecutor.java:154)
    at org.apache.maven.lifecycle.internal.MojoExecutor.execute (MojoExecutor.java:146)
    at org.apache.maven.lifecycle.internal.LifecycleModuleBuilder.buildProject (LifecycleModuleBuilder.java:117)
    at org.apache.maven.lifecycle.internal.LifecycleModuleBuilder.buildProject (LifecycleModuleBuilder.java:81)
    at org.apache.maven.lifecycle.internal.builder.singlethreaded.SingleThreadedBuilder.build (SingleThreadedBuilder.java:56)
    at org.apache.maven.lifecycle.internal.LifecycleStarter.execute (LifecycleStarter.java:128)
    at org.apache.maven.DefaultMaven.doExecute (DefaultMaven.java:305)
    at org.apache.maven.DefaultMaven.doExecute (DefaultMaven.java:192)
    at org.apache.maven.DefaultMaven.execute (DefaultMaven.java:105)
    at org.apache.maven.cli.MavenCli.execute (MavenCli.java:954)
    at org.apache.maven.cli.MavenCli.doMain (MavenCli.java:288)
    at org.apache.maven.cli.MavenCli.main (MavenCli.java:192)
    at sun.reflect.NativeMethodAccessorImpl.invoke0 (Native Method)
    at sun.reflect.NativeMethodAccessorImpl.invoke (NativeMethodAccessorImpl.java:62)
    at sun.reflect.DelegatingMethodAccessorImpl.invoke (DelegatingMethodAccessorImpl.java:43)
    at java.lang.reflect.Method.invoke (Method.java:498)
    at org.codehaus.plexus.classworlds.launcher.Launcher.launchEnhanced (Launcher.java:289)
    at org.codehaus.plexus.classworlds.launcher.Launcher.launch (Launcher.java:229)
    at org.codehaus.plexus.classworlds.launcher.Launcher.mainWithExitCode (Launcher.java:415)
    at org.codehaus.plexus.classworlds.launcher.Launcher.main (Launcher.java:356)
Caused by: org.apache.maven.reporting.MavenReportException: Dist Tool> Checks found inconsistencies in some released artifacts, see https://builds.apache.org/job/dist-tool-plugin/site/dist-tool-check-errors.html for more information
    at org.apache.maven.dist.tools.DistCheckErrorsMojo.executeReport (DistCheckErrorsMojo.java:113)
    at org.apache.maven.reporting.AbstractMavenReport.generate (AbstractMavenReport.java:251)
    at org.apache.maven.plugins.site.render.ReportDocumentRenderer.renderDocument (ReportDocumentRenderer.java:230)
    at org.apache.maven.doxia.siterenderer.DefaultSiteRenderer.render (DefaultSiteRenderer.java:349)
    at org.apache.maven.plugins.site.render.SiteMojo.renderLocale (SiteMojo.java:198)
    at org.apache.maven.plugins.site.render.SiteMojo.execute (SiteMojo.java:147)
    at org.apache.maven.plugin.DefaultBuildPluginManager.executeMojo (DefaultBuildPluginManager.java:137)
    at org.apache.maven.lifecycle.internal.MojoExecutor.execute (MojoExecutor.java:208)
    at org.apache.maven.lifecycle.internal.MojoExecutor.execute (MojoExecutor.java:154)
    at org.apache.maven.lifecycle.internal.MojoExecutor.execute (MojoExecutor.java:146)
    at org.apache.maven.lifecycle.internal.LifecycleModuleBuilder.buildProject (LifecycleModuleBuilder.java:117)
    at org.apache.maven.lifecycle.internal.LifecycleModuleBuilder.buildProject (LifecycleModuleBuilder.java:81)
    at org.apache.maven.lifecycle.internal.builder.singlethreaded.SingleThreadedBuilder.build (SingleThreadedBuilder.java:56)
    at org.apache.maven.lifecycle.internal.LifecycleStarter.execute (LifecycleStarter.java:128)
    at org.apache.maven.DefaultMaven.doExecute (DefaultMaven.java:305)
    at org.apache.maven.DefaultMaven.doExecute (DefaultMaven.java:192)
    at org.apache.maven.DefaultMaven.execute (DefaultMaven.java:105)
    at org.apache.maven.cli.MavenCli.execute (MavenCli.java:954)
    at org.apache.maven.cli.MavenCli.doMain (MavenCli.java:288)
    at org.apache.maven.cli.MavenCli.main (MavenCli.java:192)
    at sun.reflect.NativeMethodAccessorImpl.invoke0 (Native Method)
    at sun.reflect.NativeMethodAccessorImpl.invoke (NativeMethodAccessorImpl.java:62)
    at sun.reflect.DelegatingMethodAccessorImpl.invoke (DelegatingMethodAccessorImpl.java:43)
    at java.lang.reflect.Method.invoke (Method.java:498)
    at org.codehaus.plexus.classworlds.launcher.Launcher.launchEnhanced (Launcher.java:289)
    at org.codehaus.plexus.classworlds.launcher.Launcher.launch (Launcher.java:229)
    at org.codehaus.plexus.classworlds.launcher.Launcher.mainWithExitCode (Launcher.java:415)
    at org.codehaus.plexus.classworlds.launcher.Launcher.main (Launcher.java:356)
[ERROR]
[ERROR] Re-run Maven using the -X switch to enable full debug logging.
[ERROR]
[ERROR] For more information about the errors and possible solutions, please read the following articles:
[ERROR] [Help 1] http://cwiki.apache.org/confluence/display/MAVEN/MojoExecutionException
[Pipeline] }
[withMaven] junitPublisher - Archive test results for Maven artifact org.apache.maven.dist.tools:dist-tool-plugin:1.0-SNAPSHOT generated by maven-surefire-plugin:test (default-test): target/surefire-reports/*.xml
Recording test results
[withMaven] junitPublisher - Archive test results for Maven artifact org.apache.maven.dist.tools:dist-tool-plugin:1.0-SNAPSHOT generated by maven-surefire-plugin:test (default-test): target/surefire-reports/*.xml
Recording test results
[withMaven] openTasksPublisher - Scan Tasks for Maven artifact org.apache.maven.dist.tools:dist-tool-plugin:1.0-SNAPSHOT in source directory src/main/java
[TASKS] Scanning folder '/home/jenkins/jenkins-slave/workspace/-box_maven-dist-tool_master-CY5OLI3WBN7RDP53GNNEJXBSIBPIQFGOFRLFZCQDGUGWQHO5YYGQ' for files matching the pattern 'src/main/java/**/*' - excludes: null
[TASKS] Found 20 files to scan for tasks
[TASKS] Found 2 open tasks.
Skipping warnings blame since pipelines do not have an SCM link.%n
[TASKS] Computing warning deltas based on reference build #201
[Pipeline] // withMaven
[Pipeline] }
[Pipeline] // stage
[Pipeline] stage
[Pipeline] { (Declarative: Post Actions)
[Pipeline] echo
Build result: FAILURE
[Pipeline] jiraIssueSelector
Reply | Threaded
Open this post in threaded view
|

Build succeeded in Jenkins: Maven TLP » maven-dist-tool » master #203

Apache Jenkins Server-2