Build failed in Jenkins: Maven TLP » maven-dependency-tree » master #31

classic Classic list List threaded Threaded
1 message Options
Reply | Threaded
Open this post in threaded view
|

Build failed in Jenkins: Maven TLP » maven-dependency-tree » master #31

Apache Jenkins Server-2
See https://builds.apache.org/job/maven-box/job/maven-dependency-tree/job/master/31/

Changes:

* Java 14 released, so Java 13 EOL. Include Java 15-ea

No tests ran.

Build log:
[...truncated 19675 lines...]
    at org.codehaus.plexus.classworlds.realm.ClassRealm.loadClass (ClassRealm.java:239)
    at java.lang.Class.getDeclaredFields0 (Native Method)
    at java.lang.Class.privateGetDeclaredFields (Class.java:3141)
    at java.lang.Class.getDeclaredFields (Class.java:2264)
    at com.google.inject.spi.InjectionPoint.getDeclaredFields (InjectionPoint.java:760)
    at com.google.inject.spi.InjectionPoint.getInjectionPoints (InjectionPoint.java:670)
    at com.google.inject.spi.InjectionPoint.forInstanceMethodsAndFields (InjectionPoint.java:378)
    at com.google.inject.internal.ConstructorBindingImpl.getInternalDependencies (ConstructorBindingImpl.java:182)
    at com.google.inject.internal.InjectorImpl.getInternalDependencies (InjectorImpl.java:661)
    at com.google.inject.internal.InjectorImpl.cleanup (InjectorImpl.java:617)
    at com.google.inject.internal.InjectorImpl.initializeJitBinding (InjectorImpl.java:603)
    at com.google.inject.internal.InjectorImpl.createJustInTimeBinding (InjectorImpl.java:932)
    at com.google.inject.internal.InjectorImpl.createJustInTimeBindingRecursive (InjectorImpl.java:852)
    at com.google.inject.internal.InjectorImpl.getJustInTimeBinding (InjectorImpl.java:291)
    at com.google.inject.internal.InjectorImpl.getBindingOrThrow (InjectorImpl.java:222)
    at com.google.inject.internal.InjectorImpl.getProviderOrThrow (InjectorImpl.java:1040)
    at com.google.inject.internal.InjectorImpl.getProvider (InjectorImpl.java:1071)
    at com.google.inject.internal.InjectorImpl.getProvider (InjectorImpl.java:1034)
    at com.google.inject.internal.InjectorImpl.getInstance (InjectorImpl.java:1086)
    at org.eclipse.sisu.space.AbstractDeferredClass.get (AbstractDeferredClass.java:48)
    at com.google.inject.internal.ProviderInternalFactory.provision (ProviderInternalFactory.java:85)
    at com.google.inject.internal.InternalFactoryToInitializableAdapter.provision (InternalFactoryToInitializableAdapter.java:57)
    at com.google.inject.internal.ProviderInternalFactory$1.call (ProviderInternalFactory.java:66)
    at com.google.inject.internal.ProvisionListenerStackCallback$Provision.provision (ProvisionListenerStackCallback.java:112)
    at com.google.inject.internal.ProvisionListenerStackCallback$Provision.provision (ProvisionListenerStackCallback.java:127)
    at com.google.inject.internal.ProvisionListenerStackCallback.provision (ProvisionListenerStackCallback.java:66)
    at com.google.inject.internal.ProviderInternalFactory.circularGet (ProviderInternalFactory.java:61)
    at com.google.inject.internal.InternalFactoryToInitializableAdapter.get (InternalFactoryToInitializableAdapter.java:47)
    at com.google.inject.internal.InjectorImpl$1.get (InjectorImpl.java:1050)
    at org.eclipse.sisu.inject.Guice4$1.get (Guice4.java:162)
    at org.eclipse.sisu.inject.LazyBeanEntry.getValue (LazyBeanEntry.java:81)
    at org.eclipse.sisu.plexus.LazyPlexusBean.getValue (LazyPlexusBean.java:51)
    at org.codehaus.plexus.DefaultPlexusContainer.lookup (DefaultPlexusContainer.java:263)
    at org.codehaus.plexus.DefaultPlexusContainer.lookup (DefaultPlexusContainer.java:255)
    at org.apache.maven.plugin.internal.DefaultMavenPluginManager.getConfiguredMojo (DefaultMavenPluginManager.java:520)
    at org.apache.maven.plugin.DefaultBuildPluginManager.executeMojo (DefaultBuildPluginManager.java:124)
    at org.apache.maven.lifecycle.internal.MojoExecutor.execute (MojoExecutor.java:210)
    at org.apache.maven.lifecycle.internal.MojoExecutor.execute (MojoExecutor.java:156)
    at org.apache.maven.lifecycle.internal.MojoExecutor.execute (MojoExecutor.java:148)
    at org.apache.maven.lifecycle.internal.LifecycleModuleBuilder.buildProject (LifecycleModuleBuilder.java:117)
    at org.apache.maven.lifecycle.internal.LifecycleModuleBuilder.buildProject (LifecycleModuleBuilder.java:81)
    at org.apache.maven.lifecycle.internal.builder.singlethreaded.SingleThreadedBuilder.build (SingleThreadedBuilder.java:56)
    at org.apache.maven.lifecycle.internal.LifecycleStarter.execute (LifecycleStarter.java:128)
    at org.apache.maven.DefaultMaven.doExecute (DefaultMaven.java:305)
    at org.apache.maven.DefaultMaven.doExecute (DefaultMaven.java:192)
    at org.apache.maven.DefaultMaven.execute (DefaultMaven.java:105)
    at org.apache.maven.cli.MavenCli.execute (MavenCli.java:956)
    at org.apache.maven.cli.MavenCli.doMain (MavenCli.java:288)
    at org.apache.maven.cli.MavenCli.main (MavenCli.java:192)
    at jdk.internal.reflect.NativeMethodAccessorImpl.invoke0 (Native Method)
    at jdk.internal.reflect.NativeMethodAccessorImpl.invoke (NativeMethodAccessorImpl.java:62)
    at jdk.internal.reflect.DelegatingMethodAccessorImpl.invoke (DelegatingMethodAccessorImpl.java:43)
    at java.lang.reflect.Method.invoke (Method.java:564)
    at org.codehaus.plexus.classworlds.launcher.Launcher.launchEnhanced (Launcher.java:282)
    at org.codehaus.plexus.classworlds.launcher.Launcher.launch (Launcher.java:225)
    at org.codehaus.plexus.classworlds.launcher.Launcher.mainWithExitCode (Launcher.java:406)
    at org.codehaus.plexus.classworlds.launcher.Launcher.main (Launcher.java:347)
[INFO] ------------------------------------------------------------------------
[INFO] BUILD FAILURE
[INFO] ------------------------------------------------------------------------
[INFO] Total time:  54.939 s
[INFO] Finished at: 2020-03-26T18:30:03-07:00
[INFO] ------------------------------------------------------------------------
[WARNING] The requested profile "run-its" could not be activated because it does not exist.
[INFO] [jenkins-event-spy] Generated F:\jenkins\jenkins-slave\workspace\box_maven-dependency-tree_master@2@tmp\withMaven5111e8f8\maven-spy-20200326-182908-11416325832979891368557.log
[ERROR] Failed to execute goal org.apache.maven.plugins:maven-site-plugin:3.7.1:attach-descriptor (attach-descriptor) on project maven-dependency-tree: Execution attach-descriptor of goal org.apache.maven.plugins:maven-site-plugin:3.7.1:attach-descriptor failed: A required class was missing while executing org.apache.maven.plugins:maven-site-plugin:3.7.1:attach-descriptor: org/apache/maven/doxia/site/decoration/inheritance/DecorationModelInheritanceAssembler
[ERROR] -----------------------------------------------------
[ERROR] realm =    plugin>org.apache.maven.plugins:maven-site-plugin:3.7.1
[ERROR] strategy = org.codehaus.plexus.classworlds.strategy.SelfFirstStrategy
[ERROR] urls[0] = file:/f:/jenkins/jenkins-slave/workspace/box_maven-dependency-tree_master@2/.repository/org/apache/maven/plugins/maven-site-plugin/3.7.1/maven-site-plugin-3.7.1.jar
[ERROR] urls[1] = file:/f:/jenkins/jenkins-slave/workspace/box_maven-dependency-tree_master@2/.repository/org/apache/maven/reporting/maven-reporting-exec/1.4/maven-reporting-exec-1.4.jar
[ERROR] urls[2] = file:/f:/jenkins/jenkins-slave/workspace/box_maven-dependency-tree_master@2/.repository/org/apache/maven/reporting/maven-reporting-api/3.0/maven-reporting-api-3.0.jar
[ERROR] urls[3] = file:/f:/jenkins/jenkins-slave/workspace/box_maven-dependency-tree_master@2/.repository/org/sonatype/aether/aether-util/1.7/aether-util-1.7.jar
[ERROR] urls[4] = file:/f:/jenkins/jenkins-slave/workspace/box_maven-dependency-tree_master@2/.repository/org/eclipse/aether/aether-util/0.9.0.M2/aether-util-0.9.0.M2.jar
[ERROR] urls[5] = file:/f:/jenkins/jenkins-slave/workspace/box_maven-dependency-tree_master@2/.repository/org/apache/maven/shared/maven-shared-utils/3.1.0/maven-shared-utils-3.1.0.jar
[ERROR] urls[6] = file:/f:/jenkins/jenkins-slave/workspace/box_maven-dependency-tree_master@2/.repository/org/codehaus/plexus/plexus-interpolation/1.14/plexus-interpolation-1.14.jar
[ERROR] urls[7] = file:/f:/jenkins/jenkins-slave/workspace/box_maven-dependency-tree_master@2/.repository/org/codehaus/plexus/plexus-component-annotations/1.7.1/plexus-component-annotations-1.7.1.jar
[ERROR] urls[8] = file:/f:/jenkins/jenkins-slave/workspace/box_maven-dependency-tree_master@2/.repository/org/sonatype/plexus/plexus-sec-dispatcher/1.3/plexus-sec-dispatcher-1.3.jar
[ERROR] urls[9] = file:/f:/jenkins/jenkins-slave/workspace/box_maven-dependency-tree_master@2/.repository/org/sonatype/plexus/plexus-cipher/1.4/plexus-cipher-1.4.jar
[ERROR] urls[10] = file:/f:/jenkins/jenkins-slave/workspace/box_maven-dependency-tree_master@2/.repository/org/apache/maven/maven-archiver/3.1.1/maven-archiver-3.1.1.jar
[ERROR] urls[11] = file:/f:/jenkins/jenkins-slave/workspace/box_maven-dependency-tree_master@2/.repository/org/sonatype/sisu/sisu-inject-bean/1.4.2/sisu-inject-bean-1.4.2.jar
[ERROR] urls[12] = file:/f:/jenkins/jenkins-slave/workspace/box_maven-dependency-tree_master@2/.repository/org/sonatype/sisu/sisu-guice/2.1.7/sisu-guice-2.1.7-noaop.jar
[ERROR] urls[13] = file:/f:/jenkins/jenkins-slave/workspace/box_maven-dependency-tree_master@2/.repository/org/codehaus/plexus/plexus-archiver/3.4/plexus-archiver-3.4.jar
[ERROR] urls[14] = file:/f:/jenkins/jenkins-slave/workspace/box_maven-dependency-tree_master@2/.repository/org/codehaus/plexus/plexus-io/2.7.1/plexus-io-2.7.1.jar
[ERROR] urls[15] = file:/f:/jenkins/jenkins-slave/workspace/box_maven-dependency-tree_master@2/.repository/org/apache/commons/commons-compress/1.11/commons-compress-1.11.jar
[ERROR] urls[16] = file:/f:/jenkins/jenkins-slave/workspace/box_maven-dependency-tree_master@2/.repository/org/iq80/snappy/snappy/0.4/snappy-0.4.jar
[ERROR] urls[17] = file:/f:/jenkins/jenkins-slave/workspace/box_maven-dependency-tree_master@2/.repository/org/tukaani/xz/1.5/xz-1.5.jar
[ERROR] urls[18] = file:/f:/jenkins/jenkins-slave/workspace/box_maven-dependency-tree_master@2/.repository/org/codehaus/plexus/plexus-i18n/1.0-beta-10/plexus-i18n-1.0-beta-10.jar
[ERROR] urls[19] = file:/f:/jenkins/jenkins-slave/workspace/box_maven-dependency-tree_master@2/.repository/org/codehaus/plexus/plexus-utils/3.0.24/plexus-utils-3.0.24.jar
[ERROR] urls[20] = file:/f:/jenkins/jenkins-slave/workspace/box_maven-dependency-tree_master@2/.repository/org/apache/maven/doxia/doxia-sink-api/1.8/doxia-sink-api-1.8.jar
[ERROR] urls[21] = file:/f:/jenkins/jenkins-slave/workspace/box_maven-dependency-tree_master@2/.repository/org/apache/maven/doxia/doxia-logging-api/1.8/doxia-logging-api-1.8.jar
[ERROR] urls[22] = file:/f:/jenkins/jenkins-slave/workspace/box_maven-dependency-tree_master@2/.repository/org/apache/maven/doxia/doxia-module-xhtml/1.8/doxia-module-xhtml-1.8.jar
[ERROR] urls[23] = file:/f:/jenkins/jenkins-slave/workspace/box_maven-dependency-tree_master@2/.repository/org/apache/maven/doxia/doxia-core/1.8/doxia-core-1.8.jar
[ERROR] urls[24] = file:/f:/jenkins/jenkins-slave/workspace/box_maven-dependency-tree_master@2/.repository/org/apache/httpcomponents/httpclient/4.0.2/httpclient-4.0.2.jar
[ERROR] urls[25] = file:/f:/jenkins/jenkins-slave/workspace/box_maven-dependency-tree_master@2/.repository/commons-codec/commons-codec/1.3/commons-codec-1.3.jar
[ERROR] urls[26] = file:/f:/jenkins/jenkins-slave/workspace/box_maven-dependency-tree_master@2/.repository/org/apache/httpcomponents/httpcore/4.0.1/httpcore-4.0.1.jar
[ERROR] urls[27] = file:/f:/jenkins/jenkins-slave/workspace/box_maven-dependency-tree_master@2/.repository/org/apache/maven/doxia/doxia-module-apt/1.8/doxia-module-apt-1.8.jar
[ERROR] urls[28] = file:/f:/jenkins/jenkins-slave/workspace/box_maven-dependency-tree_master@2/.repository/org/apache/maven/doxia/doxia-module-xdoc/1.8/doxia-module-xdoc-1.8.jar
[ERROR] urls[29] = file:/f:/jenkins/jenkins-slave/workspace/box_maven-dependency-tree_master@2/.repository/org/apache/maven/doxia/doxia-module-fml/1.8/doxia-module-fml-1.8.jar
[ERROR] urls[30] = file:/f:/jenkins/jenkins-slave/workspace/box_maven-dependency-tree_master@2/.repository/org/apache/maven/doxia/doxia-module-markdown/1.8/doxia-module-markdown-1.8.jar
[ERROR] urls[31] = file:/f:/jenkins/jenkins-slave/workspace/box_maven-dependency-tree_master@2/.repository/com/vladsch/flexmark/flexmark-all/0.18.4/flexmark-all-0.18.4.jar
[ERROR] urls[32] = file:/f:/jenkins/jenkins-slave/workspace/box_maven-dependency-tree_master@2/.repository/com/vladsch/flexmark/flexmark/0.18.4/flexmark-0.18.4.jar
[ERROR] urls[33] = file:/f:/jenkins/jenkins-slave/workspace/box_maven-dependency-tree_master@2/.repository/com/vladsch/flexmark/flexmark-ext-abbreviation/0.18.4/flexmark-ext-abbreviation-0.18.4.jar
[ERROR] urls[34] = file:/f:/jenkins/jenkins-slave/workspace/box_maven-dependency-tree_master@2/.repository/com/vladsch/flexmark/flexmark-ext-anchorlink/0.18.4/flexmark-ext-anchorlink-0.18.4.jar
[ERROR] urls[35] = file:/f:/jenkins/jenkins-slave/workspace/box_maven-dependency-tree_master@2/.repository/com/vladsch/flexmark/flexmark-ext-aside/0.18.4/flexmark-ext-aside-0.18.4.jar
[ERROR] urls[36] = file:/f:/jenkins/jenkins-slave/workspace/box_maven-dependency-tree_master@2/.repository/com/vladsch/flexmark/flexmark-ext-autolink/0.18.4/flexmark-ext-autolink-0.18.4.jar
[ERROR] urls[37] = file:/f:/jenkins/jenkins-slave/workspace/box_maven-dependency-tree_master@2/.repository/org/nibor/autolink/autolink/0.6.0/autolink-0.6.0.jar
[ERROR] urls[38] = file:/f:/jenkins/jenkins-slave/workspace/box_maven-dependency-tree_master@2/.repository/com/vladsch/flexmark/flexmark-ext-definition/0.18.4/flexmark-ext-definition-0.18.4.jar
[ERROR] urls[39] = file:/f:/jenkins/jenkins-slave/workspace/box_maven-dependency-tree_master@2/.repository/com/vladsch/flexmark/flexmark-ext-emoji/0.18.4/flexmark-ext-emoji-0.18.4.jar
[ERROR] urls[40] = file:/f:/jenkins/jenkins-slave/workspace/box_maven-dependency-tree_master@2/.repository/com/vladsch/flexmark/flexmark-ext-escaped-character/0.18.4/flexmark-ext-escaped-character-0.18.4.jar
[ERROR] urls[41] = file:/f:/jenkins/jenkins-slave/workspace/box_maven-dependency-tree_master@2/.repository/com/vladsch/flexmark/flexmark-ext-footnotes/0.18.4/flexmark-ext-footnotes-0.18.4.jar
[ERROR] urls[42] = file:/f:/jenkins/jenkins-slave/workspace/box_maven-dependency-tree_master@2/.repository/com/vladsch/flexmark/flexmark-ext-gfm-strikethrough/0.18.4/flexmark-ext-gfm-strikethrough-0.18.4.jar
[ERROR] urls[43] = file:/f:/jenkins/jenkins-slave/workspace/box_maven-dependency-tree_master@2/.repository/com/vladsch/flexmark/flexmark-ext-gfm-tables/0.18.4/flexmark-ext-gfm-tables-0.18.4.jar
[ERROR] urls[44] = file:/f:/jenkins/jenkins-slave/workspace/box_maven-dependency-tree_master@2/.repository/com/vladsch/flexmark/flexmark-ext-gfm-tasklist/0.18.4/flexmark-ext-gfm-tasklist-0.18.4.jar
[ERROR] urls[45] = file:/f:/jenkins/jenkins-slave/workspace/box_maven-dependency-tree_master@2/.repository/com/vladsch/flexmark/flexmark-ext-jekyll-front-matter/0.18.4/flexmark-ext-jekyll-front-matter-0.18.4.jar
[ERROR] urls[46] = file:/f:/jenkins/jenkins-slave/workspace/box_maven-dependency-tree_master@2/.repository/com/vladsch/flexmark/flexmark-ext-jekyll-tag/0.18.4/flexmark-ext-jekyll-tag-0.18.4.jar
[ERROR] urls[47] = file:/f:/jenkins/jenkins-slave/workspace/box_maven-dependency-tree_master@2/.repository/com/vladsch/flexmark/flexmark-ext-ins/0.18.4/flexmark-ext-ins-0.18.4.jar
[ERROR] urls[48] = file:/f:/jenkins/jenkins-slave/workspace/box_maven-dependency-tree_master@2/.repository/com/vladsch/flexmark/flexmark-ext-xwiki-macros/0.18.4/flexmark-ext-xwiki-macros-0.18.4.jar
[ERROR] urls[49] = file:/f:/jenkins/jenkins-slave/workspace/box_maven-dependency-tree_master@2/.repository/com/vladsch/flexmark/flexmark-ext-spec-example/0.18.4/flexmark-ext-spec-example-0.18.4.jar
[ERROR] urls[50] = file:/f:/jenkins/jenkins-slave/workspace/box_maven-dependency-tree_master@2/.repository/com/vladsch/flexmark/flexmark-test-util/0.18.4/flexmark-test-util-0.18.4.jar
[ERROR] urls[51] = file:/f:/jenkins/jenkins-slave/workspace/box_maven-dependency-tree_master@2/.repository/com/vladsch/flexmark/flexmark-ext-superscript/0.18.4/flexmark-ext-superscript-0.18.4.jar
[ERROR] urls[52] = file:/f:/jenkins/jenkins-slave/workspace/box_maven-dependency-tree_master@2/.repository/com/vladsch/flexmark/flexmark-ext-tables/0.18.4/flexmark-ext-tables-0.18.4.jar
[ERROR] urls[53] = file:/f:/jenkins/jenkins-slave/workspace/box_maven-dependency-tree_master@2/.repository/com/vladsch/flexmark/flexmark-ext-toc/0.18.4/flexmark-ext-toc-0.18.4.jar
[ERROR] urls[54] = file:/f:/jenkins/jenkins-slave/workspace/box_maven-dependency-tree_master@2/.repository/com/vladsch/flexmark/flexmark-ext-typographic/0.18.4/flexmark-ext-typographic-0.18.4.jar
[ERROR] urls[55] = file:/f:/jenkins/jenkins-slave/workspace/box_maven-dependency-tree_master@2/.repository/com/vladsch/flexmark/flexmark-ext-wikilink/0.18.4/flexmark-ext-wikilink-0.18.4.jar
[ERROR] urls[56] = file:/f:/jenkins/jenkins-slave/workspace/box_maven-dependency-tree_master@2/.repository/com/vladsch/flexmark/flexmark-ext-yaml-front-matter/0.18.4/flexmark-ext-yaml-front-matter-0.18.4.jar
[ERROR] urls[57] = file:/f:/jenkins/jenkins-slave/workspace/box_maven-dependency-tree_master@2/.repository/com/vladsch/flexmark/flexmark-formatter/0.18.4/flexmark-formatter-0.18.4.jar
[ERROR] urls[58] = file:/f:/jenkins/jenkins-slave/workspace/box_maven-dependency-tree_master@2/.repository/com/vladsch/flexmark/flexmark-html-parser/0.18.4/flexmark-html-parser-0.18.4.jar
[ERROR] urls[59] = file:/f:/jenkins/jenkins-slave/workspace/box_maven-dependency-tree_master@2/.repository/org/jsoup/jsoup/1.10.2/jsoup-1.10.2.jar
[ERROR] urls[60] = file:/f:/jenkins/jenkins-slave/workspace/box_maven-dependency-tree_master@2/.repository/com/vladsch/flexmark/flexmark-jira-converter/0.18.4/flexmark-jira-converter-0.18.4.jar
[ERROR] urls[61] = file:/f:/jenkins/jenkins-slave/workspace/box_maven-dependency-tree_master@2/.repository/com/vladsch/flexmark/flexmark-pdf-converter/0.18.4/flexmark-pdf-converter-0.18.4.jar
[ERROR] urls[62] = file:/f:/jenkins/jenkins-slave/workspace/box_maven-dependency-tree_master@2/.repository/com/openhtmltopdf/openhtmltopdf-core/0.0.1-RC9/openhtmltopdf-core-0.0.1-RC9.jar
[ERROR] urls[63] = file:/f:/jenkins/jenkins-slave/workspace/box_maven-dependency-tree_master@2/.repository/com/openhtmltopdf/openhtmltopdf-pdfbox/0.0.1-RC9/openhtmltopdf-pdfbox-0.0.1-RC9.jar
[ERROR] urls[64] = file:/f:/jenkins/jenkins-slave/workspace/box_maven-dependency-tree_master@2/.repository/org/apache/pdfbox/pdfbox/2.0.4/pdfbox-2.0.4.jar
[ERROR] urls[65] = file:/f:/jenkins/jenkins-slave/workspace/box_maven-dependency-tree_master@2/.repository/org/apache/pdfbox/fontbox/2.0.4/fontbox-2.0.4.jar
[ERROR] urls[66] = file:/f:/jenkins/jenkins-slave/workspace/box_maven-dependency-tree_master@2/.repository/com/openhtmltopdf/openhtmltopdf-rtl-support/0.0.1-RC9/openhtmltopdf-rtl-support-0.0.1-RC9.jar
[ERROR] urls[67] = file:/f:/jenkins/jenkins-slave/workspace/box_maven-dependency-tree_master@2/.repository/com/ibm/icu/icu4j/58.1/icu4j-58.1.jar
[ERROR] urls[68] = file:/f:/jenkins/jenkins-slave/workspace/box_maven-dependency-tree_master@2/.repository/com/openhtmltopdf/openhtmltopdf-jsoup-dom-converter/0.0.1-RC9/openhtmltopdf-jsoup-dom-converter-0.0.1-RC9.jar
[ERROR] urls[69] = file:/f:/jenkins/jenkins-slave/workspace/box_maven-dependency-tree_master@2/.repository/com/vladsch/flexmark/flexmark-profile-pegdown/0.18.4/flexmark-profile-pegdown-0.18.4.jar
[ERROR] urls[70] = file:/f:/jenkins/jenkins-slave/workspace/box_maven-dependency-tree_master@2/.repository/com/vladsch/flexmark/flexmark-util/0.18.4/flexmark-util-0.18.4.jar
[ERROR] urls[71] = file:/f:/jenkins/jenkins-slave/workspace/box_maven-dependency-tree_master@2/.repository/com/vladsch/flexmark/flexmark-youtrack-converter/0.18.4/flexmark-youtrack-converter-0.18.4.jar
[ERROR] urls[72] = file:/f:/jenkins/jenkins-slave/workspace/box_maven-dependency-tree_master@2/.repository/javax/servlet/servlet-api/2.5/servlet-api-2.5.jar
[ERROR] urls[73] = file:/f:/jenkins/jenkins-slave/workspace/box_maven-dependency-tree_master@2/.repository/org/apache/maven/doxia/doxia-decoration-model/1.8.1/doxia-decoration-model-1.8.1.jar
[ERROR] urls[74] = file:/f:/jenkins/jenkins-slave/workspace/box_maven-dependency-tree_master@2/.repository/org/apache/maven/doxia/doxia-site-renderer/1.8.1/doxia-site-renderer-1.8.1.jar
[ERROR] urls[75] = file:/f:/jenkins/jenkins-slave/workspace/box_maven-dependency-tree_master@2/.repository/org/apache/maven/doxia/doxia-skin-model/1.8.1/doxia-skin-model-1.8.1.jar
[ERROR] urls[76] = file:/f:/jenkins/jenkins-slave/workspace/box_maven-dependency-tree_master@2/.repository/junit/junit/3.8.1/junit-3.8.1.jar
[ERROR] urls[77] = file:/f:/jenkins/jenkins-slave/workspace/box_maven-dependency-tree_master@2/.repository/org/codehaus/plexus/plexus-velocity/1.2/plexus-velocity-1.2.jar
[ERROR] urls[78] = file:/f:/jenkins/jenkins-slave/workspace/box_maven-dependency-tree_master@2/.repository/org/apache/velocity/velocity/1.7/velocity-1.7.jar
[ERROR] urls[79] = file:/f:/jenkins/jenkins-slave/workspace/box_maven-dependency-tree_master@2/.repository/commons-lang/commons-lang/2.4/commons-lang-2.4.jar
[ERROR] urls[80] = file:/f:/jenkins/jenkins-slave/workspace/box_maven-dependency-tree_master@2/.repository/org/apache/velocity/velocity-tools/2.0/velocity-tools-2.0.jar
[ERROR] urls[81] = file:/f:/jenkins/jenkins-slave/workspace/box_maven-dependency-tree_master@2/.repository/commons-beanutils/commons-beanutils/1.7.0/commons-beanutils-1.7.0.jar
[ERROR] urls[82] = file:/f:/jenkins/jenkins-slave/workspace/box_maven-dependency-tree_master@2/.repository/commons-digester/commons-digester/1.8/commons-digester-1.8.jar
[ERROR] urls[83] = file:/f:/jenkins/jenkins-slave/workspace/box_maven-dependency-tree_master@2/.repository/commons-chain/commons-chain/1.1/commons-chain-1.1.jar
[ERROR] urls[84] = file:/f:/jenkins/jenkins-slave/workspace/box_maven-dependency-tree_master@2/.repository/commons-logging/commons-logging/1.1/commons-logging-1.1.jar
[ERROR] urls[85] = file:/f:/jenkins/jenkins-slave/workspace/box_maven-dependency-tree_master@2/.repository/commons-validator/commons-validator/1.3.1/commons-validator-1.3.1.jar
[ERROR] urls[86] = file:/f:/jenkins/jenkins-slave/workspace/box_maven-dependency-tree_master@2/.repository/dom4j/dom4j/1.1/dom4j-1.1.jar
[ERROR] urls[87] = file:/f:/jenkins/jenkins-slave/workspace/box_maven-dependency-tree_master@2/.repository/oro/oro/2.0.8/oro-2.0.8.jar
[ERROR] urls[88] = file:/f:/jenkins/jenkins-slave/workspace/box_maven-dependency-tree_master@2/.repository/sslext/sslext/1.2-0/sslext-1.2-0.jar
[ERROR] urls[89] = file:/f:/jenkins/jenkins-slave/workspace/box_maven-dependency-tree_master@2/.repository/org/apache/struts/struts-core/1.3.8/struts-core-1.3.8.jar
[ERROR] urls[90] = file:/f:/jenkins/jenkins-slave/workspace/box_maven-dependency-tree_master@2/.repository/antlr/antlr/2.7.2/antlr-2.7.2.jar
[ERROR] urls[91] = file:/f:/jenkins/jenkins-slave/workspace/box_maven-dependency-tree_master@2/.repository/org/apache/struts/struts-taglib/1.3.8/struts-taglib-1.3.8.jar
[ERROR] urls[92] = file:/f:/jenkins/jenkins-slave/workspace/box_maven-dependency-tree_master@2/.repository/org/apache/struts/struts-tiles/1.3.8/struts-tiles-1.3.8.jar
[ERROR] urls[93] = file:/f:/jenkins/jenkins-slave/workspace/box_maven-dependency-tree_master@2/.repository/commons-collections/commons-collections/3.2.1/commons-collections-3.2.1.jar
[ERROR] urls[94] = file:/f:/jenkins/jenkins-slave/workspace/box_maven-dependency-tree_master@2/.repository/org/apache/maven/doxia/doxia-integration-tools/1.8.1/doxia-integration-tools-1.8.1.jar
[ERROR] urls[95] = file:/f:/jenkins/jenkins-slave/workspace/box_maven-dependency-tree_master@2/.repository/org/mortbay/jetty/jetty/6.1.25/jetty-6.1.25.jar
[ERROR] urls[96] = file:/f:/jenkins/jenkins-slave/workspace/box_maven-dependency-tree_master@2/.repository/org/mortbay/jetty/servlet-api/2.5-20081211/servlet-api-2.5-20081211.jar
[ERROR] urls[97] = file:/f:/jenkins/jenkins-slave/workspace/box_maven-dependency-tree_master@2/.repository/org/mortbay/jetty/jetty-util/6.1.25/jetty-util-6.1.25.jar
[ERROR] urls[98] = file:/f:/jenkins/jenkins-slave/workspace/box_maven-dependency-tree_master@2/.repository/org/apache/commons/commons-lang3/3.4/commons-lang3-3.4.jar
[ERROR] urls[99] = file:/f:/jenkins/jenkins-slave/workspace/box_maven-dependency-tree_master@2/.repository/commons-io/commons-io/2.5/commons-io-2.5.jar
[ERROR] Number of foreign imports: 1
[ERROR] import: Entry[import  from realm ClassRealm[maven.api, parent: null]]
[ERROR]
[ERROR] -----------------------------------------------------: org.apache.maven.doxia.site.decoration.inheritance.DecorationModelInheritanceAssembler
[ERROR] -> [Help 1]
[ERROR]
[ERROR] To see the full stack trace of the errors, re-run Maven with the -e switch.
[ERROR] Re-run Maven using the -X switch to enable full debug logging.
[ERROR]
[ERROR] For more information about the errors and possible solutions, please read the following articles:
[ERROR] [Help 1] http://cwiki.apache.org/confluence/display/MAVEN/PluginContainerException
[Pipeline] }
[Pipeline] // dir
[Pipeline] }
[withMaven] junitPublisher - Archive test results for Maven artifact org.apache.maven.shared:maven-dependency-tree:jar:3.0.2-SNAPSHOT generated by maven-surefire-plugin:test (default-test): m\target\surefire-reports\*.xml
Recording test results
None of the test reports contained any result
[withMaven] Publishers: Junit Publisher: 9 ms
[Pipeline] // withMaven
[Pipeline] echo
[FAILURE-004] hudson.AbortException: script returned exit code 1
[Pipeline] cleanWs
[WS-CLEANUP] Deleting project workspace...
[WS-CLEANUP] Deferred wipeout is used...
[WS-CLEANUP] done
[Pipeline] cleanWs
[WS-CLEANUP] Deleting project workspace...
[WS-CLEANUP] Deferred wipeout is used...
[WS-CLEANUP] done
[Pipeline] }
[Pipeline] // stage
[Pipeline] }
[Pipeline] // node
[Pipeline] }
Failed in branch windows-jdk15
[INFO]
[INFO] --- maven-invoker-plugin:3.2.1:verify (integration-test) @ maven-dependency-tree ---
[INFO] -------------------------------------------------
[INFO] Build Summary:
[INFO]   Passed: 1, Failed: 0, Errors: 0, Skipped: 0
[INFO] -------------------------------------------------
[INFO] ------------------------------------------------------------------------
[INFO] BUILD SUCCESS
[INFO] ------------------------------------------------------------------------
[INFO] Total time:  01:38 min
[INFO] Finished at: 2020-03-26T18:30:08-07:00
[INFO] ------------------------------------------------------------------------
[WARNING] The requested profile "run-its" could not be activated because it does not exist.
[INFO] [jenkins-event-spy] Generated F:\jenkins\jenkins-slave\workspace\box_maven-dependency-tree_master@tmp\withMaven6bc5ca2c\maven-spy-20200326-182829-4955361400997243758349.log
[Pipeline] }
[Pipeline] // dir
[Pipeline] }
[withMaven] invokerPublisher - Archive invoker results for Maven artifact MavenArtifact{org.apache.maven.shared:maven-dependency-tree:jar:3.0.2-SNAPSHOT(version: 3.0.2-SNAPSHOT, snapshot:false) } generated by PluginInvocation{org.apache.maven.plugins:maven-invoker-plugin:3.2.1@integration-test  integration-test}: m\target\invoker-reports\*.xml
[withMaven] junitPublisher - Archive test results for Maven artifact org.apache.maven.shared:maven-dependency-tree:jar:3.0.2-SNAPSHOT generated by maven-surefire-plugin:test (default-test): m\target\surefire-reports\*.xml
Recording test results
None of the test reports contained any result
[withMaven] Publishers: Invoker Publisher: 411 ms, Junit Publisher: 11 ms
[Pipeline] // withMaven
[Pipeline] cleanWs
[WS-CLEANUP] Deleting project workspace...
[WS-CLEANUP] Deferred wipeout is used...
[WS-CLEANUP] done
[Pipeline] }
[Pipeline] // stage
[Pipeline] }
[Pipeline] // node
[Pipeline] }
[Pipeline] // parallel
[Pipeline] echo
[FAILURE-003] AbortException hudson.AbortException: script returned exit code 1
[Pipeline] stage
[Pipeline] { (Notifications)
[Pipeline] echo
Build result: FAILURE
[Pipeline] jiraIssueSelector
[Pipeline] echo
The authors of changes [rfscholte].
[Pipeline] echo
Sending email ...
[Pipeline] emailext