Build failed in Jenkins: Maven TLP » maven-dependency-plugin » dependabot/maven/jettyVersion-9.4.22.v20191022 #1

classic Classic list List threaded Threaded
1 message Options
Reply | Threaded
Open this post in threaded view
|

Build failed in Jenkins: Maven TLP » maven-dependency-plugin » dependabot/maven/jettyVersion-9.4.22.v20191022 #1

Apache Jenkins Server-2
See https://builds.apache.org/job/maven-box/job/maven-dependency-plugin/job/dependabot%252Fmaven%252FjettyVersion-9.4.22.v20191022/1/

No changes.

No tests ran.

Build log:
[...truncated 3378 lines...]
[WS-CLEANUP] Deleting project workspace...
[WS-CLEANUP] Deferred wipeout is used...
[WS-CLEANUP] done
[Pipeline] cleanWs
[WS-CLEANUP] Deleting project workspace...
[WS-CLEANUP] Deferred wipeout is used...
[WS-CLEANUP] done
[Pipeline] }
[Pipeline] // stage
[Pipeline] }
[Pipeline] // ws
[Pipeline] }
[Pipeline] // node
[Pipeline] }
Failed in branch windows-jdk11-m3.6.x_build
[INFO] [jenkins-event-spy] Generate F:\jenkins\jenkins-slave\workspace\_jettyVersion-9.4.22.v20191022_2@2@2@tmp\withMaven4540af52\maven-spy-20191102-035650-2861273852207798548628.log.tmp ...
[INFO] Error stacktraces are turned on.
[INFO] Scanning for projects...
[INFO]
[INFO] ----------< org.apache.maven.plugins:maven-dependency-plugin >----------
[INFO] Building Apache Maven Dependency Plugin 3.1.2-SNAPSHOT
[INFO] ----------------------------[ maven-plugin ]----------------------------
[INFO] Adding ignore: module-info
[INFO] Restricted to JDK 1.7 yet org.eclipse.jetty:jetty-util:jar:9.4.22.v20191022:test contains org/eclipse/jetty/util/StringUtil$CsvSplitState.class targeted to JDK 1.8
[INFO] Restricted to JDK 1.7 yet org.eclipse.jetty:jetty-http:jar:9.4.22.v20191022:test contains org/eclipse/jetty/http/HttpField$IntValueHttpField.class targeted to JDK 1.8
[INFO] Restricted to JDK 1.7 yet org.eclipse.jetty:jetty-server:jar:9.4.22.v20191022:test contains org/eclipse/jetty/server/HttpChannel$TransientListeners.class targeted to JDK 1.8
[INFO] Restricted to JDK 1.7 yet org.eclipse.jetty:jetty-xml:jar:9.4.22.v20191022:test contains org/eclipse/jetty/xml/XmlParser$Node.class targeted to JDK 1.8
[INFO] Restricted to JDK 1.7 yet org.eclipse.jetty:jetty-io:jar:9.4.22.v20191022:test contains org/eclipse/jetty/io/ManagedSelector$Accept.class targeted to JDK 1.8
[INFO] Restricted to JDK 1.7 yet org.eclipse.jetty:jetty-webapp:jar:9.4.22.v20191022:test contains org/eclipse/jetty/webapp/WebInfConfiguration$WebAppPathNameMatcher.class targeted to JDK 1.8
[INFO] Restricted to JDK 1.7 yet org.eclipse.jetty:jetty-security:jar:9.4.22.v20191022:test contains org/eclipse/jetty/security/RunAsToken.class targeted to JDK 1.8
[INFO] Restricted to JDK 1.7 yet org.eclipse.jetty:jetty-servlet:jar:9.4.22.v20191022:test contains org/eclipse/jetty/servlet/ServletHandler.class targeted to JDK 1.8
[WARNING] Rule 0: org.apache.maven.plugins.enforcer.EnforceBytecodeVersion failed with message:
Found Banned Dependency: org.eclipse.jetty:jetty-util:jar:9.4.22.v20191022
Found Banned Dependency: org.eclipse.jetty:jetty-http:jar:9.4.22.v20191022
Found Banned Dependency: org.eclipse.jetty:jetty-server:jar:9.4.22.v20191022
Found Banned Dependency: org.eclipse.jetty:jetty-xml:jar:9.4.22.v20191022
Found Banned Dependency: org.eclipse.jetty:jetty-io:jar:9.4.22.v20191022
Found Banned Dependency: org.eclipse.jetty:jetty-webapp:jar:9.4.22.v20191022
Found Banned Dependency: org.eclipse.jetty:jetty-security:jar:9.4.22.v20191022
Found Banned Dependency: org.eclipse.jetty:jetty-servlet:jar:9.4.22.v20191022
Use 'mvn dependency:tree' to locate the source of the banned dependencies.
[INFO] ------------------------------------------------------------------------
[INFO] BUILD FAILURE
[INFO] ------------------------------------------------------------------------
[INFO] Total time:  5.209 s
[INFO] Finished at: 2019-11-02T03:56:52-07:00
[INFO] ------------------------------------------------------------------------
[INFO] [jenkins-event-spy] Generated F:\jenkins\jenkins-slave\workspace\_jettyVersion-9.4.22.v20191022_2@2@tmp\withMaven179aa29f\maven-spy-20191102-035646-6491755861615780175305.log
[ERROR] Failed to execute goal org.apache.maven.plugins:maven-enforcer-plugin:1.4.1:enforce (enforce-bytecode-version) on project maven-dependency-plugin: Some Enforcer rules have failed. Look above for specific messages explaining why the rule failed. -> [Help 1]
org.apache.maven.lifecycle.LifecycleExecutionException: Failed to execute goal org.apache.maven.plugins:maven-enforcer-plugin:1.4.1:enforce (enforce-bytecode-version) on project maven-dependency-plugin: Some Enforcer rules have failed. Look above for specific messages explaining why the rule failed.
    at org.apache.maven.lifecycle.internal.MojoExecutor.execute (MojoExecutor.java:215)
    at org.apache.maven.lifecycle.internal.MojoExecutor.execute (MojoExecutor.java:156)
    at org.apache.maven.lifecycle.internal.MojoExecutor.execute (MojoExecutor.java:148)
    at org.apache.maven.lifecycle.internal.LifecycleModuleBuilder.buildProject (LifecycleModuleBuilder.java:117)
    at org.apache.maven.lifecycle.internal.LifecycleModuleBuilder.buildProject (LifecycleModuleBuilder.java:81)
    at org.apache.maven.lifecycle.internal.builder.singlethreaded.SingleThreadedBuilder.build (SingleThreadedBuilder.java:56)
    at org.apache.maven.lifecycle.internal.LifecycleStarter.execute (LifecycleStarter.java:128)
    at org.apache.maven.DefaultMaven.doExecute (DefaultMaven.java:305)
    at org.apache.maven.DefaultMaven.doExecute (DefaultMaven.java:192)
    at org.apache.maven.DefaultMaven.execute (DefaultMaven.java:105)
    at org.apache.maven.cli.MavenCli.execute (MavenCli.java:956)
    at org.apache.maven.cli.MavenCli.doMain (MavenCli.java:288)
    at org.apache.maven.cli.MavenCli.main (MavenCli.java:192)
    at jdk.internal.reflect.NativeMethodAccessorImpl.invoke0 (Native Method)
    at jdk.internal.reflect.NativeMethodAccessorImpl.invoke (NativeMethodAccessorImpl.java:62)
    at jdk.internal.reflect.DelegatingMethodAccessorImpl.invoke (DelegatingMethodAccessorImpl.java:43)
    at java.lang.reflect.Method.invoke (Method.java:567)
    at org.codehaus.plexus.classworlds.launcher.Launcher.launchEnhanced (Launcher.java:282)
    at org.codehaus.plexus.classworlds.launcher.Launcher.launch (Launcher.java:225)
    at org.codehaus.plexus.classworlds.launcher.Launcher.mainWithExitCode (Launcher.java:406)
    at org.codehaus.plexus.classworlds.launcher.Launcher.main (Launcher.java:347)
Caused by: org.apache.maven.plugin.MojoExecutionException: Some Enforcer rules have failed. Look above for specific messages explaining why the rule failed.
    at org.apache.maven.plugins.enforcer.EnforceMojo.execute (EnforceMojo.java:237)
    at org.apache.maven.plugin.DefaultBuildPluginManager.executeMojo (DefaultBuildPluginManager.java:137)
    at org.apache.maven.lifecycle.internal.MojoExecutor.execute (MojoExecutor.java:210)
    at org.apache.maven.lifecycle.internal.MojoExecutor.execute (MojoExecutor.java:156)
    at org.apache.maven.lifecycle.internal.MojoExecutor.execute (MojoExecutor.java:148)
    at org.apache.maven.lifecycle.internal.LifecycleModuleBuilder.buildProject (LifecycleModuleBuilder.java:117)
    at org.apache.maven.lifecycle.internal.LifecycleModuleBuilder.buildProject (LifecycleModuleBuilder.java:81)
    at org.apache.maven.lifecycle.internal.builder.singlethreaded.SingleThreadedBuilder.build (SingleThreadedBuilder.java:56)
    at org.apache.maven.lifecycle.internal.LifecycleStarter.execute (LifecycleStarter.java:128)
    at org.apache.maven.DefaultMaven.doExecute (DefaultMaven.java:305)
    at org.apache.maven.DefaultMaven.doExecute (DefaultMaven.java:192)
    at org.apache.maven.DefaultMaven.execute (DefaultMaven.java:105)
    at org.apache.maven.cli.MavenCli.execute (MavenCli.java:956)
    at org.apache.maven.cli.MavenCli.doMain (MavenCli.java:288)
    at org.apache.maven.cli.MavenCli.main (MavenCli.java:192)
    at jdk.internal.reflect.NativeMethodAccessorImpl.invoke0 (Native Method)
    at jdk.internal.reflect.NativeMethodAccessorImpl.invoke (NativeMethodAccessorImpl.java:62)
    at jdk.internal.reflect.DelegatingMethodAccessorImpl.invoke (DelegatingMethodAccessorImpl.java:43)
    at java.lang.reflect.Method.invoke (Method.java:567)
    at org.codehaus.plexus.classworlds.launcher.Launcher.launchEnhanced (Launcher.java:282)
    at org.codehaus.plexus.classworlds.launcher.Launcher.launch (Launcher.java:225)
    at org.codehaus.plexus.classworlds.launcher.Launcher.mainWithExitCode (Launcher.java:406)
    at org.codehaus.plexus.classworlds.launcher.Launcher.main (Launcher.java:347)
[ERROR]
[ERROR] Re-run Maven using the -X switch to enable full debug logging.
[ERROR]
[ERROR] For more information about the errors and possible solutions, please read the following articles:
[ERROR] [Help 1] http://cwiki.apache.org/confluence/display/MAVEN/MojoExecutionException
[Pipeline] }
[Pipeline] // dir
[Pipeline] }
[Fast Archiver] No prior successful build to compare, so performing full copy of artifacts
[withMaven] openTasksPublisher - Scan Tasks for Maven artifact org.apache.maven.plugins:maven-dependency-plugin:maven-plugin:3.1.2-SNAPSHOT in source directory windows-jdk13-m3.6.x_build\src\main\java
[INFO]
[INFO] --- maven-clean-plugin:3.1.0:clean (default-clean) @ maven-dependency-plugin ---
[INFO]
[INFO] --- maven-enforcer-plugin:1.4.1:enforce (enforce-maven-version) @ maven-dependency-plugin ---
[INFO]
[INFO] --- maven-enforcer-plugin:1.4.1:enforce (enforce-bytecode-version) @ maven-dependency-plugin ---
[TASKS] Scanning folder 'f:\jenkins\jenkins-slave\workspace\_jettyVersion-9.4.22.v20191022_2@2' for files matching the pattern 'windows-jdk13-m3.6.x_build\src\main\java\**\*' - excludes: null
[TASKS] Found 50 files to scan for tasks
[TASKS] Found 4 open tasks.
Skipping warnings blame since pipelines do not have an SCM link.%n
[withMaven] Publishers: Generated Artifacts Publisher: 7 ms, Open Task Scanner Publisher: 404 ms, Dependencies Fingerprint Publisher: 1 ms
[Pipeline] // withMaven
[Pipeline] cleanWs
[WS-CLEANUP] Deleting project workspace...
[WS-CLEANUP] Deferred wipeout is used...
[WS-CLEANUP] done
[Pipeline] cleanWs
[WS-CLEANUP] Deleting project workspace...
[WS-CLEANUP] Deferred wipeout is used...
[WS-CLEANUP] done
[Pipeline] }
[Pipeline] // stage
[Pipeline] }
[Pipeline] // ws
[Pipeline] }
[Pipeline] // node
[Pipeline] }
Failed in branch windows-jdk13-m3.6.x_build
[INFO] Adding ignore: module-info
[INFO] Restricted to JDK 1.7 yet org.eclipse.jetty:jetty-util:jar:9.4.22.v20191022:test contains org/eclipse/jetty/util/StringUtil$CsvSplitState.class targeted to JDK 1.8
[INFO] Restricted to JDK 1.7 yet org.eclipse.jetty:jetty-http:jar:9.4.22.v20191022:test contains org/eclipse/jetty/http/HttpField$IntValueHttpField.class targeted to JDK 1.8
[INFO] Restricted to JDK 1.7 yet org.eclipse.jetty:jetty-server:jar:9.4.22.v20191022:test contains org/eclipse/jetty/server/HttpChannel$TransientListeners.class targeted to JDK 1.8
[INFO] Restricted to JDK 1.7 yet org.eclipse.jetty:jetty-xml:jar:9.4.22.v20191022:test contains org/eclipse/jetty/xml/XmlParser$Node.class targeted to JDK 1.8
[INFO] Restricted to JDK 1.7 yet org.eclipse.jetty:jetty-io:jar:9.4.22.v20191022:test contains org/eclipse/jetty/io/ManagedSelector$Accept.class targeted to JDK 1.8
[INFO] Restricted to JDK 1.7 yet org.eclipse.jetty:jetty-webapp:jar:9.4.22.v20191022:test contains org/eclipse/jetty/webapp/WebInfConfiguration$WebAppPathNameMatcher.class targeted to JDK 1.8
[INFO] Restricted to JDK 1.7 yet org.eclipse.jetty:jetty-security:jar:9.4.22.v20191022:test contains org/eclipse/jetty/security/RunAsToken.class targeted to JDK 1.8
[INFO] Restricted to JDK 1.7 yet org.eclipse.jetty:jetty-servlet:jar:9.4.22.v20191022:test contains org/eclipse/jetty/servlet/ServletHandler.class targeted to JDK 1.8
[WARNING] Rule 0: org.apache.maven.plugins.enforcer.EnforceBytecodeVersion failed with message:
Found Banned Dependency: org.eclipse.jetty:jetty-util:jar:9.4.22.v20191022
Found Banned Dependency: org.eclipse.jetty:jetty-http:jar:9.4.22.v20191022
Found Banned Dependency: org.eclipse.jetty:jetty-server:jar:9.4.22.v20191022
Found Banned Dependency: org.eclipse.jetty:jetty-xml:jar:9.4.22.v20191022
Found Banned Dependency: org.eclipse.jetty:jetty-io:jar:9.4.22.v20191022
Found Banned Dependency: org.eclipse.jetty:jetty-webapp:jar:9.4.22.v20191022
Found Banned Dependency: org.eclipse.jetty:jetty-security:jar:9.4.22.v20191022
Found Banned Dependency: org.eclipse.jetty:jetty-servlet:jar:9.4.22.v20191022
Use 'mvn dependency:tree' to locate the source of the banned dependencies.
[INFO] ------------------------------------------------------------------------
[INFO] BUILD FAILURE
[INFO] ------------------------------------------------------------------------
[INFO] Total time:  4.444 s
[INFO] Finished at: 2019-11-02T03:56:54-07:00
[INFO] ------------------------------------------------------------------------
[INFO] [jenkins-event-spy] Generated F:\jenkins\jenkins-slave\workspace\_jettyVersion-9.4.22.v20191022_2@2@2@tmp\withMaven4540af52\maven-spy-20191102-035650-2861273852207798548628.log
[ERROR] Failed to execute goal org.apache.maven.plugins:maven-enforcer-plugin:1.4.1:enforce (enforce-bytecode-version) on project maven-dependency-plugin: Some Enforcer rules have failed. Look above for specific messages explaining why the rule failed. -> [Help 1]
org.apache.maven.lifecycle.LifecycleExecutionException: Failed to execute goal org.apache.maven.plugins:maven-enforcer-plugin:1.4.1:enforce (enforce-bytecode-version) on project maven-dependency-plugin: Some Enforcer rules have failed. Look above for specific messages explaining why the rule failed.
    at org.apache.maven.lifecycle.internal.MojoExecutor.execute (MojoExecutor.java:215)
    at org.apache.maven.lifecycle.internal.MojoExecutor.execute (MojoExecutor.java:156)
    at org.apache.maven.lifecycle.internal.MojoExecutor.execute (MojoExecutor.java:148)
    at org.apache.maven.lifecycle.internal.LifecycleModuleBuilder.buildProject (LifecycleModuleBuilder.java:117)
    at org.apache.maven.lifecycle.internal.LifecycleModuleBuilder.buildProject (LifecycleModuleBuilder.java:81)
    at org.apache.maven.lifecycle.internal.builder.singlethreaded.SingleThreadedBuilder.build (SingleThreadedBuilder.java:56)
    at org.apache.maven.lifecycle.internal.LifecycleStarter.execute (LifecycleStarter.java:128)
    at org.apache.maven.DefaultMaven.doExecute (DefaultMaven.java:305)
    at org.apache.maven.DefaultMaven.doExecute (DefaultMaven.java:192)
    at org.apache.maven.DefaultMaven.execute (DefaultMaven.java:105)
    at org.apache.maven.cli.MavenCli.execute (MavenCli.java:956)
    at org.apache.maven.cli.MavenCli.doMain (MavenCli.java:288)
    at org.apache.maven.cli.MavenCli.main (MavenCli.java:192)
    at jdk.internal.reflect.NativeMethodAccessorImpl.invoke0 (Native Method)
    at jdk.internal.reflect.NativeMethodAccessorImpl.invoke (NativeMethodAccessorImpl.java:62)
    at jdk.internal.reflect.DelegatingMethodAccessorImpl.invoke (DelegatingMethodAccessorImpl.java:43)
    at java.lang.reflect.Method.invoke (Method.java:567)
    at org.codehaus.plexus.classworlds.launcher.Launcher.launchEnhanced (Launcher.java:282)
    at org.codehaus.plexus.classworlds.launcher.Launcher.launch (Launcher.java:225)
    at org.codehaus.plexus.classworlds.launcher.Launcher.mainWithExitCode (Launcher.java:406)
    at org.codehaus.plexus.classworlds.launcher.Launcher.main (Launcher.java:347)
Caused by: org.apache.maven.plugin.MojoExecutionException: Some Enforcer rules have failed. Look above for specific messages explaining why the rule failed.
    at org.apache.maven.plugins.enforcer.EnforceMojo.execute (EnforceMojo.java:237)
    at org.apache.maven.plugin.DefaultBuildPluginManager.executeMojo (DefaultBuildPluginManager.java:137)
    at org.apache.maven.lifecycle.internal.MojoExecutor.execute (MojoExecutor.java:210)
    at org.apache.maven.lifecycle.internal.MojoExecutor.execute (MojoExecutor.java:156)
    at org.apache.maven.lifecycle.internal.MojoExecutor.execute (MojoExecutor.java:148)
    at org.apache.maven.lifecycle.internal.LifecycleModuleBuilder.buildProject (LifecycleModuleBuilder.java:117)
    at org.apache.maven.lifecycle.internal.LifecycleModuleBuilder.buildProject (LifecycleModuleBuilder.java:81)
    at org.apache.maven.lifecycle.internal.builder.singlethreaded.SingleThreadedBuilder.build (SingleThreadedBuilder.java:56)
    at org.apache.maven.lifecycle.internal.LifecycleStarter.execute (LifecycleStarter.java:128)
    at org.apache.maven.DefaultMaven.doExecute (DefaultMaven.java:305)
    at org.apache.maven.DefaultMaven.doExecute (DefaultMaven.java:192)
    at org.apache.maven.DefaultMaven.execute (DefaultMaven.java:105)
    at org.apache.maven.cli.MavenCli.execute (MavenCli.java:956)
    at org.apache.maven.cli.MavenCli.doMain (MavenCli.java:288)
    at org.apache.maven.cli.MavenCli.main (MavenCli.java:192)
    at jdk.internal.reflect.NativeMethodAccessorImpl.invoke0 (Native Method)
    at jdk.internal.reflect.NativeMethodAccessorImpl.invoke (NativeMethodAccessorImpl.java:62)
    at jdk.internal.reflect.DelegatingMethodAccessorImpl.invoke (DelegatingMethodAccessorImpl.java:43)
    at java.lang.reflect.Method.invoke (Method.java:567)
    at org.codehaus.plexus.classworlds.launcher.Launcher.launchEnhanced (Launcher.java:282)
    at org.codehaus.plexus.classworlds.launcher.Launcher.launch (Launcher.java:225)
    at org.codehaus.plexus.classworlds.launcher.Launcher.mainWithExitCode (Launcher.java:406)
    at org.codehaus.plexus.classworlds.launcher.Launcher.main (Launcher.java:347)
[ERROR]
[ERROR] Re-run Maven using the -X switch to enable full debug logging.
[ERROR]
[ERROR] For more information about the errors and possible solutions, please read the following articles:
[ERROR] [Help 1] http://cwiki.apache.org/confluence/display/MAVEN/MojoExecutionException
[Pipeline] }
[Pipeline] // dir
[Pipeline] }
[Fast Archiver] No prior successful build to compare, so performing full copy of artifacts
[withMaven] openTasksPublisher - Scan Tasks for Maven artifact org.apache.maven.plugins:maven-dependency-plugin:maven-plugin:3.1.2-SNAPSHOT in source directory windows-jdk14-m3.6.x_build\src\main\java
[TASKS] Scanning folder 'f:\jenkins\jenkins-slave\workspace\_jettyVersion-9.4.22.v20191022_2@2@2' for files matching the pattern 'windows-jdk14-m3.6.x_build\src\main\java\**\*' - excludes: null
[TASKS] Found 50 files to scan for tasks
[TASKS] Found 4 open tasks.
Skipping warnings blame since pipelines do not have an SCM link.%n
[withMaven] Publishers: Generated Artifacts Publisher: 8 ms, Open Task Scanner Publisher: 367 ms, Dependencies Fingerprint Publisher: 1 ms
[Pipeline] // withMaven
[Pipeline] cleanWs
[WS-CLEANUP] Deleting project workspace...
[WS-CLEANUP] Deferred wipeout is used...
[WS-CLEANUP] done
[Pipeline] cleanWs
[WS-CLEANUP] Deleting project workspace...
[WS-CLEANUP] Deferred wipeout is used...
[WS-CLEANUP] done
[Pipeline] }
[Pipeline] // stage
[Pipeline] }
[Pipeline] // ws
[Pipeline] }
[Pipeline] // node
[Pipeline] }
Failed in branch windows-jdk14-m3.6.x_build
[Pipeline] // parallel
[Pipeline] stage
[Pipeline] { (Notifications)
[Pipeline] echo
Build result: FAILURE
[Pipeline] jiraIssueSelector
[Pipeline] echo
The authors of changes [].
[Pipeline] echo
Sending email ...
[Pipeline] emailext