Build failed in Jenkins: Maven TLP » maven-dependency-plugin » MDEP-625 #6

classic Classic list List threaded Threaded
2 messages Options
Reply | Threaded
Open this post in threaded view
|

Build failed in Jenkins: Maven TLP » maven-dependency-plugin » MDEP-625 #6

Apache Jenkins Server-2
See https://builds.apache.org/job/maven-box/job/maven-dependency-plugin/job/MDEP-625/6/

No changes.

12 tests failed.
FAILED:  org.apache.maven.plugins.dependency.TestGetMojo.testRemoteRepositories

Error Message:
The parameter filter is not allowed to be null.

Stack Trace:
java.lang.IllegalArgumentException: The parameter filter is not allowed to be null.
        at org.apache.maven.plugins.dependency.TestGetMojo.testRemoteRepositories(TestGetMojo.java:96)


FAILED:  org.apache.maven.plugins.dependency.TestGetMojo.testRemoteRepositories

Error Message:
The parameter filter is not allowed to be null.

Stack Trace:
java.lang.IllegalArgumentException: The parameter filter is not allowed to be null.
        at org.apache.maven.plugins.dependency.TestGetMojo.testRemoteRepositories(TestGetMojo.java:96)


FAILED:  org.apache.maven.plugins.dependency.TestGetMojo.testRemoteRepositories

Error Message:
The parameter filter is not allowed to be null.

Stack Trace:
java.lang.IllegalArgumentException: The parameter filter is not allowed to be null.
        at org.apache.maven.plugins.dependency.TestGetMojo.testRemoteRepositories(TestGetMojo.java:96)


FAILED:  org.apache.maven.plugins.dependency.TestGetMojo.testRemoteRepositories

Error Message:
The parameter filter is not allowed to be null.

Stack Trace:
java.lang.IllegalArgumentException: The parameter filter is not allowed to be null.
        at org.apache.maven.plugins.dependency.TestGetMojo.testRemoteRepositories(TestGetMojo.java:96)


FAILED:  org.apache.maven.plugins.dependency.TestGetMojo.testRemoteRepositories

Error Message:
The parameter filter is not allowed to be null.

Stack Trace:
java.lang.IllegalArgumentException: The parameter filter is not allowed to be null.
        at org.apache.maven.plugins.dependency.TestGetMojo.testRemoteRepositories(TestGetMojo.java:96)


FAILED:  org.apache.maven.plugins.dependency.TestGetMojo.testRemoteRepositories

Error Message:
The parameter filter is not allowed to be null.

Stack Trace:
java.lang.IllegalArgumentException: The parameter filter is not allowed to be null.
        at org.apache.maven.plugins.dependency.TestGetMojo.testRemoteRepositories(TestGetMojo.java:96)


FAILED:  org.apache.maven.plugins.dependency.TestGetMojo.testRemoteRepositories

Error Message:
The parameter filter is not allowed to be null.

Stack Trace:
java.lang.IllegalArgumentException: The parameter filter is not allowed to be null.
        at org.apache.maven.plugins.dependency.TestGetMojo.testRemoteRepositories(TestGetMojo.java:96)


FAILED:  org.apache.maven.plugins.dependency.TestGetMojo.testRemoteRepositories

Error Message:
The parameter filter is not allowed to be null.

Stack Trace:
java.lang.IllegalArgumentException: The parameter filter is not allowed to be null.
        at org.apache.maven.plugins.dependency.TestGetMojo.testRemoteRepositories(TestGetMojo.java:96)


FAILED:  org.apache.maven.plugins.dependency.TestGetMojo.testRemoteRepositories

Error Message:
The parameter filter is not allowed to be null.

Stack Trace:
java.lang.IllegalArgumentException: The parameter filter is not allowed to be null.
        at org.apache.maven.plugins.dependency.TestGetMojo.testRemoteRepositories(TestGetMojo.java:96)


FAILED:  org.apache.maven.plugins.dependency.TestGetMojo.testRemoteRepositories

Error Message:
The parameter filter is not allowed to be null.

Stack Trace:
java.lang.IllegalArgumentException: The parameter filter is not allowed to be null.
        at org.apache.maven.plugins.dependency.TestGetMojo.testRemoteRepositories(TestGetMojo.java:96)


FAILED:  org.apache.maven.plugins.dependency.TestGetMojo.testRemoteRepositories

Error Message:
The parameter filter is not allowed to be null.

Stack Trace:
java.lang.IllegalArgumentException: The parameter filter is not allowed to be null.
        at org.apache.maven.plugins.dependency.TestGetMojo.testRemoteRepositories(TestGetMojo.java:96)


FAILED:  org.apache.maven.plugins.dependency.TestGetMojo.testRemoteRepositories

Error Message:
The parameter filter is not allowed to be null.

Stack Trace:
java.lang.IllegalArgumentException: The parameter filter is not allowed to be null.
        at org.apache.maven.plugins.dependency.TestGetMojo.testRemoteRepositories(TestGetMojo.java:96)




Build log:
[...truncated 5.97 MB...]
[windows-jdk9-m3.5.x_build] [INFO] Downloaded from central: https://repo.maven.apache.org/maven2/commons-beanutils/commons-beanutils/1.9.2/commons-beanutils-1.9.2.jar (234 kB at 2.1 MB/s)
[windows-jdk9-m3.5.x_build] [INFO] Downloading from central: https://repo.maven.apache.org/maven2/com/google/guava/guava/19.0/guava-19.0.jar
[windows-jdk9-m3.5.x_build] [INFO] Downloaded from central: https://repo.maven.apache.org/maven2/org/antlr/antlr4-runtime/4.5.3/antlr4-runtime-4.5.3.jar (302 kB at 2.7 MB/s)
[windows-jdk9-m3.5.x_build] [INFO] Downloading from central: https://repo.maven.apache.org/maven2/javax/xml/bind/jaxb-api/2.3.0/jaxb-api-2.3.0.jar
[windows-jdk9-m3.5.x_build] [INFO] Downloaded from central: https://repo.maven.apache.org/maven2/commons-cli/commons-cli/1.3.1/commons-cli-1.3.1.jar (53 kB at 417 kB/s)
[windows-jdk9-m3.5.x_build] [INFO] Downloaded from central: https://repo.maven.apache.org/maven2/javax/xml/bind/jaxb-api/2.3.0/jaxb-api-2.3.0.jar (126 kB at 924 kB/s)
[windows-jdk9-m3.5.x_build] [INFO] Downloaded from central: https://repo.maven.apache.org/maven2/org/codehaus/plexus/plexus-resources/1.1.0/plexus-resources-1.1.0.jar (23 kB at 148 kB/s)
[windows-jdk9-m3.5.x_build] [INFO] Downloaded from central: https://repo.maven.apache.org/maven2/com/google/guava/guava/19.0/guava-19.0.jar (2.3 MB at 14 MB/s)
[windows-jdk9-m3.5.x_build] [INFO] Downloaded from central: https://repo.maven.apache.org/maven2/org/apache/maven/doxia/doxia-integration-tools/1.6/doxia-integration-tools-1.6.jar (45 kB at 214 kB/s)
[windows-jdk9-m3.5.x_build] [INFO] There is 1 error reported by Checkstyle 6.18 with config/maven_checks.xml ruleset.
[windows-jdk9-m3.5.x_build] [INFO] Ignored 1 error, 0 violation remaining.
[windows-jdk9-m3.5.x_build] [INFO]
[windows-jdk9-m3.5.x_build] [INFO] --- maven-invoker-plugin:3.1.0:verify (integration-test) @ maven-dependency-plugin ---
[windows-jdk9-m3.5.x_build] [INFO] -------------------------------------------------
[windows-jdk9-m3.5.x_build] [INFO] Build Summary:
[windows-jdk9-m3.5.x_build] [INFO]   Passed: 50, Failed: 7, Errors: 0, Skipped: 1
[windows-jdk9-m3.5.x_build] [INFO] -------------------------------------------------
[windows-jdk9-m3.5.x_build] [ERROR] The following builds failed:
[windows-jdk9-m3.5.x_build] [ERROR] *  get-artifact-maven-plugin\pom.xml
[windows-jdk9-m3.5.x_build] [ERROR] *  get-artifact\pom.xml
[windows-jdk9-m3.5.x_build] [ERROR] *  get-gav\pom.xml
[windows-jdk9-m3.5.x_build] [ERROR] *  go-offline\pom.xml
[windows-jdk9-m3.5.x_build] [ERROR] *  resolve-plugins-exclude-reactor\pom.xml
[windows-jdk9-m3.5.x_build] [ERROR] *  resolve-plugins-with-exclude\pom.xml
[windows-jdk9-m3.5.x_build] [ERROR] *  resolve-plugins\pom.xml
[windows-jdk9-m3.5.x_build] [INFO] -------------------------------------------------
[windows-jdk9-m3.5.x_build] [INFO] ------------------------------------------------------------------------
[windows-jdk9-m3.5.x_build] [INFO] BUILD FAILURE
[windows-jdk9-m3.5.x_build] [INFO] ------------------------------------------------------------------------
[windows-jdk9-m3.5.x_build] [INFO] Total time: 20:39 min
[windows-jdk9-m3.5.x_build] [INFO] Finished at: 2018-09-11T14:00:14Z
[windows-jdk9-m3.5.x_build] [INFO] Final Memory: 52M/174M
[windows-jdk9-m3.5.x_build] [INFO] ------------------------------------------------------------------------
[windows-jdk9-m3.5.x_build] [INFO] [jenkins-event-spy] Generated F:\jenkins\jenkins-slave\workspace\-dependency-plugin_MDEP-625-3I6V7G3727HFCGSCWRQH5RTCWRSMXZQ3ZEOVZRI3U3XLP2Z7WCCQ@tmp\withMaven2029e7f3\maven-spy-20180911-133934-302764163216545202656.log
[windows-jdk9-m3.5.x_build] [ERROR] Failed to execute goal org.apache.maven.plugins:maven-invoker-plugin:3.1.0:verify (integration-test) on project maven-dependency-plugin: 7 builds failed. See console output above for details. -> [Help 1]
[windows-jdk9-m3.5.x_build] [ERROR]
[windows-jdk9-m3.5.x_build] [ERROR] To see the full stack trace of the errors, re-run Maven with the -e switch.
[windows-jdk9-m3.5.x_build] [ERROR] Re-run Maven using the -X switch to enable full debug logging.
[windows-jdk9-m3.5.x_build] [ERROR]
[windows-jdk9-m3.5.x_build] [ERROR] For more information about the errors and possible solutions, please read the following articles:
[windows-jdk9-m3.5.x_build] [ERROR] [Help 1] http://cwiki.apache.org/confluence/display/MAVEN/MojoFailureException
[Pipeline] [windows-jdk9-m3.5.x_build] }
[Pipeline] [windows-jdk9-m3.5.x_build] // dir
[Pipeline] [windows-jdk9-m3.5.x_build] }
[windows-jdk9-m3.5.x_build] [Fast Archiver] No prior successful build to compare, so performing full copy of artifacts
[windows-jdk9-m3.5.x_build] [withMaven] invokerPublisher - Archive invoker results for Maven artifact MavenArtifact{org.apache.maven.plugins:maven-dependency-plugin::3.1.2-SNAPSHOT(version: 3.1.2-SNAPSHOT, snapshot:false) } generated by PluginInvocation{org.apache.maven.plugins:maven-invoker-plugin:3.1.0@integration-test  integration-test}: windows-jdk9-m3.5.x_build\target\invoker-reports\*.xml
[windows-jdk9-m3.5.x_build] performing MavenInvokerRecorder, reportsFilenamePattern:'**/windows-jdk9-m3.5.x_build\target\invoker-reports/BUILD*.xml', invokerBuildDir:'**/windows-jdk9-m3.5.x_build\target\it'
[windows-jdk9-m3.5.x_build] Found reports:[f:\jenkins\jenkins-slave\workspace\-dependency-plugin_MDEP-625-3I6V7G3727HFCGSCWRQH5RTCWRSMXZQ3ZEOVZRI3U3XLP2Z7WCCQ\windows-jdk9-m3.5.x_build\target\invoker-reports\BUILD-analyze-dep-mgt.xml, f:\jenkins\jenkins-slave\workspace\-dependency-plugin_MDEP-625-3I6V7G3727HFCGSCWRQH5RTCWRSMXZQ3ZEOVZRI3U3XLP2Z7WCCQ\windows-jdk9-m3.5.x_build\target\invoker-reports\BUILD-analyze-ignore-dependency.xml, f:\jenkins\jenkins-slave\workspace\-dependency-plugin_MDEP-625-3I6V7G3727HFCGSCWRQH5RTCWRSMXZQ3ZEOVZRI3U3XLP2Z7WCCQ\windows-jdk9-m3.5.x_build\target\invoker-reports\BUILD-analyze-ignore-unused-declared-dependency.xml, f:\jenkins\jenkins-slave\workspace\-dependency-plugin_MDEP-625-3I6V7G3727HFCGSCWRQH5RTCWRSMXZQ3ZEOVZRI3U3XLP2Z7WCCQ\windows-jdk9-m3.5.x_build\target\invoker-reports\BUILD-analyze-ignore-used-undeclared-dependency.xml, f:\jenkins\jenkins-slave\workspace\-dependency-plugin_MDEP-625-3I6V7G3727HFCGSCWRQH5RTCWRSMXZQ3ZEOVZRI3U3XLP2Z7WCCQ\windows-jdk9-m3.5.x_build\target\invoker-reports\BUILD-analyze-multimodule-project.xml, f:\jenkins\jenkins-slave\workspace\-dependency-plugin_MDEP-625-3I6V7G3727HFCGSCWRQH5RTCWRSMXZQ3ZEOVZRI3U3XLP2Z7WCCQ\windows-jdk9-m3.5.x_build\target\invoker-reports\BUILD-analyze-report.xml, f:\jenkins\jenkins-slave\workspace\-dependency-plugin_MDEP-625-3I6V7G3727HFCGSCWRQH5RTCWRSMXZQ3ZEOVZRI3U3XLP2Z7WCCQ\windows-jdk9-m3.5.x_build\target\invoker-reports\BUILD-analyze.xml, f:\jenkins\jenkins-slave\workspace\-dependency-plugin_MDEP-625-3I6V7G3727HFCGSCWRQH5RTCWRSMXZQ3ZEOVZRI3U3XLP2Z7WCCQ\windows-jdk9-m3.5.x_build\target\invoker-reports\BUILD-build-classpath-output-file-and-property.xml, f:\jenkins\jenkins-slave\workspace\-dependency-plugin_MDEP-625-3I6V7G3727HFCGSCWRQH5RTCWRSMXZQ3ZEOVZRI3U3XLP2Z7WCCQ\windows-jdk9-m3.5.x_build\target\invoker-reports\BUILD-build-classpath.xml, f:\jenkins\jenkins-slave\workspace\-dependency-plugin_MDEP-625-3I6V7G3727HFCGSCWRQH5RTCWRSMXZQ3ZEOVZRI3U3XLP2Z7WCCQ\windows-jdk9-m3.5.x_build\target\invoker-reports\BUILD-collect.xml, f:\jenkins\jenkins-slave\workspace\-dependency-plugin_MDEP-625-3I6V7G3727HFCGSCWRQH5RTCWRSMXZQ3ZEOVZRI3U3XLP2Z7WCCQ\windows-jdk9-m3.5.x_build\target\invoker-reports\BUILD-copy-and-unpack-with-alternate-local-repo.xml, f:\jenkins\jenkins-slave\workspace\-dependency-plugin_MDEP-625-3I6V7G3727HFCGSCWRQH5RTCWRSMXZQ3ZEOVZRI3U3XLP2Z7WCCQ\windows-jdk9-m3.5.x_build\target\invoker-reports\BUILD-copy-cli.xml, f:\jenkins\jenkins-slave\workspace\-dependency-plugin_MDEP-625-3I6V7G3727HFCGSCWRQH5RTCWRSMXZQ3ZEOVZRI3U3XLP2Z7WCCQ\windows-jdk9-m3.5.x_build\target\invoker-reports\BUILD-copy-dependencies.xml, f:\jenkins\jenkins-slave\workspace\-dependency-plugin_MDEP-625-3I6V7G3727HFCGSCWRQH5RTCWRSMXZQ3ZEOVZRI3U3XLP2Z7WCCQ\windows-jdk9-m3.5.x_build\target\invoker-reports\BUILD-copy-from-reactor.xml, f:\jenkins\jenkins-slave\workspace\-dependency-plugin_MDEP-625-3I6V7G3727HFCGSCWRQH5RTCWRSMXZQ3ZEOVZRI3U3XLP2Z7WCCQ\windows-jdk9-m3.5.x_build\target\invoker-reports\BUILD-copy-from-remote-repository.xml, f:\jenkins\jenkins-slave\workspace\-dependency-plugin_MDEP-625-3I6V7G3727HFCGSCWRQH5RTCWRSMXZQ3ZEOVZRI3U3XLP2Z7WCCQ\windows-jdk9-m3.5.x_build\target\invoker-reports\BUILD-copy.xml, f:\jenkins\jenkins-slave\workspace\-dependency-plugin_MDEP-625-3I6V7G3727HFCGSCWRQH5RTCWRSMXZQ3ZEOVZRI3U3XLP2Z7WCCQ\windows-jdk9-m3.5.x_build\target\invoker-reports\BUILD-dependency-properties.xml, f:\jenkins\jenkins-slave\workspace\-dependency-plugin_MDEP-625-3I6V7G3727HFCGSCWRQH5RTCWRSMXZQ3ZEOVZRI3U3XLP2Z7WCCQ\windows-jdk9-m3.5.x_build\target\invoker-reports\BUILD-filterunpack.xml, f:\jenkins\jenkins-slave\workspace\-dependency-plugin_MDEP-625-3I6V7G3727HFCGSCWRQH5RTCWRSMXZQ3ZEOVZRI3U3XLP2Z7WCCQ\windows-jdk9-m3.5.x_build\target\invoker-reports\BUILD-get-artifact-maven-plugin.xml, f:\jenkins\jenkins-slave\workspace\-dependency-plugin_MDEP-625-3I6V7G3727HFCGSCWRQH5RTCWRSMXZQ3ZEOVZRI3U3XLP2Z7WCCQ\windows-jdk9-m3.5.x_build\target\invoker-reports\BUILD-get-artifact-no-transitive.xml, f:\jenkins\jenkins-slave\workspace\-dependency-plugin_MDEP-625-3I6V7G3727HFCGSCWRQH5RTCWRSMXZQ3ZEOVZRI3U3XLP2Z7WCCQ\windows-jdk9-m3.5.x_build\target\invoker-reports\BUILD-get-artifact.xml, f:\jenkins\jenkins-slave\workspace\-dependency-plugin_MDEP-625-3I6V7G3727HFCGSCWRQH5RTCWRSMXZQ3ZEOVZRI3U3XLP2Z7WCCQ\windows-jdk9-m3.5.x_build\target\invoker-reports\BUILD-get-gav.xml, f:\jenkins\jenkins-slave\workspace\-dependency-plugin_MDEP-625-3I6V7G3727HFCGSCWRQH5RTCWRSMXZQ3ZEOVZRI3U3XLP2Z7WCCQ\windows-jdk9-m3.5.x_build\target\invoker-reports\BUILD-go-offline.xml, f:\jenkins\jenkins-slave\workspace\-dependency-plugin_MDEP-625-3I6V7G3727HFCGSCWRQH5RTCWRSMXZQ3ZEOVZRI3U3XLP2Z7WCCQ\windows-jdk9-m3.5.x_build\target\invoker-reports\BUILD-list-repositories.xml, f:\jenkins\jenkins-slave\workspace\-dependency-plugin_MDEP-625-3I6V7G3727HFCGSCWRQH5RTCWRSMXZQ3ZEOVZRI3U3XLP2Z7WCCQ\windows-jdk9-m3.5.x_build\target\invoker-reports\BUILD-mdep-439-analyze-java8.xml, f:\jenkins\jenkins-slave\workspace\-dependency-plugin_MDEP-625-3I6V7G3727HFCGSCWRQH5RTCWRSMXZQ3ZEOVZRI3U3XLP2Z7WCCQ\windows-jdk9-m3.5.x_build\target\invoker-reports\BUILD-mdep-450-project-with-ancestor.xml, f:\jenkins\jenkins-slave\workspace\-dependency-plugin_MDEP-625-3I6V7G3727HFCGSCWRQH5RTCWRSMXZQ3ZEOVZRI3U3XLP2Z7WCCQ\windows-jdk9-m3.5.x_build\target\invoker-reports\BUILD-mdep-450-project-without-ancestor.xml, f:\jenkins\jenkins-slave\workspace\-dependency-plugin_MDEP-625-3I6V7G3727HFCGSCWRQH5RTCWRSMXZQ3ZEOVZRI3U3XLP2Z7WCCQ\windows-jdk9-m3.5.x_build\target\invoker-reports\BUILD-mdep-506-dependency-without-version-in-depmgt.xml, f:\jenkins\jenkins-slave\workspace\-dependency-plugin_MDEP-625-3I6V7G3727HFCGSCWRQH5RTCWRSMXZQ3ZEOVZRI3U3XLP2Z7WCCQ\windows-jdk9-m3.5.x_build\target\invoker-reports\BUILD-mdep-571-resolve-java9.xml, f:\jenkins\jenkins-slave\workspace\-dependency-plugin_MDEP-625-3I6V7G3727HFCGSCWRQH5RTCWRSMXZQ3ZEOVZRI3U3XLP2Z7WCCQ\windows-jdk9-m3.5.x_build\target\invoker-reports\BUILD-mdep-572-unpack-tar-long-file.xml, f:\jenkins\jenkins-slave\workspace\-dependency-plugin_MDEP-625-3I6V7G3727HFCGSCWRQH5RTCWRSMXZQ3ZEOVZRI3U3XLP2Z7WCCQ\windows-jdk9-m3.5.x_build\target\invoker-reports\BUILD-mdep-578_display-reason-invalid-module.xml, f:\jenkins\jenkins-slave\workspace\-dependency-plugin_MDEP-625-3I6V7G3727HFCGSCWRQH5RTCWRSMXZQ3ZEOVZRI3U3XLP2Z7WCCQ\windows-jdk9-m3.5.x_build\target\invoker-reports\BUILD-mdep-580_display-manifest-automodules.xml, f:\jenkins\jenkins-slave\workspace\-dependency-plugin_MDEP-625-3I6V7G3727HFCGSCWRQH5RTCWRSMXZQ3ZEOVZRI3U3XLP2Z7WCCQ\windows-jdk9-m3.5.x_build\target\invoker-reports\BUILD-mdep-599-analyze-java9.xml, f:\jenkins\jenkins-slave\workspace\-dependency-plugin_MDEP-625-3I6V7G3727HFCGSCWRQH5RTCWRSMXZQ3ZEOVZRI3U3XLP2Z7WCCQ\windows-jdk9-m3.5.x_build\target\invoker-reports\BUILD-purge-local-repository-bad-dep.xml, f:\jenkins\jenkins-slave\workspace\-dependency-plugin_MDEP-625-3I6V7G3727HFCGSCWRQH5RTCWRSMXZQ3ZEOVZRI3U3XLP2Z7WCCQ\windows-jdk9-m3.5.x_build\target\invoker-reports\BUILD-purge-local-repository-include.xml, f:\jenkins\jenkins-slave\workspace\-dependency-plugin_MDEP-625-3I6V7G3727HFCGSCWRQH5RTCWRSMXZQ3ZEOVZRI3U3XLP2Z7WCCQ\windows-jdk9-m3.5.x_build\target\invoker-reports\BUILD-purge-local-repository-multi-module-execution.xml, f:\jenkins\jenkins-slave\workspace\-dependency-plugin_MDEP-625-3I6V7G3727HFCGSCWRQH5RTCWRSMXZQ3ZEOVZRI3U3XLP2Z7WCCQ\windows-jdk9-m3.5.x_build\target\invoker-reports\BUILD-purge-local-repository-multi-module.xml, f:\jenkins\jenkins-slave\workspace\-dependency-plugin_MDEP-625-3I6V7G3727HFCGSCWRQH5RTCWRSMXZQ3ZEOVZRI3U3XLP2Z7WCCQ\windows-jdk9-m3.5.x_build\target\invoker-reports\BUILD-purge-local-repository-non-transitive.xml, f:\jenkins\jenkins-slave\workspace\-dependency-plugin_MDEP-625-3I6V7G3727HFCGSCWRQH5RTCWRSMXZQ3ZEOVZRI3U3XLP2Z7WCCQ\windows-jdk9-m3.5.x_build\target\invoker-reports\BUILD-purge-local-repository-reresolve.xml, f:\jenkins\jenkins-slave\workspace\-dependency-plugin_MDEP-625-3I6V7G3727HFCGSCWRQH5RTCWRSMXZQ3ZEOVZRI3U3XLP2Z7WCCQ\windows-jdk9-m3.5.x_build\target\invoker-reports\BUILD-purge-local-repository-snapshots-only.xml, f:\jenkins\jenkins-slave\workspace\-dependency-plugin_MDEP-625-3I6V7G3727HFCGSCWRQH5RTCWRSMXZQ3ZEOVZRI3U3XLP2Z7WCCQ\windows-jdk9-m3.5.x_build\target\invoker-reports\BUILD-purge-local-repository-version-range.xml, f:\jenkins\jenkins-slave\workspace\-dependency-plugin_MDEP-625-3I6V7G3727HFCGSCWRQH5RTCWRSMXZQ3ZEOVZRI3U3XLP2Z7WCCQ\windows-jdk9-m3.5.x_build\target\invoker-reports\BUILD-purge-local-repository-without-pom.xml, f:\jenkins\jenkins-slave\workspace\-dependency-plugin_MDEP-625-3I6V7G3727HFCGSCWRQH5RTCWRSMXZQ3ZEOVZRI3U3XLP2Z7WCCQ\windows-jdk9-m3.5.x_build\target\invoker-reports\BUILD-purge-local-repository.xml, f:\jenkins\jenkins-slave\workspace\-dependency-plugin_MDEP-625-3I6V7G3727HFCGSCWRQH5RTCWRSMXZQ3ZEOVZRI3U3XLP2Z7WCCQ\windows-jdk9-m3.5.x_build\target\invoker-reports\BUILD-resolve-plugins-exclude-reactor.xml, f:\jenkins\jenkins-slave\workspace\-dependency-plugin_MDEP-625-3I6V7G3727HFCGSCWRQH5RTCWRSMXZQ3ZEOVZRI3U3XLP2Z7WCCQ\windows-jdk9-m3.5.x_build\target\invoker-reports\BUILD-resolve-plugins-with-exclude.xml, f:\jenkins\jenkins-slave\workspace\-dependency-plugin_MDEP-625-3I6V7G3727HFCGSCWRQH5RTCWRSMXZQ3ZEOVZRI3U3XLP2Z7WCCQ\windows-jdk9-m3.5.x_build\target\invoker-reports\BUILD-resolve-plugins.xml, f:\jenkins\jenkins-slave\workspace\-dependency-plugin_MDEP-625-3I6V7G3727HFCGSCWRQH5RTCWRSMXZQ3ZEOVZRI3U3XLP2Z7WCCQ\windows-jdk9-m3.5.x_build\target\invoker-reports\BUILD-resolve.xml, f:\jenkins\jenkins-slave\workspace\-dependency-plugin_MDEP-625-3I6V7G3727HFCGSCWRQH5RTCWRSMXZQ3ZEOVZRI3U3XLP2Z7WCCQ\windows-jdk9-m3.5.x_build\target\invoker-reports\BUILD-setup-custom-ear-lifecycle.xml, f:\jenkins\jenkins-slave\workspace\-dependency-plugin_MDEP-625-3I6V7G3727HFCGSCWRQH5RTCWRSMXZQ3ZEOVZRI3U3XLP2Z7WCCQ\windows-jdk9-m3.5.x_build\target\invoker-reports\BUILD-sources.xml, f:\jenkins\jenkins-slave\workspace\-dependency-plugin_MDEP-625-3I6V7G3727HFCGSCWRQH5RTCWRSMXZQ3ZEOVZRI3U3XLP2Z7WCCQ\windows-jdk9-m3.5.x_build\target\invoker-reports\BUILD-tree-includes.xml, f:\jenkins\jenkins-slave\workspace\-dependency-plugin_MDEP-625-3I6V7G3727HFCGSCWRQH5RTCWRSMXZQ3ZEOVZRI3U3XLP2Z7WCCQ\windows-jdk9-m3.5.x_build\target\invoker-reports\BUILD-tree-multimodule.xml, f:\jenkins\jenkins-slave\workspace\-dependency-plugin_MDEP-625-3I6V7G3727HFCGSCWRQH5RTCWRSMXZQ3ZEOVZRI3U3XLP2Z7WCCQ\windows-jdk9-m3.5.x_build\target\invoker-reports\BUILD-tree.xml, f:\jenkins\jenkins-slave\workspace\-dependency-plugin_MDEP-625-3I6V7G3727HFCGSCWRQH5RTCWRSMXZQ3ZEOVZRI3U3XLP2Z7WCCQ\windows-jdk9-m3.5.x_build\target\invoker-reports\BUILD-unpack-cli.xml, f:\jenkins\jenkins-slave\workspace\-dependency-plugin_MDEP-625-3I6V7G3727HFCGSCWRQH5RTCWRSMXZQ3ZEOVZRI3U3XLP2Z7WCCQ\windows-jdk9-m3.5.x_build\target\invoker-reports\BUILD-unpack-custom-ear.xml, f:\jenkins\jenkins-slave\workspace\-dependency-plugin_MDEP-625-3I6V7G3727HFCGSCWRQH5RTCWRSMXZQ3ZEOVZRI3U3XLP2Z7WCCQ\windows-jdk9-m3.5.x_build\target\invoker-reports\BUILD-unpack-dependencies.xml, f:\jenkins\jenkins-slave\workspace\-dependency-plugin_MDEP-625-3I6V7G3727HFCGSCWRQH5RTCWRSMXZQ3ZEOVZRI3U3XLP2Z7WCCQ\windows-jdk9-m3.5.x_build\target\invoker-reports\BUILD-unpack-from-remote-repository.xml, f:\jenkins\jenkins-slave\workspace\-dependency-plugin_MDEP-625-3I6V7G3727HFCGSCWRQH5RTCWRSMXZQ3ZEOVZRI3U3XLP2Z7WCCQ\windows-jdk9-m3.5.x_build\target\invoker-reports\BUILD-unpack.xml, f:\jenkins\jenkins-slave\workspace\-dependency-plugin_MDEP-625-3I6V7G3727HFCGSCWRQH5RTCWRSMXZQ3ZEOVZRI3U3XLP2Z7WCCQ\windows-jdk9-m3.5.x_build\target\invoker-reports\BUILD-used-dependencies.xml]
[windows-jdk9-m3.5.x_build] Found logs:[f:\jenkins\jenkins-slave\workspace\-dependency-plugin_MDEP-625-3I6V7G3727HFCGSCWRQH5RTCWRSMXZQ3ZEOVZRI3U3XLP2Z7WCCQ\windows-jdk9-m3.5.x_build\target\it\analyze-dep-mgt\build.log, f:\jenkins\jenkins-slave\workspace\-dependency-plugin_MDEP-625-3I6V7G3727HFCGSCWRQH5RTCWRSMXZQ3ZEOVZRI3U3XLP2Z7WCCQ\windows-jdk9-m3.5.x_build\target\it\analyze-ignore-dependency\build.log, f:\jenkins\jenkins-slave\workspace\-dependency-plugin_MDEP-625-3I6V7G3727HFCGSCWRQH5RTCWRSMXZQ3ZEOVZRI3U3XLP2Z7WCCQ\windows-jdk9-m3.5.x_build\target\it\analyze-ignore-unused-declared-dependency\build.log, f:\jenkins\jenkins-slave\workspace\-dependency-plugin_MDEP-625-3I6V7G3727HFCGSCWRQH5RTCWRSMXZQ3ZEOVZRI3U3XLP2Z7WCCQ\windows-jdk9-m3.5.x_build\target\it\analyze-ignore-used-undeclared-dependency\build.log, f:\jenkins\jenkins-slave\workspace\-dependency-plugin_MDEP-625-3I6V7G3727HFCGSCWRQH5RTCWRSMXZQ3ZEOVZRI3U3XLP2Z7WCCQ\windows-jdk9-m3.5.x_build\target\it\analyze-multimodule-project\build.log, f:\jenkins\jenkins-slave\workspace\-dependency-plugin_MDEP-625-3I6V7G3727HFCGSCWRQH5RTCWRSMXZQ3ZEOVZRI3U3XLP2Z7WCCQ\windows-jdk9-m3.5.x_build\target\it\analyze-report\build.log, f:\jenkins\jenkins-slave\workspace\-dependency-plugin_MDEP-625-3I6V7G3727HFCGSCWRQH5RTCWRSMXZQ3ZEOVZRI3U3XLP2Z7WCCQ\windows-jdk9-m3.5.x_build\target\it\analyze\build.log, f:\jenkins\jenkins-slave\workspace\-dependency-plugin_MDEP-625-3I6V7G3727HFCGSCWRQH5RTCWRSMXZQ3ZEOVZRI3U3XLP2Z7WCCQ\windows-jdk9-m3.5.x_build\target\it\build-classpath-output-file-and-property\build.log, f:\jenkins\jenkins-slave\workspace\-dependency-plugin_MDEP-625-3I6V7G3727HFCGSCWRQH5RTCWRSMXZQ3ZEOVZRI3U3XLP2Z7WCCQ\windows-jdk9-m3.5.x_build\target\it\build-classpath\build.log, f:\jenkins\jenkins-slave\workspace\-dependency-plugin_MDEP-625-3I6V7G3727HFCGSCWRQH5RTCWRSMXZQ3ZEOVZRI3U3XLP2Z7WCCQ\windows-jdk9-m3.5.x_build\target\it\collect\build.log, f:\jenkins\jenkins-slave\workspace\-dependency-plugin_MDEP-625-3I6V7G3727HFCGSCWRQH5RTCWRSMXZQ3ZEOVZRI3U3XLP2Z7WCCQ\windows-jdk9-m3.5.x_build\target\it\copy-and-unpack-with-alternate-local-repo\build.log, f:\jenkins\jenkins-slave\workspace\-dependency-plugin_MDEP-625-3I6V7G3727HFCGSCWRQH5RTCWRSMXZQ3ZEOVZRI3U3XLP2Z7WCCQ\windows-jdk9-m3.5.x_build\target\it\copy-cli\build.log, f:\jenkins\jenkins-slave\workspace\-dependency-plugin_MDEP-625-3I6V7G3727HFCGSCWRQH5RTCWRSMXZQ3ZEOVZRI3U3XLP2Z7WCCQ\windows-jdk9-m3.5.x_build\target\it\copy-dependencies\build.log, f:\jenkins\jenkins-slave\workspace\-dependency-plugin_MDEP-625-3I6V7G3727HFCGSCWRQH5RTCWRSMXZQ3ZEOVZRI3U3XLP2Z7WCCQ\windows-jdk9-m3.5.x_build\target\it\copy-from-reactor\build.log, f:\jenkins\jenkins-slave\workspace\-dependency-plugin_MDEP-625-3I6V7G3727HFCGSCWRQH5RTCWRSMXZQ3ZEOVZRI3U3XLP2Z7WCCQ\windows-jdk9-m3.5.x_build\target\it\copy-from-remote-repository\build.log, f:\jenkins\jenkins-slave\workspace\-dependency-plugin_MDEP-625-3I6V7G3727HFCGSCWRQH5RTCWRSMXZQ3ZEOVZRI3U3XLP2Z7WCCQ\windows-jdk9-m3.5.x_build\target\it\copy\build.log, f:\jenkins\jenkins-slave\workspace\-dependency-plugin_MDEP-625-3I6V7G3727HFCGSCWRQH5RTCWRSMXZQ3ZEOVZRI3U3XLP2Z7WCCQ\windows-jdk9-m3.5.x_build\target\it\dependency-properties\build.log, f:\jenkins\jenkins-slave\workspace\-dependency-plugin_MDEP-625-3I6V7G3727HFCGSCWRQH5RTCWRSMXZQ3ZEOVZRI3U3XLP2Z7WCCQ\windows-jdk9-m3.5.x_build\target\it\filterunpack\build.log, f:\jenkins\jenkins-slave\workspace\-dependency-plugin_MDEP-625-3I6V7G3727HFCGSCWRQH5RTCWRSMXZQ3ZEOVZRI3U3XLP2Z7WCCQ\windows-jdk9-m3.5.x_build\target\it\get-artifact-maven-plugin\build.log, f:\jenkins\jenkins-slave\workspace\-dependency-plugin_MDEP-625-3I6V7G3727HFCGSCWRQH5RTCWRSMXZQ3ZEOVZRI3U3XLP2Z7WCCQ\windows-jdk9-m3.5.x_build\target\it\get-artifact-no-transitive\build.log, f:\jenkins\jenkins-slave\workspace\-dependency-plugin_MDEP-625-3I6V7G3727HFCGSCWRQH5RTCWRSMXZQ3ZEOVZRI3U3XLP2Z7WCCQ\windows-jdk9-m3.5.x_build\target\it\get-artifact\build.log, f:\jenkins\jenkins-slave\workspace\-dependency-plugin_MDEP-625-3I6V7G3727HFCGSCWRQH5RTCWRSMXZQ3ZEOVZRI3U3XLP2Z7WCCQ\windows-jdk9-m3.5.x_build\target\it\get-gav\build.log, f:\jenkins\jenkins-slave\workspace\-dependency-plugin_MDEP-625-3I6V7G3727HFCGSCWRQH5RTCWRSMXZQ3ZEOVZRI3U3XLP2Z7WCCQ\windows-jdk9-m3.5.x_build\target\it\go-offline\build.log, f:\jenkins\jenkins-slave\workspace\-dependency-plugin_MDEP-625-3I6V7G3727HFCGSCWRQH5RTCWRSMXZQ3ZEOVZRI3U3XLP2Z7WCCQ\windows-jdk9-m3.5.x_build\target\it\list-repositories\build.log, f:\jenkins\jenkins-slave\workspace\-dependency-plugin_MDEP-625-3I6V7G3727HFCGSCWRQH5RTCWRSMXZQ3ZEOVZRI3U3XLP2Z7WCCQ\windows-jdk9-m3.5.x_build\target\it\mdep-439-analyze-java8\build.log, f:\jenkins\jenkins-slave\workspace\-dependency-plugin_MDEP-625-3I6V7G3727HFCGSCWRQH5RTCWRSMXZQ3ZEOVZRI3U3XLP2Z7WCCQ\windows-jdk9-m3.5.x_build\target\it\mdep-450-project-with-ancestor\build.log, f:\jenkins\jenkins-slave\workspace\-dependency-plugin_MDEP-625-3I6V7G3727HFCGSCWRQH5RTCWRSMXZQ3ZEOVZRI3U3XLP2Z7WCCQ\windows-jdk9-m3.5.x_build\target\it\mdep-450-project-without-ancestor\build.log, f:\jenkins\jenkins-slave\workspace\-dependency-plugin_MDEP-625-3I6V7G3727HFCGSCWRQH5RTCWRSMXZQ3ZEOVZRI3U3XLP2Z7WCCQ\windows-jdk9-m3.5.x_build\target\it\mdep-506-dependency-without-version-in-depmgt\build.log, f:\jenkins\jenkins-slave\workspace\-dependency-plugin_MDEP-625-3I6V7G3727HFCGSCWRQH5RTCWRSMXZQ3ZEOVZRI3U3XLP2Z7WCCQ\windows-jdk9-m3.5.x_build\target\it\mdep-571-resolve-java9\build.log, f:\jenkins\jenkins-slave\workspace\-dependency-plugin_MDEP-625-3I6V7G3727HFCGSCWRQH5RTCWRSMXZQ3ZEOVZRI3U3XLP2Z7WCCQ\windows-jdk9-m3.5.x_build\target\it\mdep-572-unpack-tar-long-file\build.log, f:\jenkins\jenkins-slave\workspace\-dependency-plugin_MDEP-625-3I6V7G3727HFCGSCWRQH5RTCWRSMXZQ3ZEOVZRI3U3XLP2Z7WCCQ\windows-jdk9-m3.5.x_build\target\it\mdep-578_display-reason-invalid-module\build.log, f:\jenkins\jenkins-slave\workspace\-dependency-plugin_MDEP-625-3I6V7G3727HFCGSCWRQH5RTCWRSMXZQ3ZEOVZRI3U3XLP2Z7WCCQ\windows-jdk9-m3.5.x_build\target\it\mdep-580_display-manifest-automodules\build.log, f:\jenkins\jenkins-slave\workspace\-dependency-plugin_MDEP-625-3I6V7G3727HFCGSCWRQH5RTCWRSMXZQ3ZEOVZRI3U3XLP2Z7WCCQ\windows-jdk9-m3.5.x_build\target\it\mdep-599-analyze-java9\build.log, f:\jenkins\jenkins-slave\workspace\-dependency-plugin_MDEP-625-3I6V7G3727HFCGSCWRQH5RTCWRSMXZQ3ZEOVZRI3U3XLP2Z7WCCQ\windows-jdk9-m3.5.x_build\target\it\purge-local-repository-bad-dep\build.log, f:\jenkins\jenkins-slave\workspace\-dependency-plugin_MDEP-625-3I6V7G3727HFCGSCWRQH5RTCWRSMXZQ3ZEOVZRI3U3XLP2Z7WCCQ\windows-jdk9-m3.5.x_build\target\it\purge-local-repository-include\build.log, f:\jenkins\jenkins-slave\workspace\-dependency-plugin_MDEP-625-3I6V7G3727HFCGSCWRQH5RTCWRSMXZQ3ZEOVZRI3U3XLP2Z7WCCQ\windows-jdk9-m3.5.x_build\target\it\purge-local-repository-multi-module-execution\build.log, f:\jenkins\jenkins-slave\workspace\-dependency-plugin_MDEP-625-3I6V7G3727HFCGSCWRQH5RTCWRSMXZQ3ZEOVZRI3U3XLP2Z7WCCQ\windows-jdk9-m3.5.x_build\target\it\purge-local-repository-multi-module\build.log, f:\jenkins\jenkins-slave\workspace\-dependency-plugin_MDEP-625-3I6V7G3727HFCGSCWRQH5RTCWRSMXZQ3ZEOVZRI3U3XLP2Z7WCCQ\windows-jdk9-m3.5.x_build\target\it\purge-local-repository-non-transitive\build.log, f:\jenkins\jenkins-slave\workspace\-dependency-plugin_MDEP-625-3I6V7G3727HFCGSCWRQH5RTCWRSMXZQ3ZEOVZRI3U3XLP2Z7WCCQ\windows-jdk9-m3.5.x_build\target\it\purge-local-repository-reresolve\build.log, f:\jenkins\jenkins-slave\workspace\-dependency-plugin_MDEP-625-3I6V7G3727HFCGSCWRQH5RTCWRSMXZQ3ZEOVZRI3U3XLP2Z7WCCQ\windows-jdk9-m3.5.x_build\target\it\purge-local-repository-snapshots-only\build.log, f:\jenkins\jenkins-slave\workspace\-dependency-plugin_MDEP-625-3I6V7G3727HFCGSCWRQH5RTCWRSMXZQ3ZEOVZRI3U3XLP2Z7WCCQ\windows-jdk9-m3.5.x_build\target\it\purge-local-repository-version-range\build.log, f:\jenkins\jenkins-slave\workspace\-dependency-plugin_MDEP-625-3I6V7G3727HFCGSCWRQH5RTCWRSMXZQ3ZEOVZRI3U3XLP2Z7WCCQ\windows-jdk9-m3.5.x_build\target\it\purge-local-repository-without-pom\build.log, f:\jenkins\jenkins-slave\workspace\-dependency-plugin_MDEP-625-3I6V7G3727HFCGSCWRQH5RTCWRSMXZQ3ZEOVZRI3U3XLP2Z7WCCQ\windows-jdk9-m3.5.x_build\target\it\purge-local-repository\build.log, f:\jenkins\jenkins-slave\workspace\-dependency-plugin_MDEP-625-3I6V7G3727HFCGSCWRQH5RTCWRSMXZQ3ZEOVZRI3U3XLP2Z7WCCQ\windows-jdk9-m3.5.x_build\target\it\resolve-plugins-exclude-reactor\build.log, f:\jenkins\jenkins-slave\workspace\-dependency-plugin_MDEP-625-3I6V7G3727HFCGSCWRQH5RTCWRSMXZQ3ZEOVZRI3U3XLP2Z7WCCQ\windows-jdk9-m3.5.x_build\target\it\resolve-plugins-with-exclude\build.log, f:\jenkins\jenkins-slave\workspace\-dependency-plugin_MDEP-625-3I6V7G3727HFCGSCWRQH5RTCWRSMXZQ3ZEOVZRI3U3XLP2Z7WCCQ\windows-jdk9-m3.5.x_build\target\it\resolve-plugins\build.log, f:\jenkins\jenkins-slave\workspace\-dependency-plugin_MDEP-625-3I6V7G3727HFCGSCWRQH5RTCWRSMXZQ3ZEOVZRI3U3XLP2Z7WCCQ\windows-jdk9-m3.5.x_build\target\it\resolve\build.log, f:\jenkins\jenkins-slave\workspace\-dependency-plugin_MDEP-625-3I6V7G3727HFCGSCWRQH5RTCWRSMXZQ3ZEOVZRI3U3XLP2Z7WCCQ\windows-jdk9-m3.5.x_build\target\it\setup-custom-ear-lifecycle\build.log, f:\jenkins\jenkins-slave\workspace\-dependency-plugin_MDEP-625-3I6V7G3727HFCGSCWRQH5RTCWRSMXZQ3ZEOVZRI3U3XLP2Z7WCCQ\windows-jdk9-m3.5.x_build\target\it\sources\build.log, f:\jenkins\jenkins-slave\workspace\-dependency-plugin_MDEP-625-3I6V7G3727HFCGSCWRQH5RTCWRSMXZQ3ZEOVZRI3U3XLP2Z7WCCQ\windows-jdk9-m3.5.x_build\target\it\tree-includes\build.log, f:\jenkins\jenkins-slave\workspace\-dependency-plugin_MDEP-625-3I6V7G3727HFCGSCWRQH5RTCWRSMXZQ3ZEOVZRI3U3XLP2Z7WCCQ\windows-jdk9-m3.5.x_build\target\it\tree-multimodule\build.log, f:\jenkins\jenkins-slave\workspace\-dependency-plugin_MDEP-625-3I6V7G3727HFCGSCWRQH5RTCWRSMXZQ3ZEOVZRI3U3XLP2Z7WCCQ\windows-jdk9-m3.5.x_build\target\it\unpack-cli\build.log, f:\jenkins\jenkins-slave\workspace\-dependency-plugin_MDEP-625-3I6V7G3727HFCGSCWRQH5RTCWRSMXZQ3ZEOVZRI3U3XLP2Z7WCCQ\windows-jdk9-m3.5.x_build\target\it\unpack-custom-ear\build.log, f:\jenkins\jenkins-slave\workspace\-dependency-plugin_MDEP-625-3I6V7G3727HFCGSCWRQH5RTCWRSMXZQ3ZEOVZRI3U3XLP2Z7WCCQ\windows-jdk9-m3.5.x_build\target\it\unpack-dependencies\build.log, f:\jenkins\jenkins-slave\workspace\-dependency-plugin_MDEP-625-3I6V7G3727HFCGSCWRQH5RTCWRSMXZQ3ZEOVZRI3U3XLP2Z7WCCQ\windows-jdk9-m3.5.x_build\target\it\unpack-from-remote-repository\build.log, f:\jenkins\jenkins-slave\workspace\-dependency-plugin_MDEP-625-3I6V7G3727HFCGSCWRQH5RTCWRSMXZQ3ZEOVZRI3U3XLP2Z7WCCQ\windows-jdk9-m3.5.x_build\target\it\unpack\build.log, f:\jenkins\jenkins-slave\workspace\-dependency-plugin_MDEP-625-3I6V7G3727HFCGSCWRQH5RTCWRSMXZQ3ZEOVZRI3U3XLP2Z7WCCQ\windows-jdk9-m3.5.x_build\target\it\used-dependencies\build.log]
[windows-jdk9-m3.5.x_build] Finished parsing Maven Invoker results (found 58)
[windows-jdk9-m3.5.x_build] [withMaven] junitPublisher - Archive test results for Maven artifact org.apache.maven.plugins:maven-dependency-plugin:3.1.2-SNAPSHOT generated by maven-surefire-plugin:test (default-test): windows-jdk9-m3.5.x_build\target\surefire-reports\*.xml
[windows-jdk9-m3.5.x_build] Recording test results
[windows-jdk9-m3.5.x_build] [withMaven] openTasksPublisher - Scan Tasks for Maven artifact org.apache.maven.plugins:maven-dependency-plugin:3.1.2-SNAPSHOT in source directory windows-jdk9-m3.5.x_build\src\main\java
[windows-jdk9-m3.5.x_build] [TASKS] Scanning folder 'f:\jenkins\jenkins-slave\workspace\-dependency-plugin_MDEP-625-3I6V7G3727HFCGSCWRQH5RTCWRSMXZQ3ZEOVZRI3U3XLP2Z7WCCQ' for files matching the pattern 'windows-jdk9-m3.5.x_build\src\main\java\**\*' - excludes: null
[windows-jdk9-m3.5.x_build] [TASKS] Found 48 files to scan for tasks
[windows-jdk9-m3.5.x_build] [TASKS] Found 4 open tasks.
[windows-jdk9-m3.5.x_build] Skipping warnings blame since pipelines do not have an SCM link.%n
[Pipeline] [windows-jdk9-m3.5.x_build] // withMaven
[Pipeline] [windows-jdk9-m3.5.x_build] cleanWs
[windows-jdk9-m3.5.x_build] [WS-CLEANUP] Deleting project workspace...[WS-CLEANUP] done
[Pipeline] [windows-jdk9-m3.5.x_build] cleanWs
[windows-jdk9-m3.5.x_build] [WS-CLEANUP] Deleting project workspace...[WS-CLEANUP] done
[Pipeline] [windows-jdk9-m3.5.x_build] }
[Pipeline] [windows-jdk9-m3.5.x_build] // stage
[Pipeline] [windows-jdk9-m3.5.x_build] }
[Pipeline] [windows-jdk9-m3.5.x_build] // node
[Pipeline] [windows-jdk9-m3.5.x_build] }
[windows-jdk9-m3.5.x_build] Failed in branch windows-jdk9-m3.5.x_build
[windows-jdk10-m3.5.x_build] [INFO] run post-build script verify.bsh
[windows-jdk10-m3.5.x_build] [INFO]           purge-local-repository-version-range\pom.xml ..... SUCCESS (908.3 s)
[windows-jdk10-m3.5.x_build] [INFO] Building: resolve\pom.xml
[windows-jdk10-m3.5.x_build] [INFO]           resolve\pom.xml .................................. SUCCESS (7.0 s)
[windows-jdk10-m3.5.x_build] [INFO] Building: resolve-plugins\pom.xml
[windows-jdk10-m3.5.x_build] [INFO]           resolve-plugins\pom.xml .......................... FAILED (6.4 s)
[windows-jdk10-m3.5.x_build] [INFO]   The build exited with code 1. See f:\jenkins\jenkins-slave\workspace\-dependency-plugin_MDEP-625-3I6V7G3727HFCGSCWRQH5RTCWRSMXZQ3ZEOVZRI3U3XLP2Z7WCCQ\windows-jdk10-m3.5.x_build\target\it\resolve-plugins\build.log for details.
[windows-jdk10-m3.5.x_build] [INFO] Building: resolve-plugins-exclude-reactor\pom.xml
[windows-jdk10-m3.5.x_build] [INFO] run post-build script verify.groovy
[windows-jdk10-m3.5.x_build] [INFO]           resolve-plugins-exclude-reactor\pom.xml .......... FAILED (6.4 s)
[windows-jdk10-m3.5.x_build] [INFO]   The post-build script did not succeed. f:\jenkins\jenkins-slave\workspace\-dependency-plugin_MDEP-625-3I6V7G3727HFCGSCWRQH5RTCWRSMXZQ3ZEOVZRI3U3XLP2Z7WCCQ\windows-jdk10-m3.5.x_build\target\it\resolve-plugins-exclude-reactor\target\resolved.txt (The system cannot find the path specified)
[windows-jdk10-m3.5.x_build] [INFO] Building: resolve-plugins-with-exclude\pom.xml
[windows-jdk10-m3.5.x_build] [INFO] run post-build script verify.groovy
[windows-jdk10-m3.5.x_build] [INFO]           resolve-plugins-with-exclude\pom.xml ............. FAILED (6.5 s)
[windows-jdk10-m3.5.x_build] [INFO]   The post-build script did not succeed. f:\jenkins\jenkins-slave\workspace\-dependency-plugin_MDEP-625-3I6V7G3727HFCGSCWRQH5RTCWRSMXZQ3ZEOVZRI3U3XLP2Z7WCCQ\windows-jdk10-m3.5.x_build\target\it\resolve-plugins-with-exclude\target\resolved.txt (The system cannot find the path specified)
[windows-jdk10-m3.5.x_build] [INFO] Building: sources\pom.xml
[windows-jdk10-m3.5.x_build] [INFO] artifact classworlds.classworlds:1.1-alpha-2: checking for updates from central
[windows-jdk10-m3.5.x_build] [INFO] classworlds.classworlds.1.1-alpha-2: checking for updates from central
[windows-jdk10-m3.5.x_build] [INFO]           sources\pom.xml .................................. SUCCESS (8.6 s)
[windows-jdk10-m3.5.x_build] [INFO] Building: tree\pom.xml
[windows-jdk10-m3.5.x_build] [INFO]           tree\pom.xml ..................................... SKIPPED due to Maven version
[windows-jdk10-m3.5.x_build] [INFO] Building: tree-includes\pom.xml
[windows-jdk10-m3.5.x_build] [INFO] run post-build script verify.bsh
[windows-jdk10-m3.5.x_build] [INFO]           tree-includes\pom.xml ............................ SUCCESS (6.2 s)
[windows-jdk10-m3.5.x_build] [INFO] Building: tree-multimodule\pom.xml
[windows-jdk10-m3.5.x_build] [INFO] snapshot org.apache.maven.its.dependency:tree-multimodule-module-a:1.0-SNAPSHOT: checking for updates from apache-snapshots
[windows-jdk10-m3.5.x_build] [INFO] snapshot org.apache.maven.its.dependency:tree-multimodule-module-a:1.0-SNAPSHOT: checking for updates from Nexus
[windows-jdk10-m3.5.x_build] [INFO] artifact org.apache.maven.its.dependency.tree-multimodule-module-a:1.0-SNAPSHOT: checking for updates from central
[windows-jdk10-m3.5.x_build] [INFO] org.apache.maven.its.dependency.tree-multimodule-module-a.1.0-SNAPSHOT: checking for updates from central
[windows-jdk10-m3.5.x_build] [INFO] run post-build script verify.bsh
[windows-jdk10-m3.5.x_build] [INFO]           tree-multimodule\pom.xml ......................... SUCCESS (7.8 s)
[windows-jdk10-m3.5.x_build] [INFO] Building: unpack\pom.xml
[windows-jdk10-m3.5.x_build] [INFO] run post-build script verify.bsh
[windows-jdk10-m3.5.x_build] [INFO]           unpack\pom.xml ................................... SUCCESS (8.8 s)
[windows-jdk10-m3.5.x_build] [INFO] Building: unpack-cli\pom.xml
[windows-jdk10-m3.5.x_build] [INFO] run post-build script verify.bsh
[windows-jdk10-m3.5.x_build] [INFO]           unpack-cli\pom.xml ............................... SUCCESS (7.5 s)
[windows-jdk10-m3.5.x_build] [INFO] Building: unpack-custom-ear\pom.xml
[windows-jdk10-m3.5.x_build] [INFO] run post-build script verify.groovy
[windows-jdk10-m3.5.x_build] [INFO]           unpack-custom-ear\pom.xml ........................ SUCCESS (6.9 s)
[windows-jdk10-m3.5.x_build] [INFO] Building: unpack-dependencies\pom.xml
[windows-jdk10-m3.5.x_build] [INFO] run post-build script verify.groovy
[windows-jdk10-m3.5.x_build] [INFO]           unpack-dependencies\pom.xml ...................... SUCCESS (10.5 s)
[windows-jdk10-m3.5.x_build] [INFO] Building: unpack-from-remote-repository\pom.xml
[windows-jdk10-m3.5.x_build] [INFO] run pre-build script setup.bsh
[windows-jdk10-m3.5.x_build] [INFO] artifact org.apache.maven.its.dependency.fake-remote-unpack:1.0: checking for updates from central
[windows-jdk10-m3.5.x_build] [INFO] org.apache.maven.its.dependency.fake-remote-unpack.1.0: checking for updates from central
[windows-jdk10-m3.5.x_build] [INFO] run post-build script verify.bsh
[windows-jdk10-m3.5.x_build] [INFO]           unpack-from-remote-repository\pom.xml ............ SUCCESS (8.2 s)
[windows-jdk10-m3.5.x_build] [INFO] Building: used-dependencies\pom.xml
[windows-jdk10-m3.5.x_build] [INFO]           used-dependencies\pom.xml ........................ SUCCESS (8.5 s)
[windows-jdk10-m3.5.x_build] [INFO] Building: purge-local-repository-without-pom
[windows-jdk10-m3.5.x_build] [INFO] run pre-build script setup.bsh
[windows-jdk10-m3.5.x_build] [INFO] run post-build script verify.bsh
[windows-jdk10-m3.5.x_build] [INFO]           purge-local-repository-without-pom ............... SUCCESS (6.1 s)
[windows-jdk10-m3.5.x_build] [INFO]
[windows-jdk10-m3.5.x_build] [INFO] --- mrm-maven-plugin:1.0.0:stop (default) @ maven-dependency-plugin ---
[windows-jdk10-m3.5.x_build] [INFO] Stopping Mock Repository Manager on http://localhost:57134
[windows-jdk10-m3.5.x_build] [INFO] Mock Repository Manager http://localhost:57134 is stopped.
[windows-jdk10-m3.5.x_build] [INFO]
[windows-jdk10-m3.5.x_build] [INFO] --- maven-checkstyle-plugin:3.0.0:check (checkstyle-check) @ maven-dependency-plugin ---
[windows-jdk10-m3.5.x_build] [INFO] Downloading from central: https://repo.maven.apache.org/maven2/org/apache/maven/shared/maven-shared-resources/2/maven-shared-resources-2.pom
[windows-jdk10-m3.5.x_build] [INFO] Downloaded from central: https://repo.maven.apache.org/maven2/org/apache/maven/shared/maven-shared-resources/2/maven-shared-resources-2.pom (3.0 kB at 87 kB/s)
[windows-jdk10-m3.5.x_build] [INFO] Downloading from central: https://repo.maven.apache.org/maven2/org/apache/maven/doxia/doxia-integration-tools/1.6/doxia-integration-tools-1.6.pom
[windows-jdk10-m3.5.x_build] [INFO] Downloaded from central: https://repo.maven.apache.org/maven2/org/apache/maven/doxia/doxia-integration-tools/1.6/doxia-integration-tools-1.6.pom (7.0 kB at 316 kB/s)
[windows-jdk10-m3.5.x_build] [INFO] Downloading from central: https://repo.maven.apache.org/maven2/org/apache/maven/doxia/doxia-tools/3/doxia-tools-3.pom
[windows-jdk10-m3.5.x_build] [INFO] Downloaded from central: https://repo.maven.apache.org/maven2/org/apache/maven/doxia/doxia-tools/3/doxia-tools-3.pom (9.9 kB at 216 kB/s)
[windows-jdk10-m3.5.x_build] [INFO] Downloading from central: https://repo.maven.apache.org/maven2/org/codehaus/plexus/plexus-resources/1.1.0/plexus-resources-1.1.0.pom
[windows-jdk10-m3.5.x_build] [INFO] Downloaded from central: https://repo.maven.apache.org/maven2/org/codehaus/plexus/plexus-resources/1.1.0/plexus-resources-1.1.0.pom (3.2 kB at 127 kB/s)
[windows-jdk10-m3.5.x_build] [INFO] Downloading from central: https://repo.maven.apache.org/maven2/com/puppycrawl/tools/checkstyle/6.18/checkstyle-6.18.pom
[windows-jdk10-m3.5.x_build] [INFO] Downloaded from central: https://repo.maven.apache.org/maven2/com/puppycrawl/tools/checkstyle/6.18/checkstyle-6.18.pom (71 kB at 1.3 MB/s)
[windows-jdk10-m3.5.x_build] [INFO] Downloading from central: https://repo.maven.apache.org/maven2/antlr/antlr/2.7.7/antlr-2.7.7.pom
[windows-jdk10-m3.5.x_build] [INFO] Downloaded from central: https://repo.maven.apache.org/maven2/antlr/antlr/2.7.7/antlr-2.7.7.pom (632 B at 29 kB/s)
[windows-jdk10-m3.5.x_build] [INFO] Downloading from central: https://repo.maven.apache.org/maven2/org/antlr/antlr4-runtime/4.5.3/antlr4-runtime-4.5.3.pom
[windows-jdk10-m3.5.x_build] [INFO] Downloaded from central: https://repo.maven.apache.org/maven2/org/antlr/antlr4-runtime/4.5.3/antlr4-runtime-4.5.3.pom (2.3 kB at 100 kB/s)
[windows-jdk10-m3.5.x_build] [INFO] Downloading from central: https://repo.maven.apache.org/maven2/org/antlr/antlr4-master/4.5.3/antlr4-master-4.5.3.pom
[windows-jdk10-m3.5.x_build] [INFO] Downloaded from central: https://repo.maven.apache.org/maven2/org/antlr/antlr4-master/4.5.3/antlr4-master-4.5.3.pom (3.7 kB at 147 kB/s)
[windows-jdk10-m3.5.x_build] [INFO] Downloading from central: https://repo.maven.apache.org/maven2/commons-beanutils/commons-beanutils/1.9.2/commons-beanutils-1.9.2.pom
[windows-jdk10-m3.5.x_build] [INFO] Downloaded from central: https://repo.maven.apache.org/maven2/commons-beanutils/commons-beanutils/1.9.2/commons-beanutils-1.9.2.pom (14 kB at 409 kB/s)
[windows-jdk10-m3.5.x_build] [INFO] Downloading from central: https://repo.maven.apache.org/maven2/commons-cli/commons-cli/1.3.1/commons-cli-1.3.1.pom
[windows-jdk10-m3.5.x_build] [INFO] Downloaded from central: https://repo.maven.apache.org/maven2/commons-cli/commons-cli/1.3.1/commons-cli-1.3.1.pom (10 kB at 371 kB/s)
[windows-jdk10-m3.5.x_build] [INFO] Downloading from central: https://repo.maven.apache.org/maven2/com/google/guava/guava/19.0/guava-19.0.pom
[windows-jdk10-m3.5.x_build] [INFO] Downloaded from central: https://repo.maven.apache.org/maven2/com/google/guava/guava/19.0/guava-19.0.pom (6.8 kB at 272 kB/s)
[windows-jdk10-m3.5.x_build] [INFO] Downloading from central: https://repo.maven.apache.org/maven2/com/google/guava/guava-parent/19.0/guava-parent-19.0.pom
[windows-jdk10-m3.5.x_build] [INFO] Downloaded from central: https://repo.maven.apache.org/maven2/com/google/guava/guava-parent/19.0/guava-parent-19.0.pom (9.9 kB at 260 kB/s)
[windows-jdk10-m3.5.x_build] [INFO] Downloading from central: https://repo.maven.apache.org/maven2/org/sonatype/oss/oss-parent/7/oss-parent-7.pom
[windows-jdk10-m3.5.x_build] [INFO] Downloaded from central: https://repo.maven.apache.org/maven2/org/sonatype/oss/oss-parent/7/oss-parent-7.pom (4.8 kB at 179 kB/s)
[windows-jdk10-m3.5.x_build] [INFO] Downloading from central: https://repo.maven.apache.org/maven2/javax/xml/bind/jaxb-api/2.3.0/jaxb-api-2.3.0.pom
[windows-jdk10-m3.5.x_build] [INFO] Downloaded from central: https://repo.maven.apache.org/maven2/javax/xml/bind/jaxb-api/2.3.0/jaxb-api-2.3.0.pom (23 kB at 676 kB/s)
[windows-jdk10-m3.5.x_build] [INFO] Downloading from central: https://repo.maven.apache.org/maven2/javax/xml/bind/jaxb-api-parent/2.3.0/jaxb-api-parent-2.3.0.pom
[windows-jdk10-m3.5.x_build] [INFO] Downloaded from central: https://repo.maven.apache.org/maven2/javax/xml/bind/jaxb-api-parent/2.3.0/jaxb-api-parent-2.3.0.pom (5.6 kB at 157 kB/s)
[windows-jdk10-m3.5.x_build] [INFO] Downloading from central: https://repo.maven.apache.org/maven2/net/java/jvnet-parent/5/jvnet-parent-5.pom
[windows-jdk10-m3.5.x_build] [INFO] Downloaded from central: https://repo.maven.apache.org/maven2/net/java/jvnet-parent/5/jvnet-parent-5.pom (8.9 kB at 277 kB/s)
[windows-jdk10-m3.5.x_build] [INFO] Downloading from central: https://repo.maven.apache.org/maven2/org/apache/maven/shared/maven-shared-resources/2/maven-shared-resources-2.jar
[windows-jdk10-m3.5.x_build] [INFO] Downloading from central: https://repo.maven.apache.org/maven2/com/puppycrawl/tools/checkstyle/6.18/checkstyle-6.18.jar
[windows-jdk10-m3.5.x_build] [INFO] Downloading from central: https://repo.maven.apache.org/maven2/commons-io/commons-io/1.4/commons-io-1.4.jar
[windows-jdk10-m3.5.x_build] [INFO] Downloading from central: https://repo.maven.apache.org/maven2/org/codehaus/plexus/plexus-resources/1.1.0/plexus-resources-1.1.0.jar
[windows-jdk10-m3.5.x_build] [INFO] Downloading from central: https://repo.maven.apache.org/maven2/org/apache/maven/doxia/doxia-integration-tools/1.6/doxia-integration-tools-1.6.jar
[windows-jdk10-m3.5.x_build] [INFO] Downloaded from central: https://repo.maven.apache.org/maven2/org/apache/maven/shared/maven-shared-resources/2/maven-shared-resources-2.jar (13 kB at 97 kB/s)
[windows-jdk10-m3.5.x_build] [INFO] Downloading from central: https://repo.maven.apache.org/maven2/antlr/antlr/2.7.7/antlr-2.7.7.jar
[windows-jdk10-m3.5.x_build] [INFO] Downloaded from central: https://repo.maven.apache.org/maven2/com/puppycrawl/tools/checkstyle/6.18/checkstyle-6.18.jar (1.2 MB at 7.1 MB/s)
[windows-jdk10-m3.5.x_build] [INFO] Downloading from central: https://repo.maven.apache.org/maven2/org/antlr/antlr4-runtime/4.5.3/antlr4-runtime-4.5.3.jar
[windows-jdk10-m3.5.x_build] [INFO] Downloaded from central: https://repo.maven.apache.org/maven2/commons-io/commons-io/1.4/commons-io-1.4.jar (109 kB at 593 kB/s)
[windows-jdk10-m3.5.x_build] [INFO] Downloading from central: https://repo.maven.apache.org/maven2/commons-beanutils/commons-beanutils/1.9.2/commons-beanutils-1.9.2.jar
[windows-jdk10-m3.5.x_build] [INFO] Downloaded from central: https://repo.maven.apache.org/maven2/antlr/antlr/2.7.7/antlr-2.7.7.jar (445 kB at 2.0 MB/s)
[windows-jdk10-m3.5.x_build] [INFO] Downloading from central: https://repo.maven.apache.org/maven2/commons-cli/commons-cli/1.3.1/commons-cli-1.3.1.jar
[windows-jdk10-m3.5.x_build] [INFO] Downloaded from central: https://repo.maven.apache.org/maven2/commons-beanutils/commons-beanutils/1.9.2/commons-beanutils-1.9.2.jar (234 kB at 1.0 MB/s)
[windows-jdk10-m3.5.x_build] [INFO] Downloading from central: https://repo.maven.apache.org/maven2/com/google/guava/guava/19.0/guava-19.0.jar
[windows-jdk10-m3.5.x_build] [INFO] Downloaded from central: https://repo.maven.apache.org/maven2/org/antlr/antlr4-runtime/4.5.3/antlr4-runtime-4.5.3.jar (302 kB at 1.3 MB/s)
[windows-jdk10-m3.5.x_build] [INFO] Downloading from central: https://repo.maven.apache.org/maven2/javax/xml/bind/jaxb-api/2.3.0/jaxb-api-2.3.0.jar
[windows-jdk10-m3.5.x_build] [INFO] Downloaded from central: https://repo.maven.apache.org/maven2/org/codehaus/plexus/plexus-resources/1.1.0/plexus-resources-1.1.0.jar (23 kB at 100 kB/s)
[windows-jdk10-m3.5.x_build] [INFO] Downloaded from central: https://repo.maven.apache.org/maven2/commons-cli/commons-cli/1.3.1/commons-cli-1.3.1.jar (53 kB at 187 kB/s)
[windows-jdk10-m3.5.x_build] [INFO] Downloaded from central: https://repo.maven.apache.org/maven2/javax/xml/bind/jaxb-api/2.3.0/jaxb-api-2.3.0.jar (126 kB at 426 kB/s)
[windows-jdk10-m3.5.x_build] [INFO] Downloaded from central: https://repo.maven.apache.org/maven2/org/apache/maven/doxia/doxia-integration-tools/1.6/doxia-integration-tools-1.6.jar (45 kB at 143 kB/s)
[windows-jdk10-m3.5.x_build] [INFO] Downloaded from central: https://repo.maven.apache.org/maven2/com/google/guava/guava/19.0/guava-19.0.jar (2.3 MB at 7.4 MB/s)
[windows-jdk10-m3.5.x_build] [INFO] There is 1 error reported by Checkstyle 6.18 with config/maven_checks.xml ruleset.
[windows-jdk10-m3.5.x_build] [INFO] Ignored 1 error, 0 violation remaining.
[windows-jdk10-m3.5.x_build] [INFO]
[windows-jdk10-m3.5.x_build] [INFO] --- maven-invoker-plugin:3.1.0:verify (integration-test) @ maven-dependency-plugin ---
[windows-jdk10-m3.5.x_build] [INFO] -------------------------------------------------
[windows-jdk10-m3.5.x_build] [INFO] Build Summary:
[windows-jdk10-m3.5.x_build] [INFO]   Passed: 50, Failed: 7, Errors: 0, Skipped: 1
[windows-jdk10-m3.5.x_build] [INFO] -------------------------------------------------
[windows-jdk10-m3.5.x_build] [ERROR] The following builds failed:
[windows-jdk10-m3.5.x_build] [ERROR] *  get-artifact-maven-plugin\pom.xml
[windows-jdk10-m3.5.x_build] [ERROR] *  get-artifact\pom.xml
[windows-jdk10-m3.5.x_build] [ERROR] *  get-gav\pom.xml
[windows-jdk10-m3.5.x_build] [ERROR] *  go-offline\pom.xml
[windows-jdk10-m3.5.x_build] [ERROR] *  resolve-plugins-exclude-reactor\pom.xml
[windows-jdk10-m3.5.x_build] [ERROR] *  resolve-plugins-with-exclude\pom.xml
[windows-jdk10-m3.5.x_build] [ERROR] *  resolve-plugins\pom.xml
[windows-jdk10-m3.5.x_build] [INFO] -------------------------------------------------
[windows-jdk10-m3.5.x_build] [INFO] ------------------------------------------------------------------------
[windows-jdk10-m3.5.x_build] [INFO] BUILD FAILURE
[windows-jdk10-m3.5.x_build] [INFO] ------------------------------------------------------------------------
[windows-jdk10-m3.5.x_build] [INFO] Total time: 29:33 min
[windows-jdk10-m3.5.x_build] [INFO] Finished at: 2018-09-11T07:14:51-07:00
[windows-jdk10-m3.5.x_build] [INFO] Final Memory: 52M/180M
[windows-jdk10-m3.5.x_build] [INFO] ------------------------------------------------------------------------
[windows-jdk10-m3.5.x_build] [INFO] [jenkins-event-spy] Generated F:\jenkins\jenkins-slave\workspace\-dependency-plugin_MDEP-625-3I6V7G3727HFCGSCWRQH5RTCWRSMXZQ3ZEOVZRI3U3XLP2Z7WCCQ@tmp\withMaven6ff2dbab\maven-spy-20180911-064516-9722727739189799995686.log
[windows-jdk10-m3.5.x_build] [ERROR] Failed to execute goal org.apache.maven.plugins:maven-invoker-plugin:3.1.0:verify (integration-test) on project maven-dependency-plugin: 7 builds failed. See console output above for details. -> [Help 1]
[windows-jdk10-m3.5.x_build] [ERROR]
[windows-jdk10-m3.5.x_build] [ERROR] To see the full stack trace of the errors, re-run Maven with the -e switch.
[windows-jdk10-m3.5.x_build] [ERROR] Re-run Maven using the -X switch to enable full debug logging.
[windows-jdk10-m3.5.x_build] [ERROR]
[windows-jdk10-m3.5.x_build] [ERROR] For more information about the errors and possible solutions, please read the following articles:
[windows-jdk10-m3.5.x_build] [ERROR] [Help 1] http://cwiki.apache.org/confluence/display/MAVEN/MojoFailureException
[Pipeline] [windows-jdk10-m3.5.x_build] }
[Pipeline] [windows-jdk10-m3.5.x_build] // dir
[Pipeline] [windows-jdk10-m3.5.x_build] }
[windows-jdk10-m3.5.x_build] [Fast Archiver] No prior successful build to compare, so performing full copy of artifacts
[windows-jdk10-m3.5.x_build] [withMaven] invokerPublisher - Archive invoker results for Maven artifact MavenArtifact{org.apache.maven.plugins:maven-dependency-plugin::3.1.2-SNAPSHOT(version: 3.1.2-SNAPSHOT, snapshot:false) } generated by PluginInvocation{org.apache.maven.plugins:maven-invoker-plugin:3.1.0@integration-test  integration-test}: windows-jdk10-m3.5.x_build\target\invoker-reports\*.xml
[windows-jdk10-m3.5.x_build] performing MavenInvokerRecorder, reportsFilenamePattern:'**/windows-jdk10-m3.5.x_build\target\invoker-reports/BUILD*.xml', invokerBuildDir:'**/windows-jdk10-m3.5.x_build\target\it'
[windows-jdk10-m3.5.x_build] Found reports:[f:\jenkins\jenkins-slave\workspace\-dependency-plugin_MDEP-625-3I6V7G3727HFCGSCWRQH5RTCWRSMXZQ3ZEOVZRI3U3XLP2Z7WCCQ\windows-jdk10-m3.5.x_build\target\invoker-reports\BUILD-analyze-dep-mgt.xml, f:\jenkins\jenkins-slave\workspace\-dependency-plugin_MDEP-625-3I6V7G3727HFCGSCWRQH5RTCWRSMXZQ3ZEOVZRI3U3XLP2Z7WCCQ\windows-jdk10-m3.5.x_build\target\invoker-reports\BUILD-analyze-ignore-dependency.xml, f:\jenkins\jenkins-slave\workspace\-dependency-plugin_MDEP-625-3I6V7G3727HFCGSCWRQH5RTCWRSMXZQ3ZEOVZRI3U3XLP2Z7WCCQ\windows-jdk10-m3.5.x_build\target\invoker-reports\BUILD-analyze-ignore-unused-declared-dependency.xml, f:\jenkins\jenkins-slave\workspace\-dependency-plugin_MDEP-625-3I6V7G3727HFCGSCWRQH5RTCWRSMXZQ3ZEOVZRI3U3XLP2Z7WCCQ\windows-jdk10-m3.5.x_build\target\invoker-reports\BUILD-analyze-ignore-used-undeclared-dependency.xml, f:\jenkins\jenkins-slave\workspace\-dependency-plugin_MDEP-625-3I6V7G3727HFCGSCWRQH5RTCWRSMXZQ3ZEOVZRI3U3XLP2Z7WCCQ\windows-jdk10-m3.5.x_build\target\invoker-reports\BUILD-analyze-multimodule-project.xml, f:\jenkins\jenkins-slave\workspace\-dependency-plugin_MDEP-625-3I6V7G3727HFCGSCWRQH5RTCWRSMXZQ3ZEOVZRI3U3XLP2Z7WCCQ\windows-jdk10-m3.5.x_build\target\invoker-reports\BUILD-analyze-report.xml, f:\jenkins\jenkins-slave\workspace\-dependency-plugin_MDEP-625-3I6V7G3727HFCGSCWRQH5RTCWRSMXZQ3ZEOVZRI3U3XLP2Z7WCCQ\windows-jdk10-m3.5.x_build\target\invoker-reports\BUILD-analyze.xml, f:\jenkins\jenkins-slave\workspace\-dependency-plugin_MDEP-625-3I6V7G3727HFCGSCWRQH5RTCWRSMXZQ3ZEOVZRI3U3XLP2Z7WCCQ\windows-jdk10-m3.5.x_build\target\invoker-reports\BUILD-build-classpath-output-file-and-property.xml, f:\jenkins\jenkins-slave\workspace\-dependency-plugin_MDEP-625-3I6V7G3727HFCGSCWRQH5RTCWRSMXZQ3ZEOVZRI3U3XLP2Z7WCCQ\windows-jdk10-m3.5.x_build\target\invoker-reports\BUILD-build-classpath.xml, f:\jenkins\jenkins-slave\workspace\-dependency-plugin_MDEP-625-3I6V7G3727HFCGSCWRQH5RTCWRSMXZQ3ZEOVZRI3U3XLP2Z7WCCQ\windows-jdk10-m3.5.x_build\target\invoker-reports\BUILD-collect.xml, f:\jenkins\jenkins-slave\workspace\-dependency-plugin_MDEP-625-3I6V7G3727HFCGSCWRQH5RTCWRSMXZQ3ZEOVZRI3U3XLP2Z7WCCQ\windows-jdk10-m3.5.x_build\target\invoker-reports\BUILD-copy-and-unpack-with-alternate-local-repo.xml, f:\jenkins\jenkins-slave\workspace\-dependency-plugin_MDEP-625-3I6V7G3727HFCGSCWRQH5RTCWRSMXZQ3ZEOVZRI3U3XLP2Z7WCCQ\windows-jdk10-m3.5.x_build\target\invoker-reports\BUILD-copy-cli.xml, f:\jenkins\jenkins-slave\workspace\-dependency-plugin_MDEP-625-3I6V7G3727HFCGSCWRQH5RTCWRSMXZQ3ZEOVZRI3U3XLP2Z7WCCQ\windows-jdk10-m3.5.x_build\target\invoker-reports\BUILD-copy-dependencies.xml, f:\jenkins\jenkins-slave\workspace\-dependency-plugin_MDEP-625-3I6V7G3727HFCGSCWRQH5RTCWRSMXZQ3ZEOVZRI3U3XLP2Z7WCCQ\windows-jdk10-m3.5.x_build\target\invoker-reports\BUILD-copy-from-reactor.xml, f:\jenkins\jenkins-slave\workspace\-dependency-plugin_MDEP-625-3I6V7G3727HFCGSCWRQH5RTCWRSMXZQ3ZEOVZRI3U3XLP2Z7WCCQ\windows-jdk10-m3.5.x_build\target\invoker-reports\BUILD-copy-from-remote-repository.xml, f:\jenkins\jenkins-slave\workspace\-dependency-plugin_MDEP-625-3I6V7G3727HFCGSCWRQH5RTCWRSMXZQ3ZEOVZRI3U3XLP2Z7WCCQ\windows-jdk10-m3.5.x_build\target\invoker-reports\BUILD-copy.xml, f:\jenkins\jenkins-slave\workspace\-dependency-plugin_MDEP-625-3I6V7G3727HFCGSCWRQH5RTCWRSMXZQ3ZEOVZRI3U3XLP2Z7WCCQ\windows-jdk10-m3.5.x_build\target\invoker-reports\BUILD-dependency-properties.xml, f:\jenkins\jenkins-slave\workspace\-dependency-plugin_MDEP-625-3I6V7G3727HFCGSCWRQH5RTCWRSMXZQ3ZEOVZRI3U3XLP2Z7WCCQ\windows-jdk10-m3.5.x_build\target\invoker-reports\BUILD-filterunpack.xml, f:\jenkins\jenkins-slave\workspace\-dependency-plugin_MDEP-625-3I6V7G3727HFCGSCWRQH5RTCWRSMXZQ3ZEOVZRI3U3XLP2Z7WCCQ\windows-jdk10-m3.5.x_build\target\invoker-reports\BUILD-get-artifact-maven-plugin.xml, f:\jenkins\jenkins-slave\workspace\-dependency-plugin_MDEP-625-3I6V7G3727HFCGSCWRQH5RTCWRSMXZQ3ZEOVZRI3U3XLP2Z7WCCQ\windows-jdk10-m3.5.x_build\target\invoker-reports\BUILD-get-artifact-no-transitive.xml, f:\jenkins\jenkins-slave\workspace\-dependency-plugin_MDEP-625-3I6V7G3727HFCGSCWRQH5RTCWRSMXZQ3ZEOVZRI3U3XLP2Z7WCCQ\windows-jdk10-m3.5.x_build\target\invoker-reports\BUILD-get-artifact.xml, f:\jenkins\jenkins-slave\workspace\-dependency-plugin_MDEP-625-3I6V7G3727HFCGSCWRQH5RTCWRSMXZQ3ZEOVZRI3U3XLP2Z7WCCQ\windows-jdk10-m3.5.x_build\target\invoker-reports\BUILD-get-gav.xml, f:\jenkins\jenkins-slave\workspace\-dependency-plugin_MDEP-625-3I6V7G3727HFCGSCWRQH5RTCWRSMXZQ3ZEOVZRI3U3XLP2Z7WCCQ\windows-jdk10-m3.5.x_build\target\invoker-reports\BUILD-go-offline.xml, f:\jenkins\jenkins-slave\workspace\-dependency-plugin_MDEP-625-3I6V7G3727HFCGSCWRQH5RTCWRSMXZQ3ZEOVZRI3U3XLP2Z7WCCQ\windows-jdk10-m3.5.x_build\target\invoker-reports\BUILD-list-repositories.xml, f:\jenkins\jenkins-slave\workspace\-dependency-plugin_MDEP-625-3I6V7G3727HFCGSCWRQH5RTCWRSMXZQ3ZEOVZRI3U3XLP2Z7WCCQ\windows-jdk10-m3.5.x_build\target\invoker-reports\BUILD-mdep-439-analyze-java8.xml, f:\jenkins\jenkins-slave\workspace\-dependency-plugin_MDEP-625-3I6V7G3727HFCGSCWRQH5RTCWRSMXZQ3ZEOVZRI3U3XLP2Z7WCCQ\windows-jdk10-m3.5.x_build\target\invoker-reports\BUILD-mdep-450-project-with-ancestor.xml, f:\jenkins\jenkins-slave\workspace\-dependency-plugin_MDEP-625-3I6V7G3727HFCGSCWRQH5RTCWRSMXZQ3ZEOVZRI3U3XLP2Z7WCCQ\windows-jdk10-m3.5.x_build\target\invoker-reports\BUILD-mdep-450-project-without-ancestor.xml, f:\jenkins\jenkins-slave\workspace\-dependency-plugin_MDEP-625-3I6V7G3727HFCGSCWRQH5RTCWRSMXZQ3ZEOVZRI3U3XLP2Z7WCCQ\windows-jdk10-m3.5.x_build\target\invoker-reports\BUILD-mdep-506-dependency-without-version-in-depmgt.xml, f:\jenkins\jenkins-slave\workspace\-dependency-plugin_MDEP-625-3I6V7G3727HFCGSCWRQH5RTCWRSMXZQ3ZEOVZRI3U3XLP2Z7WCCQ\windows-jdk10-m3.5.x_build\target\invoker-reports\BUILD-mdep-571-resolve-java9.xml, f:\jenkins\jenkins-slave\workspace\-dependency-plugin_MDEP-625-3I6V7G3727HFCGSCWRQH5RTCWRSMXZQ3ZEOVZRI3U3XLP2Z7WCCQ\windows-jdk10-m3.5.x_build\target\invoker-reports\BUILD-mdep-572-unpack-tar-long-file.xml, f:\jenkins\jenkins-slave\workspace\-dependency-plugin_MDEP-625-3I6V7G3727HFCGSCWRQH5RTCWRSMXZQ3ZEOVZRI3U3XLP2Z7WCCQ\windows-jdk10-m3.5.x_build\target\invoker-reports\BUILD-mdep-578_display-reason-invalid-module.xml, f:\jenkins\jenkins-slave\workspace\-dependency-plugin_MDEP-625-3I6V7G3727HFCGSCWRQH5RTCWRSMXZQ3ZEOVZRI3U3XLP2Z7WCCQ\windows-jdk10-m3.5.x_build\target\invoker-reports\BUILD-mdep-580_display-manifest-automodules.xml, f:\jenkins\jenkins-slave\workspace\-dependency-plugin_MDEP-625-3I6V7G3727HFCGSCWRQH5RTCWRSMXZQ3ZEOVZRI3U3XLP2Z7WCCQ\windows-jdk10-m3.5.x_build\target\invoker-reports\BUILD-mdep-599-analyze-java9.xml, f:\jenkins\jenkins-slave\workspace\-dependency-plugin_MDEP-625-3I6V7G3727HFCGSCWRQH5RTCWRSMXZQ3ZEOVZRI3U3XLP2Z7WCCQ\windows-jdk10-m3.5.x_build\target\invoker-reports\BUILD-purge-local-repository-bad-dep.xml, f:\jenkins\jenkins-slave\workspace\-dependency-plugin_MDEP-625-3I6V7G3727HFCGSCWRQH5RTCWRSMXZQ3ZEOVZRI3U3XLP2Z7WCCQ\windows-jdk10-m3.5.x_build\target\invoker-reports\BUILD-purge-local-repository-include.xml, f:\jenkins\jenkins-slave\workspace\-dependency-plugin_MDEP-625-3I6V7G3727HFCGSCWRQH5RTCWRSMXZQ3ZEOVZRI3U3XLP2Z7WCCQ\windows-jdk10-m3.5.x_build\target\invoker-reports\BUILD-purge-local-repository-multi-module-execution.xml, f:\jenkins\jenkins-slave\workspace\-dependency-plugin_MDEP-625-3I6V7G3727HFCGSCWRQH5RTCWRSMXZQ3ZEOVZRI3U3XLP2Z7WCCQ\windows-jdk10-m3.5.x_build\target\invoker-reports\BUILD-purge-local-repository-multi-module.xml, f:\jenkins\jenkins-slave\workspace\-dependency-plugin_MDEP-625-3I6V7G3727HFCGSCWRQH5RTCWRSMXZQ3ZEOVZRI3U3XLP2Z7WCCQ\windows-jdk10-m3.5.x_build\target\invoker-reports\BUILD-purge-local-repository-non-transitive.xml, f:\jenkins\jenkins-slave\workspace\-dependency-plugin_MDEP-625-3I6V7G3727HFCGSCWRQH5RTCWRSMXZQ3ZEOVZRI3U3XLP2Z7WCCQ\windows-jdk10-m3.5.x_build\target\invoker-reports\BUILD-purge-local-repository-reresolve.xml, f:\jenkins\jenkins-slave\workspace\-dependency-plugin_MDEP-625-3I6V7G3727HFCGSCWRQH5RTCWRSMXZQ3ZEOVZRI3U3XLP2Z7WCCQ\windows-jdk10-m3.5.x_build\target\invoker-reports\BUILD-purge-local-repository-snapshots-only.xml, f:\jenkins\jenkins-slave\workspace\-dependency-plugin_MDEP-625-3I6V7G3727HFCGSCWRQH5RTCWRSMXZQ3ZEOVZRI3U3XLP2Z7WCCQ\windows-jdk10-m3.5.x_build\target\invoker-reports\BUILD-purge-local-repository-version-range.xml, f:\jenkins\jenkins-slave\workspace\-dependency-plugin_MDEP-625-3I6V7G3727HFCGSCWRQH5RTCWRSMXZQ3ZEOVZRI3U3XLP2Z7WCCQ\windows-jdk10-m3.5.x_build\target\invoker-reports\BUILD-purge-local-repository-without-pom.xml, f:\jenkins\jenkins-slave\workspace\-dependency-plugin_MDEP-625-3I6V7G3727HFCGSCWRQH5RTCWRSMXZQ3ZEOVZRI3U3XLP2Z7WCCQ\windows-jdk10-m3.5.x_build\target\invoker-reports\BUILD-purge-local-repository.xml, f:\jenkins\jenkins-slave\workspace\-dependency-plugin_MDEP-625-3I6V7G3727HFCGSCWRQH5RTCWRSMXZQ3ZEOVZRI3U3XLP2Z7WCCQ\windows-jdk10-m3.5.x_build\target\invoker-reports\BUILD-resolve-plugins-exclude-reactor.xml, f:\jenkins\jenkins-slave\workspace\-dependency-plugin_MDEP-625-3I6V7G3727HFCGSCWRQH5RTCWRSMXZQ3ZEOVZRI3U3XLP2Z7WCCQ\windows-jdk10-m3.5.x_build\target\invoker-reports\BUILD-resolve-plugins-with-exclude.xml, f:\jenkins\jenkins-slave\workspace\-dependency-plugin_MDEP-625-3I6V7G3727HFCGSCWRQH5RTCWRSMXZQ3ZEOVZRI3U3XLP2Z7WCCQ\windows-jdk10-m3.5.x_build\target\invoker-reports\BUILD-resolve-plugins.xml, f:\jenkins\jenkins-slave\workspace\-dependency-plugin_MDEP-625-3I6V7G3727HFCGSCWRQH5RTCWRSMXZQ3ZEOVZRI3U3XLP2Z7WCCQ\windows-jdk10-m3.5.x_build\target\invoker-reports\BUILD-resolve.xml, f:\jenkins\jenkins-slave\workspace\-dependency-plugin_MDEP-625-3I6V7G3727HFCGSCWRQH5RTCWRSMXZQ3ZEOVZRI3U3XLP2Z7WCCQ\windows-jdk10-m3.5.x_build\target\invoker-reports\BUILD-setup-custom-ear-lifecycle.xml, f:\jenkins\jenkins-slave\workspace\-dependency-plugin_MDEP-625-3I6V7G3727HFCGSCWRQH5RTCWRSMXZQ3ZEOVZRI3U3XLP2Z7WCCQ\windows-jdk10-m3.5.x_build\target\invoker-reports\BUILD-sources.xml, f:\jenkins\jenkins-slave\workspace\-dependency-plugin_MDEP-625-3I6V7G3727HFCGSCWRQH5RTCWRSMXZQ3ZEOVZRI3U3XLP2Z7WCCQ\windows-jdk10-m3.5.x_build\target\invoker-reports\BUILD-tree-includes.xml, f:\jenkins\jenkins-slave\workspace\-dependency-plugin_MDEP-625-3I6V7G3727HFCGSCWRQH5RTCWRSMXZQ3ZEOVZRI3U3XLP2Z7WCCQ\windows-jdk10-m3.5.x_build\target\invoker-reports\BUILD-tree-multimodule.xml, f:\jenkins\jenkins-slave\workspace\-dependency-plugin_MDEP-625-3I6V7G3727HFCGSCWRQH5RTCWRSMXZQ3ZEOVZRI3U3XLP2Z7WCCQ\windows-jdk10-m3.5.x_build\target\invoker-reports\BUILD-tree.xml, f:\jenkins\jenkins-slave\workspace\-dependency-plugin_MDEP-625-3I6V7G3727HFCGSCWRQH5RTCWRSMXZQ3ZEOVZRI3U3XLP2Z7WCCQ\windows-jdk10-m3.5.x_build\target\invoker-reports\BUILD-unpack-cli.xml, f:\jenkins\jenkins-slave\workspace\-dependency-plugin_MDEP-625-3I6V7G3727HFCGSCWRQH5RTCWRSMXZQ3ZEOVZRI3U3XLP2Z7WCCQ\windows-jdk10-m3.5.x_build\target\invoker-reports\BUILD-unpack-custom-ear.xml, f:\jenkins\jenkins-slave\workspace\-dependency-plugin_MDEP-625-3I6V7G3727HFCGSCWRQH5RTCWRSMXZQ3ZEOVZRI3U3XLP2Z7WCCQ\windows-jdk10-m3.5.x_build\target\invoker-reports\BUILD-unpack-dependencies.xml, f:\jenkins\jenkins-slave\workspace\-dependency-plugin_MDEP-625-3I6V7G3727HFCGSCWRQH5RTCWRSMXZQ3ZEOVZRI3U3XLP2Z7WCCQ\windows-jdk10-m3.5.x_build\target\invoker-reports\BUILD-unpack-from-remote-repository.xml, f:\jenkins\jenkins-slave\workspace\-dependency-plugin_MDEP-625-3I6V7G3727HFCGSCWRQH5RTCWRSMXZQ3ZEOVZRI3U3XLP2Z7WCCQ\windows-jdk10-m3.5.x_build\target\invoker-reports\BUILD-unpack.xml, f:\jenkins\jenkins-slave\workspace\-dependency-plugin_MDEP-625-3I6V7G3727HFCGSCWRQH5RTCWRSMXZQ3ZEOVZRI3U3XLP2Z7WCCQ\windows-jdk10-m3.5.x_build\target\invoker-reports\BUILD-used-dependencies.xml]
[windows-jdk10-m3.5.x_build] Found logs:[f:\jenkins\jenkins-slave\workspace\-dependency-plugin_MDEP-625-3I6V7G3727HFCGSCWRQH5RTCWRSMXZQ3ZEOVZRI3U3XLP2Z7WCCQ\windows-jdk10-m3.5.x_build\target\it\analyze-dep-mgt\build.log, f:\jenkins\jenkins-slave\workspace\-dependency-plugin_MDEP-625-3I6V7G3727HFCGSCWRQH5RTCWRSMXZQ3ZEOVZRI3U3XLP2Z7WCCQ\windows-jdk10-m3.5.x_build\target\it\analyze-ignore-dependency\build.log, f:\jenkins\jenkins-slave\workspace\-dependency-plugin_MDEP-625-3I6V7G3727HFCGSCWRQH5RTCWRSMXZQ3ZEOVZRI3U3XLP2Z7WCCQ\windows-jdk10-m3.5.x_build\target\it\analyze-ignore-unused-declared-dependency\build.log, f:\jenkins\jenkins-slave\workspace\-dependency-plugin_MDEP-625-3I6V7G3727HFCGSCWRQH5RTCWRSMXZQ3ZEOVZRI3U3XLP2Z7WCCQ\windows-jdk10-m3.5.x_build\target\it\analyze-ignore-used-undeclared-dependency\build.log, f:\jenkins\jenkins-slave\workspace\-dependency-plugin_MDEP-625-3I6V7G3727HFCGSCWRQH5RTCWRSMXZQ3ZEOVZRI3U3XLP2Z7WCCQ\windows-jdk10-m3.5.x_build\target\it\analyze-multimodule-project\build.log, f:\jenkins\jenkins-slave\workspace\-dependency-plugin_MDEP-625-3I6V7G3727HFCGSCWRQH5RTCWRSMXZQ3ZEOVZRI3U3XLP2Z7WCCQ\windows-jdk10-m3.5.x_build\target\it\analyze-report\build.log, f:\jenkins\jenkins-slave\workspace\-dependency-plugin_MDEP-625-3I6V7G3727HFCGSCWRQH5RTCWRSMXZQ3ZEOVZRI3U3XLP2Z7WCCQ\windows-jdk10-m3.5.x_build\target\it\analyze\build.log, f:\jenkins\jenkins-slave\workspace\-dependency-plugin_MDEP-625-3I6V7G3727HFCGSCWRQH5RTCWRSMXZQ3ZEOVZRI3U3XLP2Z7WCCQ\windows-jdk10-m3.5.x_build\target\it\build-classpath-output-file-and-property\build.log, f:\jenkins\jenkins-slave\workspace\-dependency-plugin_MDEP-625-3I6V7G3727HFCGSCWRQH5RTCWRSMXZQ3ZEOVZRI3U3XLP2Z7WCCQ\windows-jdk10-m3.5.x_build\target\it\build-classpath\build.log, f:\jenkins\jenkins-slave\workspace\-dependency-plugin_MDEP-625-3I6V7G3727HFCGSCWRQH5RTCWRSMXZQ3ZEOVZRI3U3XLP2Z7WCCQ\windows-jdk10-m3.5.x_build\target\it\collect\build.log, f:\jenkins\jenkins-slave\workspace\-dependency-plugin_MDEP-625-3I6V7G3727HFCGSCWRQH5RTCWRSMXZQ3ZEOVZRI3U3XLP2Z7WCCQ\windows-jdk10-m3.5.x_build\target\it\copy-and-unpack-with-alternate-local-repo\build.log, f:\jenkins\jenkins-slave\workspace\-dependency-plugin_MDEP-625-3I6V7G3727HFCGSCWRQH5RTCWRSMXZQ3ZEOVZRI3U3XLP2Z7WCCQ\windows-jdk10-m3.5.x_build\target\it\copy-cli\build.log, f:\jenkins\jenkins-slave\workspace\-dependency-plugin_MDEP-625-3I6V7G3727HFCGSCWRQH5RTCWRSMXZQ3ZEOVZRI3U3XLP2Z7WCCQ\windows-jdk10-m3.5.x_build\target\it\copy-dependencies\build.log, f:\jenkins\jenkins-slave\workspace\-dependency-plugin_MDEP-625-3I6V7G3727HFCGSCWRQH5RTCWRSMXZQ3ZEOVZRI3U3XLP2Z7WCCQ\windows-jdk10-m3.5.x_build\target\it\copy-from-reactor\build.log, f:\jenkins\jenkins-slave\workspace\-dependency-plugin_MDEP-625-3I6V7G3727HFCGSCWRQH5RTCWRSMXZQ3ZEOVZRI3U3XLP2Z7WCCQ\windows-jdk10-m3.5.x_build\target\it\copy-from-remote-repository\build.log, f:\jenkins\jenkins-slave\workspace\-dependency-plugin_MDEP-625-3I6V7G3727HFCGSCWRQH5RTCWRSMXZQ3ZEOVZRI3U3XLP2Z7WCCQ\windows-jdk10-m3.5.x_build\target\it\copy\build.log, f:\jenkins\jenkins-slave\workspace\-dependency-plugin_MDEP-625-3I6V7G3727HFCGSCWRQH5RTCWRSMXZQ3ZEOVZRI3U3XLP2Z7WCCQ\windows-jdk10-m3.5.x_build\target\it\dependency-properties\build.log, f:\jenkins\jenkins-slave\workspace\-dependency-plugin_MDEP-625-3I6V7G3727HFCGSCWRQH5RTCWRSMXZQ3ZEOVZRI3U3XLP2Z7WCCQ\windows-jdk10-m3.5.x_build\target\it\filterunpack\build.log, f:\jenkins\jenkins-slave\workspace\-dependency-plugin_MDEP-625-3I6V7G3727HFCGSCWRQH5RTCWRSMXZQ3ZEOVZRI3U3XLP2Z7WCCQ\windows-jdk10-m3.5.x_build\target\it\get-artifact-maven-plugin\build.log, f:\jenkins\jenkins-slave\workspace\-dependency-plugin_MDEP-625-3I6V7G3727HFCGSCWRQH5RTCWRSMXZQ3ZEOVZRI3U3XLP2Z7WCCQ\windows-jdk10-m3.5.x_build\target\it\get-artifact-no-transitive\build.log, f:\jenkins\jenkins-slave\workspace\-dependency-plugin_MDEP-625-3I6V7G3727HFCGSCWRQH5RTCWRSMXZQ3ZEOVZRI3U3XLP2Z7WCCQ\windows-jdk10-m3.5.x_build\target\it\get-artifact\build.log, f:\jenkins\jenkins-slave\workspace\-dependency-plugin_MDEP-625-3I6V7G3727HFCGSCWRQH5RTCWRSMXZQ3ZEOVZRI3U3XLP2Z7WCCQ\windows-jdk10-m3.5.x_build\target\it\get-gav\build.log, f:\jenkins\jenkins-slave\workspace\-dependency-plugin_MDEP-625-3I6V7G3727HFCGSCWRQH5RTCWRSMXZQ3ZEOVZRI3U3XLP2Z7WCCQ\windows-jdk10-m3.5.x_build\target\it\go-offline\build.log, f:\jenkins\jenkins-slave\workspace\-dependency-plugin_MDEP-625-3I6V7G3727HFCGSCWRQH5RTCWRSMXZQ3ZEOVZRI3U3XLP2Z7WCCQ\windows-jdk10-m3.5.x_build\target\it\list-repositories\build.log, f:\jenkins\jenkins-slave\workspace\-dependency-plugin_MDEP-625-3I6V7G3727HFCGSCWRQH5RTCWRSMXZQ3ZEOVZRI3U3XLP2Z7WCCQ\windows-jdk10-m3.5.x_build\target\it\mdep-439-analyze-java8\build.log, f:\jenkins\jenkins-slave\workspace\-dependency-plugin_MDEP-625-3I6V7G3727HFCGSCWRQH5RTCWRSMXZQ3ZEOVZRI3U3XLP2Z7WCCQ\windows-jdk10-m3.5.x_build\target\it\mdep-450-project-with-ancestor\build.log, f:\jenkins\jenkins-slave\workspace\-dependency-plugin_MDEP-625-3I6V7G3727HFCGSCWRQH5RTCWRSMXZQ3ZEOVZRI3U3XLP2Z7WCCQ\windows-jdk10-m3.5.x_build\target\it\mdep-450-project-without-ancestor\build.log, f:\jenkins\jenkins-slave\workspace\-dependency-plugin_MDEP-625-3I6V7G3727HFCGSCWRQH5RTCWRSMXZQ3ZEOVZRI3U3XLP2Z7WCCQ\windows-jdk10-m3.5.x_build\target\it\mdep-506-dependency-without-version-in-depmgt\build.log, f:\jenkins\jenkins-slave\workspace\-dependency-plugin_MDEP-625-3I6V7G3727HFCGSCWRQH5RTCWRSMXZQ3ZEOVZRI3U3XLP2Z7WCCQ\windows-jdk10-m3.5.x_build\target\it\mdep-571-resolve-java9\build.log, f:\jenkins\jenkins-slave\workspace\-dependency-plugin_MDEP-625-3I6V7G3727HFCGSCWRQH5RTCWRSMXZQ3ZEOVZRI3U3XLP2Z7WCCQ\windows-jdk10-m3.5.x_build\target\it\mdep-572-unpack-tar-long-file\build.log, f:\jenkins\jenkins-slave\workspace\-dependency-plugin_MDEP-625-3I6V7G3727HFCGSCWRQH5RTCWRSMXZQ3ZEOVZRI3U3XLP2Z7WCCQ\windows-jdk10-m3.5.x_build\target\it\mdep-578_display-reason-invalid-module\build.log, f:\jenkins\jenkins-slave\workspace\-dependency-plugin_MDEP-625-3I6V7G3727HFCGSCWRQH5RTCWRSMXZQ3ZEOVZRI3U3XLP2Z7WCCQ\windows-jdk10-m3.5.x_build\target\it\mdep-580_display-manifest-automodules\build.log, f:\jenkins\jenkins-slave\workspace\-dependency-plugin_MDEP-625-3I6V7G3727HFCGSCWRQH5RTCWRSMXZQ3ZEOVZRI3U3XLP2Z7WCCQ\windows-jdk10-m3.5.x_build\target\it\mdep-599-analyze-java9\build.log, f:\jenkins\jenkins-slave\workspace\-dependency-plugin_MDEP-625-3I6V7G3727HFCGSCWRQH5RTCWRSMXZQ3ZEOVZRI3U3XLP2Z7WCCQ\windows-jdk10-m3.5.x_build\target\it\purge-local-repository-bad-dep\build.log, f:\jenkins\jenkins-slave\workspace\-dependency-plugin_MDEP-625-3I6V7G3727HFCGSCWRQH5RTCWRSMXZQ3ZEOVZRI3U3XLP2Z7WCCQ\windows-jdk10-m3.5.x_build\target\it\purge-local-repository-include\build.log, f:\jenkins\jenkins-slave\workspace\-dependency-plugin_MDEP-625-3I6V7G3727HFCGSCWRQH5RTCWRSMXZQ3ZEOVZRI3U3XLP2Z7WCCQ\windows-jdk10-m3.5.x_build\target\it\purge-local-repository-multi-module-execution\build.log, f:\jenkins\jenkins-slave\workspace\-dependency-plugin_MDEP-625-3I6V7G3727HFCGSCWRQH5RTCWRSMXZQ3ZEOVZRI3U3XLP2Z7WCCQ\windows-jdk10-m3.5.x_build\target\it\purge-local-repository-multi-module\build.log, f:\jenkins\jenkins-slave\workspace\-dependency-plugin_MDEP-625-3I6V7G3727HFCGSCWRQH5RTCWRSMXZQ3ZEOVZRI3U3XLP2Z7WCCQ\windows-jdk10-m3.5.x_build\target\it\purge-local-repository-non-transitive\build.log, f:\jenkins\jenkins-slave\workspace\-dependency-plugin_MDEP-625-3I6V7G3727HFCGSCWRQH5RTCWRSMXZQ3ZEOVZRI3U3XLP2Z7WCCQ\windows-jdk10-m3.5.x_build\target\it\purge-local-repository-reresolve\build.log, f:\jenkins\jenkins-slave\workspace\-dependency-plugin_MDEP-625-3I6V7G3727HFCGSCWRQH5RTCWRSMXZQ3ZEOVZRI3U3XLP2Z7WCCQ\windows-jdk10-m3.5.x_build\target\it\purge-local-repository-snapshots-only\build.log, f:\jenkins\jenkins-slave\workspace\-dependency-plugin_MDEP-625-3I6V7G3727HFCGSCWRQH5RTCWRSMXZQ3ZEOVZRI3U3XLP2Z7WCCQ\windows-jdk10-m3.5.x_build\target\it\purge-local-repository-version-range\build.log, f:\jenkins\jenkins-slave\workspace\-dependency-plugin_MDEP-625-3I6V7G3727HFCGSCWRQH5RTCWRSMXZQ3ZEOVZRI3U3XLP2Z7WCCQ\windows-jdk10-m3.5.x_build\target\it\purge-local-repository-without-pom\build.log, f:\jenkins\jenkins-slave\workspace\-dependency-plugin_MDEP-625-3I6V7G3727HFCGSCWRQH5RTCWRSMXZQ3ZEOVZRI3U3XLP2Z7WCCQ\windows-jdk10-m3.5.x_build\target\it\purge-local-repository\build.log, f:\jenkins\jenkins-slave\workspace\-dependency-plugin_MDEP-625-3I6V7G3727HFCGSCWRQH5RTCWRSMXZQ3ZEOVZRI3U3XLP2Z7WCCQ\windows-jdk10-m3.5.x_build\target\it\resolve-plugins-exclude-reactor\build.log, f:\jenkins\jenkins-slave\workspace\-dependency-plugin_MDEP-625-3I6V7G3727HFCGSCWRQH5RTCWRSMXZQ3ZEOVZRI3U3XLP2Z7WCCQ\windows-jdk10-m3.5.x_build\target\it\resolve-plugins-with-exclude\build.log, f:\jenkins\jenkins-slave\workspace\-dependency-plugin_MDEP-625-3I6V7G3727HFCGSCWRQH5RTCWRSMXZQ3ZEOVZRI3U3XLP2Z7WCCQ\windows-jdk10-m3.5.x_build\target\it\resolve-plugins\build.log, f:\jenkins\jenkins-slave\workspace\-dependency-plugin_MDEP-625-3I6V7G3727HFCGSCWRQH5RTCWRSMXZQ3ZEOVZRI3U3XLP2Z7WCCQ\windows-jdk10-m3.5.x_build\target\it\resolve\build.log, f:\jenkins\jenkins-slave\workspace\-dependency-plugin_MDEP-625-3I6V7G3727HFCGSCWRQH5RTCWRSMXZQ3ZEOVZRI3U3XLP2Z7WCCQ\windows-jdk10-m3.5.x_build\target\it\setup-custom-ear-lifecycle\build.log, f:\jenkins\jenkins-slave\workspace\-dependency-plugin_MDEP-625-3I6V7G3727HFCGSCWRQH5RTCWRSMXZQ3ZEOVZRI3U3XLP2Z7WCCQ\windows-jdk10-m3.5.x_build\target\it\sources\build.log, f:\jenkins\jenkins-slave\workspace\-dependency-plugin_MDEP-625-3I6V7G3727HFCGSCWRQH5RTCWRSMXZQ3ZEOVZRI3U3XLP2Z7WCCQ\windows-jdk10-m3.5.x_build\target\it\tree-includes\build.log, f:\jenkins\jenkins-slave\workspace\-dependency-plugin_MDEP-625-3I6V7G3727HFCGSCWRQH5RTCWRSMXZQ3ZEOVZRI3U3XLP2Z7WCCQ\windows-jdk10-m3.5.x_build\target\it\tree-multimodule\build.log, f:\jenkins\jenkins-slave\workspace\-dependency-plugin_MDEP-625-3I6V7G3727HFCGSCWRQH5RTCWRSMXZQ3ZEOVZRI3U3XLP2Z7WCCQ\windows-jdk10-m3.5.x_build\target\it\unpack-cli\build.log, f:\jenkins\jenkins-slave\workspace\-dependency-plugin_MDEP-625-3I6V7G3727HFCGSCWRQH5RTCWRSMXZQ3ZEOVZRI3U3XLP2Z7WCCQ\windows-jdk10-m3.5.x_build\target\it\unpack-custom-ear\build.log, f:\jenkins\jenkins-slave\workspace\-dependency-plugin_MDEP-625-3I6V7G3727HFCGSCWRQH5RTCWRSMXZQ3ZEOVZRI3U3XLP2Z7WCCQ\windows-jdk10-m3.5.x_build\target\it\unpack-dependencies\build.log, f:\jenkins\jenkins-slave\workspace\-dependency-plugin_MDEP-625-3I6V7G3727HFCGSCWRQH5RTCWRSMXZQ3ZEOVZRI3U3XLP2Z7WCCQ\windows-jdk10-m3.5.x_build\target\it\unpack-from-remote-repository\build.log, f:\jenkins\jenkins-slave\workspace\-dependency-plugin_MDEP-625-3I6V7G3727HFCGSCWRQH5RTCWRSMXZQ3ZEOVZRI3U3XLP2Z7WCCQ\windows-jdk10-m3.5.x_build\target\it\unpack\build.log, f:\jenkins\jenkins-slave\workspace\-dependency-plugin_MDEP-625-3I6V7G3727HFCGSCWRQH5RTCWRSMXZQ3ZEOVZRI3U3XLP2Z7WCCQ\windows-jdk10-m3.5.x_build\target\it\used-dependencies\build.log]
[windows-jdk10-m3.5.x_build] Finished parsing Maven Invoker results (found 58)
[windows-jdk10-m3.5.x_build] [withMaven] junitPublisher - Archive test results for Maven artifact org.apache.maven.plugins:maven-dependency-plugin:3.1.2-SNAPSHOT generated by maven-surefire-plugin:test (default-test): windows-jdk10-m3.5.x_build\target\surefire-reports\*.xml
[windows-jdk10-m3.5.x_build] Recording test results
[windows-jdk10-m3.5.x_build] [withMaven] openTasksPublisher - Scan Tasks for Maven artifact org.apache.maven.plugins:maven-dependency-plugin:3.1.2-SNAPSHOT in source directory windows-jdk10-m3.5.x_build\src\main\java
[windows-jdk10-m3.5.x_build] [TASKS] Scanning folder 'f:\jenkins\jenkins-slave\workspace\-dependency-plugin_MDEP-625-3I6V7G3727HFCGSCWRQH5RTCWRSMXZQ3ZEOVZRI3U3XLP2Z7WCCQ' for files matching the pattern 'windows-jdk10-m3.5.x_build\src\main\java\**\*' - excludes: null
[windows-jdk10-m3.5.x_build] [TASKS] Found 48 files to scan for tasks
[windows-jdk10-m3.5.x_build] [TASKS] Found 4 open tasks.
[windows-jdk10-m3.5.x_build] Skipping warnings blame since pipelines do not have an SCM link.%n
[Pipeline] [windows-jdk10-m3.5.x_build] // withMaven
[Pipeline] [windows-jdk10-m3.5.x_build] cleanWs
[windows-jdk10-m3.5.x_build] [WS-CLEANUP] Deleting project workspace...[WS-CLEANUP] done
[Pipeline] [windows-jdk10-m3.5.x_build] cleanWs
[windows-jdk10-m3.5.x_build] [WS-CLEANUP] Deleting project workspace...[WS-CLEANUP] done
[Pipeline] [windows-jdk10-m3.5.x_build] }
[Pipeline] [windows-jdk10-m3.5.x_build] // stage
[Pipeline] [windows-jdk10-m3.5.x_build] }
[Pipeline] [windows-jdk10-m3.5.x_build] // node
[Pipeline] [windows-jdk10-m3.5.x_build] }
[windows-jdk10-m3.5.x_build] Failed in branch windows-jdk10-m3.5.x_build
[Pipeline] // parallel
[Pipeline] stage
[Pipeline] { (Notifications)
[Pipeline] echo
Build result: FAILURE
[Pipeline] jiraIssueSelector
[Pipeline] emailext
Reply | Threaded
Open this post in threaded view
|

Build failed in Jenkins: Maven TLP » maven-dependency-plugin » MDEP-625 #7

Apache Jenkins Server-2
See https://builds.apache.org/job/maven-box/job/maven-dependency-plugin/job/MDEP-625/7/

No changes.

12 tests failed.
FAILED:  org.apache.maven.plugins.dependency.TestGetMojo.testRemoteRepositories

Error Message:
The parameter filter is not allowed to be null.

Stack Trace:
java.lang.IllegalArgumentException: The parameter filter is not allowed to be null.
        at org.apache.maven.plugins.dependency.TestGetMojo.testRemoteRepositories(TestGetMojo.java:96)


FAILED:  org.apache.maven.plugins.dependency.TestGetMojo.testRemoteRepositories

Error Message:
The parameter filter is not allowed to be null.

Stack Trace:
java.lang.IllegalArgumentException: The parameter filter is not allowed to be null.
        at org.apache.maven.plugins.dependency.TestGetMojo.testRemoteRepositories(TestGetMojo.java:96)


FAILED:  org.apache.maven.plugins.dependency.TestGetMojo.testRemoteRepositories

Error Message:
The parameter filter is not allowed to be null.

Stack Trace:
java.lang.IllegalArgumentException: The parameter filter is not allowed to be null.
        at org.apache.maven.plugins.dependency.TestGetMojo.testRemoteRepositories(TestGetMojo.java:96)


FAILED:  org.apache.maven.plugins.dependency.TestGetMojo.testRemoteRepositories

Error Message:
The parameter filter is not allowed to be null.

Stack Trace:
java.lang.IllegalArgumentException: The parameter filter is not allowed to be null.
        at org.apache.maven.plugins.dependency.TestGetMojo.testRemoteRepositories(TestGetMojo.java:96)


FAILED:  org.apache.maven.plugins.dependency.TestGetMojo.testRemoteRepositories

Error Message:
The parameter filter is not allowed to be null.

Stack Trace:
java.lang.IllegalArgumentException: The parameter filter is not allowed to be null.
        at org.apache.maven.plugins.dependency.TestGetMojo.testRemoteRepositories(TestGetMojo.java:96)


FAILED:  org.apache.maven.plugins.dependency.TestGetMojo.testRemoteRepositories

Error Message:
The parameter filter is not allowed to be null.

Stack Trace:
java.lang.IllegalArgumentException: The parameter filter is not allowed to be null.
        at org.apache.maven.plugins.dependency.TestGetMojo.testRemoteRepositories(TestGetMojo.java:96)


FAILED:  org.apache.maven.plugins.dependency.TestGetMojo.testRemoteRepositories

Error Message:
The parameter filter is not allowed to be null.

Stack Trace:
java.lang.IllegalArgumentException: The parameter filter is not allowed to be null.
        at org.apache.maven.plugins.dependency.TestGetMojo.testRemoteRepositories(TestGetMojo.java:96)


FAILED:  org.apache.maven.plugins.dependency.TestGetMojo.testRemoteRepositories

Error Message:
The parameter filter is not allowed to be null.

Stack Trace:
java.lang.IllegalArgumentException: The parameter filter is not allowed to be null.
        at org.apache.maven.plugins.dependency.TestGetMojo.testRemoteRepositories(TestGetMojo.java:96)


FAILED:  org.apache.maven.plugins.dependency.TestGetMojo.testRemoteRepositories

Error Message:
The parameter filter is not allowed to be null.

Stack Trace:
java.lang.IllegalArgumentException: The parameter filter is not allowed to be null.
        at org.apache.maven.plugins.dependency.TestGetMojo.testRemoteRepositories(TestGetMojo.java:96)


FAILED:  org.apache.maven.plugins.dependency.TestGetMojo.testRemoteRepositories

Error Message:
The parameter filter is not allowed to be null.

Stack Trace:
java.lang.IllegalArgumentException: The parameter filter is not allowed to be null.
        at org.apache.maven.plugins.dependency.TestGetMojo.testRemoteRepositories(TestGetMojo.java:96)


FAILED:  org.apache.maven.plugins.dependency.TestGetMojo.testRemoteRepositories

Error Message:
The parameter filter is not allowed to be null.

Stack Trace:
java.lang.IllegalArgumentException: The parameter filter is not allowed to be null.
        at org.apache.maven.plugins.dependency.TestGetMojo.testRemoteRepositories(TestGetMojo.java:96)


FAILED:  org.apache.maven.plugins.dependency.TestGetMojo.testRemoteRepositories

Error Message:
The parameter filter is not allowed to be null.

Stack Trace:
java.lang.IllegalArgumentException: The parameter filter is not allowed to be null.
        at org.apache.maven.plugins.dependency.TestGetMojo.testRemoteRepositories(TestGetMojo.java:96)




Build log:
[...truncated 5.98 MB...]
[windows-jdk10-m3.5.x_build] [INFO] Downloaded from central: https://repo.maven.apache.org/maven2/antlr/antlr/2.7.7/antlr-2.7.7.jar (445 kB at 8.1 MB/s)
[windows-jdk10-m3.5.x_build] [INFO] Downloading from central: https://repo.maven.apache.org/maven2/com/google/guava/guava/19.0/guava-19.0.jar
[windows-jdk10-m3.5.x_build] [INFO] Downloaded from central: https://repo.maven.apache.org/maven2/org/antlr/antlr4-runtime/4.5.3/antlr4-runtime-4.5.3.jar (302 kB at 4.6 MB/s)
[windows-jdk10-m3.5.x_build] [INFO] Downloading from central: https://repo.maven.apache.org/maven2/javax/xml/bind/jaxb-api/2.3.0/jaxb-api-2.3.0.jar
[windows-jdk10-m3.5.x_build] [INFO] Downloaded from central: https://repo.maven.apache.org/maven2/commons-cli/commons-cli/1.3.1/commons-cli-1.3.1.jar (53 kB at 779 kB/s)
[windows-jdk10-m3.5.x_build] [INFO] Downloaded from central: https://repo.maven.apache.org/maven2/commons-beanutils/commons-beanutils/1.9.2/commons-beanutils-1.9.2.jar (234 kB at 3.3 MB/s)
[windows-jdk10-m3.5.x_build] [INFO] Downloaded from central: https://repo.maven.apache.org/maven2/com/puppycrawl/tools/checkstyle/6.18/checkstyle-6.18.jar (1.2 MB at 17 MB/s)
[windows-jdk10-m3.5.x_build] [INFO] Downloaded from central: https://repo.maven.apache.org/maven2/javax/xml/bind/jaxb-api/2.3.0/jaxb-api-2.3.0.jar (126 kB at 1.5 MB/s)
[windows-jdk10-m3.5.x_build] [INFO] Downloaded from central: https://repo.maven.apache.org/maven2/com/google/guava/guava/19.0/guava-19.0.jar (2.3 MB at 20 MB/s)
[windows-jdk10-m3.5.x_build] [INFO] There is 1 error reported by Checkstyle 6.18 with config/maven_checks.xml ruleset.
[windows-jdk10-m3.5.x_build] [INFO] Ignored 1 error, 0 violation remaining.
[windows-jdk10-m3.5.x_build] [INFO]
[windows-jdk10-m3.5.x_build] [INFO] --- maven-invoker-plugin:3.1.0:verify (integration-test) @ maven-dependency-plugin ---
[windows-jdk10-m3.5.x_build] [INFO] -------------------------------------------------
[windows-jdk10-m3.5.x_build] [INFO] Build Summary:
[windows-jdk10-m3.5.x_build] [INFO]   Passed: 50, Failed: 7, Errors: 0, Skipped: 1
[windows-jdk10-m3.5.x_build] [INFO] -------------------------------------------------
[windows-jdk10-m3.5.x_build] [ERROR] The following builds failed:
[windows-jdk10-m3.5.x_build] [ERROR] *  get-artifact-maven-plugin\pom.xml
[windows-jdk10-m3.5.x_build] [ERROR] *  get-artifact\pom.xml
[windows-jdk10-m3.5.x_build] [ERROR] *  get-gav\pom.xml
[windows-jdk10-m3.5.x_build] [ERROR] *  go-offline\pom.xml
[windows-jdk10-m3.5.x_build] [ERROR] *  resolve-plugins-exclude-reactor\pom.xml
[windows-jdk10-m3.5.x_build] [ERROR] *  resolve-plugins-with-exclude\pom.xml
[windows-jdk10-m3.5.x_build] [ERROR] *  resolve-plugins\pom.xml
[windows-jdk10-m3.5.x_build] [INFO] -------------------------------------------------
[windows-jdk10-m3.5.x_build] [INFO] ------------------------------------------------------------------------
[windows-jdk10-m3.5.x_build] [INFO] BUILD FAILURE
[windows-jdk10-m3.5.x_build] [INFO] ------------------------------------------------------------------------
[windows-jdk10-m3.5.x_build] [INFO] Total time: 20:45 min
[windows-jdk10-m3.5.x_build] [INFO] Finished at: 2018-09-14T15:18:24Z
[windows-jdk10-m3.5.x_build] [INFO] Final Memory: 52M/180M
[windows-jdk10-m3.5.x_build] [INFO] ------------------------------------------------------------------------
[windows-jdk10-m3.5.x_build] [INFO] [jenkins-event-spy] Generated F:\jenkins\jenkins-slave\workspace\-dependency-plugin_MDEP-625-3I6V7G3727HFCGSCWRQH5RTCWRSMXZQ3ZEOVZRI3U3XLP2Z7WCCQ@tmp\withMaven83c1a9bb\maven-spy-20180914-145738-71610623146228026365939.log
[windows-jdk10-m3.5.x_build] [ERROR] Failed to execute goal org.apache.maven.plugins:maven-invoker-plugin:3.1.0:verify (integration-test) on project maven-dependency-plugin: 7 builds failed. See console output above for details. -> [Help 1]
[windows-jdk10-m3.5.x_build] [ERROR]
[windows-jdk10-m3.5.x_build] [ERROR] To see the full stack trace of the errors, re-run Maven with the -e switch.
[windows-jdk10-m3.5.x_build] [ERROR] Re-run Maven using the -X switch to enable full debug logging.
[windows-jdk10-m3.5.x_build] [ERROR]
[windows-jdk10-m3.5.x_build] [ERROR] For more information about the errors and possible solutions, please read the following articles:
[windows-jdk10-m3.5.x_build] [ERROR] [Help 1] http://cwiki.apache.org/confluence/display/MAVEN/MojoFailureException
[Pipeline] [windows-jdk10-m3.5.x_build] }
[Pipeline] [windows-jdk10-m3.5.x_build] // dir
[Pipeline] [windows-jdk10-m3.5.x_build] }
[windows-jdk10-m3.5.x_build] [Fast Archiver] No prior successful build to compare, so performing full copy of artifacts
[windows-jdk10-m3.5.x_build] [withMaven] invokerPublisher - Archive invoker results for Maven artifact MavenArtifact{org.apache.maven.plugins:maven-dependency-plugin::3.1.2-SNAPSHOT(version: 3.1.2-SNAPSHOT, snapshot:false) } generated by PluginInvocation{org.apache.maven.plugins:maven-invoker-plugin:3.1.0@integration-test  integration-test}: windows-jdk10-m3.5.x_build\target\invoker-reports\*.xml
[windows-jdk10-m3.5.x_build] performing MavenInvokerRecorder, reportsFilenamePattern:'**/windows-jdk10-m3.5.x_build\target\invoker-reports/BUILD*.xml', invokerBuildDir:'**/windows-jdk10-m3.5.x_build\target\it'
[windows-jdk10-m3.5.x_build] Found reports:[f:\jenkins\jenkins-slave\workspace\-dependency-plugin_MDEP-625-3I6V7G3727HFCGSCWRQH5RTCWRSMXZQ3ZEOVZRI3U3XLP2Z7WCCQ\windows-jdk10-m3.5.x_build\target\invoker-reports\BUILD-analyze-dep-mgt.xml, f:\jenkins\jenkins-slave\workspace\-dependency-plugin_MDEP-625-3I6V7G3727HFCGSCWRQH5RTCWRSMXZQ3ZEOVZRI3U3XLP2Z7WCCQ\windows-jdk10-m3.5.x_build\target\invoker-reports\BUILD-analyze-ignore-dependency.xml, f:\jenkins\jenkins-slave\workspace\-dependency-plugin_MDEP-625-3I6V7G3727HFCGSCWRQH5RTCWRSMXZQ3ZEOVZRI3U3XLP2Z7WCCQ\windows-jdk10-m3.5.x_build\target\invoker-reports\BUILD-analyze-ignore-unused-declared-dependency.xml, f:\jenkins\jenkins-slave\workspace\-dependency-plugin_MDEP-625-3I6V7G3727HFCGSCWRQH5RTCWRSMXZQ3ZEOVZRI3U3XLP2Z7WCCQ\windows-jdk10-m3.5.x_build\target\invoker-reports\BUILD-analyze-ignore-used-undeclared-dependency.xml, f:\jenkins\jenkins-slave\workspace\-dependency-plugin_MDEP-625-3I6V7G3727HFCGSCWRQH5RTCWRSMXZQ3ZEOVZRI3U3XLP2Z7WCCQ\windows-jdk10-m3.5.x_build\target\invoker-reports\BUILD-analyze-multimodule-project.xml, f:\jenkins\jenkins-slave\workspace\-dependency-plugin_MDEP-625-3I6V7G3727HFCGSCWRQH5RTCWRSMXZQ3ZEOVZRI3U3XLP2Z7WCCQ\windows-jdk10-m3.5.x_build\target\invoker-reports\BUILD-analyze-report.xml, f:\jenkins\jenkins-slave\workspace\-dependency-plugin_MDEP-625-3I6V7G3727HFCGSCWRQH5RTCWRSMXZQ3ZEOVZRI3U3XLP2Z7WCCQ\windows-jdk10-m3.5.x_build\target\invoker-reports\BUILD-analyze.xml, f:\jenkins\jenkins-slave\workspace\-dependency-plugin_MDEP-625-3I6V7G3727HFCGSCWRQH5RTCWRSMXZQ3ZEOVZRI3U3XLP2Z7WCCQ\windows-jdk10-m3.5.x_build\target\invoker-reports\BUILD-build-classpath-output-file-and-property.xml, f:\jenkins\jenkins-slave\workspace\-dependency-plugin_MDEP-625-3I6V7G3727HFCGSCWRQH5RTCWRSMXZQ3ZEOVZRI3U3XLP2Z7WCCQ\windows-jdk10-m3.5.x_build\target\invoker-reports\BUILD-build-classpath.xml, f:\jenkins\jenkins-slave\workspace\-dependency-plugin_MDEP-625-3I6V7G3727HFCGSCWRQH5RTCWRSMXZQ3ZEOVZRI3U3XLP2Z7WCCQ\windows-jdk10-m3.5.x_build\target\invoker-reports\BUILD-collect.xml, f:\jenkins\jenkins-slave\workspace\-dependency-plugin_MDEP-625-3I6V7G3727HFCGSCWRQH5RTCWRSMXZQ3ZEOVZRI3U3XLP2Z7WCCQ\windows-jdk10-m3.5.x_build\target\invoker-reports\BUILD-copy-and-unpack-with-alternate-local-repo.xml, f:\jenkins\jenkins-slave\workspace\-dependency-plugin_MDEP-625-3I6V7G3727HFCGSCWRQH5RTCWRSMXZQ3ZEOVZRI3U3XLP2Z7WCCQ\windows-jdk10-m3.5.x_build\target\invoker-reports\BUILD-copy-cli.xml, f:\jenkins\jenkins-slave\workspace\-dependency-plugin_MDEP-625-3I6V7G3727HFCGSCWRQH5RTCWRSMXZQ3ZEOVZRI3U3XLP2Z7WCCQ\windows-jdk10-m3.5.x_build\target\invoker-reports\BUILD-copy-dependencies.xml, f:\jenkins\jenkins-slave\workspace\-dependency-plugin_MDEP-625-3I6V7G3727HFCGSCWRQH5RTCWRSMXZQ3ZEOVZRI3U3XLP2Z7WCCQ\windows-jdk10-m3.5.x_build\target\invoker-reports\BUILD-copy-from-reactor.xml, f:\jenkins\jenkins-slave\workspace\-dependency-plugin_MDEP-625-3I6V7G3727HFCGSCWRQH5RTCWRSMXZQ3ZEOVZRI3U3XLP2Z7WCCQ\windows-jdk10-m3.5.x_build\target\invoker-reports\BUILD-copy-from-remote-repository.xml, f:\jenkins\jenkins-slave\workspace\-dependency-plugin_MDEP-625-3I6V7G3727HFCGSCWRQH5RTCWRSMXZQ3ZEOVZRI3U3XLP2Z7WCCQ\windows-jdk10-m3.5.x_build\target\invoker-reports\BUILD-copy.xml, f:\jenkins\jenkins-slave\workspace\-dependency-plugin_MDEP-625-3I6V7G3727HFCGSCWRQH5RTCWRSMXZQ3ZEOVZRI3U3XLP2Z7WCCQ\windows-jdk10-m3.5.x_build\target\invoker-reports\BUILD-dependency-properties.xml, f:\jenkins\jenkins-slave\workspace\-dependency-plugin_MDEP-625-3I6V7G3727HFCGSCWRQH5RTCWRSMXZQ3ZEOVZRI3U3XLP2Z7WCCQ\windows-jdk10-m3.5.x_build\target\invoker-reports\BUILD-filterunpack.xml, f:\jenkins\jenkins-slave\workspace\-dependency-plugin_MDEP-625-3I6V7G3727HFCGSCWRQH5RTCWRSMXZQ3ZEOVZRI3U3XLP2Z7WCCQ\windows-jdk10-m3.5.x_build\target\invoker-reports\BUILD-get-artifact-maven-plugin.xml, f:\jenkins\jenkins-slave\workspace\-dependency-plugin_MDEP-625-3I6V7G3727HFCGSCWRQH5RTCWRSMXZQ3ZEOVZRI3U3XLP2Z7WCCQ\windows-jdk10-m3.5.x_build\target\invoker-reports\BUILD-get-artifact-no-transitive.xml, f:\jenkins\jenkins-slave\workspace\-dependency-plugin_MDEP-625-3I6V7G3727HFCGSCWRQH5RTCWRSMXZQ3ZEOVZRI3U3XLP2Z7WCCQ\windows-jdk10-m3.5.x_build\target\invoker-reports\BUILD-get-artifact.xml, f:\jenkins\jenkins-slave\workspace\-dependency-plugin_MDEP-625-3I6V7G3727HFCGSCWRQH5RTCWRSMXZQ3ZEOVZRI3U3XLP2Z7WCCQ\windows-jdk10-m3.5.x_build\target\invoker-reports\BUILD-get-gav.xml, f:\jenkins\jenkins-slave\workspace\-dependency-plugin_MDEP-625-3I6V7G3727HFCGSCWRQH5RTCWRSMXZQ3ZEOVZRI3U3XLP2Z7WCCQ\windows-jdk10-m3.5.x_build\target\invoker-reports\BUILD-go-offline.xml, f:\jenkins\jenkins-slave\workspace\-dependency-plugin_MDEP-625-3I6V7G3727HFCGSCWRQH5RTCWRSMXZQ3ZEOVZRI3U3XLP2Z7WCCQ\windows-jdk10-m3.5.x_build\target\invoker-reports\BUILD-list-repositories.xml, f:\jenkins\jenkins-slave\workspace\-dependency-plugin_MDEP-625-3I6V7G3727HFCGSCWRQH5RTCWRSMXZQ3ZEOVZRI3U3XLP2Z7WCCQ\windows-jdk10-m3.5.x_build\target\invoker-reports\BUILD-mdep-439-analyze-java8.xml, f:\jenkins\jenkins-slave\workspace\-dependency-plugin_MDEP-625-3I6V7G3727HFCGSCWRQH5RTCWRSMXZQ3ZEOVZRI3U3XLP2Z7WCCQ\windows-jdk10-m3.5.x_build\target\invoker-reports\BUILD-mdep-450-project-with-ancestor.xml, f:\jenkins\jenkins-slave\workspace\-dependency-plugin_MDEP-625-3I6V7G3727HFCGSCWRQH5RTCWRSMXZQ3ZEOVZRI3U3XLP2Z7WCCQ\windows-jdk10-m3.5.x_build\target\invoker-reports\BUILD-mdep-450-project-without-ancestor.xml, f:\jenkins\jenkins-slave\workspace\-dependency-plugin_MDEP-625-3I6V7G3727HFCGSCWRQH5RTCWRSMXZQ3ZEOVZRI3U3XLP2Z7WCCQ\windows-jdk10-m3.5.x_build\target\invoker-reports\BUILD-mdep-506-dependency-without-version-in-depmgt.xml, f:\jenkins\jenkins-slave\workspace\-dependency-plugin_MDEP-625-3I6V7G3727HFCGSCWRQH5RTCWRSMXZQ3ZEOVZRI3U3XLP2Z7WCCQ\windows-jdk10-m3.5.x_build\target\invoker-reports\BUILD-mdep-571-resolve-java9.xml, f:\jenkins\jenkins-slave\workspace\-dependency-plugin_MDEP-625-3I6V7G3727HFCGSCWRQH5RTCWRSMXZQ3ZEOVZRI3U3XLP2Z7WCCQ\windows-jdk10-m3.5.x_build\target\invoker-reports\BUILD-mdep-572-unpack-tar-long-file.xml, f:\jenkins\jenkins-slave\workspace\-dependency-plugin_MDEP-625-3I6V7G3727HFCGSCWRQH5RTCWRSMXZQ3ZEOVZRI3U3XLP2Z7WCCQ\windows-jdk10-m3.5.x_build\target\invoker-reports\BUILD-mdep-578_display-reason-invalid-module.xml, f:\jenkins\jenkins-slave\workspace\-dependency-plugin_MDEP-625-3I6V7G3727HFCGSCWRQH5RTCWRSMXZQ3ZEOVZRI3U3XLP2Z7WCCQ\windows-jdk10-m3.5.x_build\target\invoker-reports\BUILD-mdep-580_display-manifest-automodules.xml, f:\jenkins\jenkins-slave\workspace\-dependency-plugin_MDEP-625-3I6V7G3727HFCGSCWRQH5RTCWRSMXZQ3ZEOVZRI3U3XLP2Z7WCCQ\windows-jdk10-m3.5.x_build\target\invoker-reports\BUILD-mdep-599-analyze-java9.xml, f:\jenkins\jenkins-slave\workspace\-dependency-plugin_MDEP-625-3I6V7G3727HFCGSCWRQH5RTCWRSMXZQ3ZEOVZRI3U3XLP2Z7WCCQ\windows-jdk10-m3.5.x_build\target\invoker-reports\BUILD-purge-local-repository-bad-dep.xml, f:\jenkins\jenkins-slave\workspace\-dependency-plugin_MDEP-625-3I6V7G3727HFCGSCWRQH5RTCWRSMXZQ3ZEOVZRI3U3XLP2Z7WCCQ\windows-jdk10-m3.5.x_build\target\invoker-reports\BUILD-purge-local-repository-include.xml, f:\jenkins\jenkins-slave\workspace\-dependency-plugin_MDEP-625-3I6V7G3727HFCGSCWRQH5RTCWRSMXZQ3ZEOVZRI3U3XLP2Z7WCCQ\windows-jdk10-m3.5.x_build\target\invoker-reports\BUILD-purge-local-repository-multi-module-execution.xml, f:\jenkins\jenkins-slave\workspace\-dependency-plugin_MDEP-625-3I6V7G3727HFCGSCWRQH5RTCWRSMXZQ3ZEOVZRI3U3XLP2Z7WCCQ\windows-jdk10-m3.5.x_build\target\invoker-reports\BUILD-purge-local-repository-multi-module.xml, f:\jenkins\jenkins-slave\workspace\-dependency-plugin_MDEP-625-3I6V7G3727HFCGSCWRQH5RTCWRSMXZQ3ZEOVZRI3U3XLP2Z7WCCQ\windows-jdk10-m3.5.x_build\target\invoker-reports\BUILD-purge-local-repository-non-transitive.xml, f:\jenkins\jenkins-slave\workspace\-dependency-plugin_MDEP-625-3I6V7G3727HFCGSCWRQH5RTCWRSMXZQ3ZEOVZRI3U3XLP2Z7WCCQ\windows-jdk10-m3.5.x_build\target\invoker-reports\BUILD-purge-local-repository-reresolve.xml, f:\jenkins\jenkins-slave\workspace\-dependency-plugin_MDEP-625-3I6V7G3727HFCGSCWRQH5RTCWRSMXZQ3ZEOVZRI3U3XLP2Z7WCCQ\windows-jdk10-m3.5.x_build\target\invoker-reports\BUILD-purge-local-repository-snapshots-only.xml, f:\jenkins\jenkins-slave\workspace\-dependency-plugin_MDEP-625-3I6V7G3727HFCGSCWRQH5RTCWRSMXZQ3ZEOVZRI3U3XLP2Z7WCCQ\windows-jdk10-m3.5.x_build\target\invoker-reports\BUILD-purge-local-repository-version-range.xml, f:\jenkins\jenkins-slave\workspace\-dependency-plugin_MDEP-625-3I6V7G3727HFCGSCWRQH5RTCWRSMXZQ3ZEOVZRI3U3XLP2Z7WCCQ\windows-jdk10-m3.5.x_build\target\invoker-reports\BUILD-purge-local-repository-without-pom.xml, f:\jenkins\jenkins-slave\workspace\-dependency-plugin_MDEP-625-3I6V7G3727HFCGSCWRQH5RTCWRSMXZQ3ZEOVZRI3U3XLP2Z7WCCQ\windows-jdk10-m3.5.x_build\target\invoker-reports\BUILD-purge-local-repository.xml, f:\jenkins\jenkins-slave\workspace\-dependency-plugin_MDEP-625-3I6V7G3727HFCGSCWRQH5RTCWRSMXZQ3ZEOVZRI3U3XLP2Z7WCCQ\windows-jdk10-m3.5.x_build\target\invoker-reports\BUILD-resolve-plugins-exclude-reactor.xml, f:\jenkins\jenkins-slave\workspace\-dependency-plugin_MDEP-625-3I6V7G3727HFCGSCWRQH5RTCWRSMXZQ3ZEOVZRI3U3XLP2Z7WCCQ\windows-jdk10-m3.5.x_build\target\invoker-reports\BUILD-resolve-plugins-with-exclude.xml, f:\jenkins\jenkins-slave\workspace\-dependency-plugin_MDEP-625-3I6V7G3727HFCGSCWRQH5RTCWRSMXZQ3ZEOVZRI3U3XLP2Z7WCCQ\windows-jdk10-m3.5.x_build\target\invoker-reports\BUILD-resolve-plugins.xml, f:\jenkins\jenkins-slave\workspace\-dependency-plugin_MDEP-625-3I6V7G3727HFCGSCWRQH5RTCWRSMXZQ3ZEOVZRI3U3XLP2Z7WCCQ\windows-jdk10-m3.5.x_build\target\invoker-reports\BUILD-resolve.xml, f:\jenkins\jenkins-slave\workspace\-dependency-plugin_MDEP-625-3I6V7G3727HFCGSCWRQH5RTCWRSMXZQ3ZEOVZRI3U3XLP2Z7WCCQ\windows-jdk10-m3.5.x_build\target\invoker-reports\BUILD-setup-custom-ear-lifecycle.xml, f:\jenkins\jenkins-slave\workspace\-dependency-plugin_MDEP-625-3I6V7G3727HFCGSCWRQH5RTCWRSMXZQ3ZEOVZRI3U3XLP2Z7WCCQ\windows-jdk10-m3.5.x_build\target\invoker-reports\BUILD-sources.xml, f:\jenkins\jenkins-slave\workspace\-dependency-plugin_MDEP-625-3I6V7G3727HFCGSCWRQH5RTCWRSMXZQ3ZEOVZRI3U3XLP2Z7WCCQ\windows-jdk10-m3.5.x_build\target\invoker-reports\BUILD-tree-includes.xml, f:\jenkins\jenkins-slave\workspace\-dependency-plugin_MDEP-625-3I6V7G3727HFCGSCWRQH5RTCWRSMXZQ3ZEOVZRI3U3XLP2Z7WCCQ\windows-jdk10-m3.5.x_build\target\invoker-reports\BUILD-tree-multimodule.xml, f:\jenkins\jenkins-slave\workspace\-dependency-plugin_MDEP-625-3I6V7G3727HFCGSCWRQH5RTCWRSMXZQ3ZEOVZRI3U3XLP2Z7WCCQ\windows-jdk10-m3.5.x_build\target\invoker-reports\BUILD-tree.xml, f:\jenkins\jenkins-slave\workspace\-dependency-plugin_MDEP-625-3I6V7G3727HFCGSCWRQH5RTCWRSMXZQ3ZEOVZRI3U3XLP2Z7WCCQ\windows-jdk10-m3.5.x_build\target\invoker-reports\BUILD-unpack-cli.xml, f:\jenkins\jenkins-slave\workspace\-dependency-plugin_MDEP-625-3I6V7G3727HFCGSCWRQH5RTCWRSMXZQ3ZEOVZRI3U3XLP2Z7WCCQ\windows-jdk10-m3.5.x_build\target\invoker-reports\BUILD-unpack-custom-ear.xml, f:\jenkins\jenkins-slave\workspace\-dependency-plugin_MDEP-625-3I6V7G3727HFCGSCWRQH5RTCWRSMXZQ3ZEOVZRI3U3XLP2Z7WCCQ\windows-jdk10-m3.5.x_build\target\invoker-reports\BUILD-unpack-dependencies.xml, f:\jenkins\jenkins-slave\workspace\-dependency-plugin_MDEP-625-3I6V7G3727HFCGSCWRQH5RTCWRSMXZQ3ZEOVZRI3U3XLP2Z7WCCQ\windows-jdk10-m3.5.x_build\target\invoker-reports\BUILD-unpack-from-remote-repository.xml, f:\jenkins\jenkins-slave\workspace\-dependency-plugin_MDEP-625-3I6V7G3727HFCGSCWRQH5RTCWRSMXZQ3ZEOVZRI3U3XLP2Z7WCCQ\windows-jdk10-m3.5.x_build\target\invoker-reports\BUILD-unpack.xml, f:\jenkins\jenkins-slave\workspace\-dependency-plugin_MDEP-625-3I6V7G3727HFCGSCWRQH5RTCWRSMXZQ3ZEOVZRI3U3XLP2Z7WCCQ\windows-jdk10-m3.5.x_build\target\invoker-reports\BUILD-used-dependencies.xml]
[windows-jdk10-m3.5.x_build] Found logs:[f:\jenkins\jenkins-slave\workspace\-dependency-plugin_MDEP-625-3I6V7G3727HFCGSCWRQH5RTCWRSMXZQ3ZEOVZRI3U3XLP2Z7WCCQ\windows-jdk10-m3.5.x_build\target\it\analyze-dep-mgt\build.log, f:\jenkins\jenkins-slave\workspace\-dependency-plugin_MDEP-625-3I6V7G3727HFCGSCWRQH5RTCWRSMXZQ3ZEOVZRI3U3XLP2Z7WCCQ\windows-jdk10-m3.5.x_build\target\it\analyze-ignore-dependency\build.log, f:\jenkins\jenkins-slave\workspace\-dependency-plugin_MDEP-625-3I6V7G3727HFCGSCWRQH5RTCWRSMXZQ3ZEOVZRI3U3XLP2Z7WCCQ\windows-jdk10-m3.5.x_build\target\it\analyze-ignore-unused-declared-dependency\build.log, f:\jenkins\jenkins-slave\workspace\-dependency-plugin_MDEP-625-3I6V7G3727HFCGSCWRQH5RTCWRSMXZQ3ZEOVZRI3U3XLP2Z7WCCQ\windows-jdk10-m3.5.x_build\target\it\analyze-ignore-used-undeclared-dependency\build.log, f:\jenkins\jenkins-slave\workspace\-dependency-plugin_MDEP-625-3I6V7G3727HFCGSCWRQH5RTCWRSMXZQ3ZEOVZRI3U3XLP2Z7WCCQ\windows-jdk10-m3.5.x_build\target\it\analyze-multimodule-project\build.log, f:\jenkins\jenkins-slave\workspace\-dependency-plugin_MDEP-625-3I6V7G3727HFCGSCWRQH5RTCWRSMXZQ3ZEOVZRI3U3XLP2Z7WCCQ\windows-jdk10-m3.5.x_build\target\it\analyze-report\build.log, f:\jenkins\jenkins-slave\workspace\-dependency-plugin_MDEP-625-3I6V7G3727HFCGSCWRQH5RTCWRSMXZQ3ZEOVZRI3U3XLP2Z7WCCQ\windows-jdk10-m3.5.x_build\target\it\analyze\build.log, f:\jenkins\jenkins-slave\workspace\-dependency-plugin_MDEP-625-3I6V7G3727HFCGSCWRQH5RTCWRSMXZQ3ZEOVZRI3U3XLP2Z7WCCQ\windows-jdk10-m3.5.x_build\target\it\build-classpath-output-file-and-property\build.log, f:\jenkins\jenkins-slave\workspace\-dependency-plugin_MDEP-625-3I6V7G3727HFCGSCWRQH5RTCWRSMXZQ3ZEOVZRI3U3XLP2Z7WCCQ\windows-jdk10-m3.5.x_build\target\it\build-classpath\build.log, f:\jenkins\jenkins-slave\workspace\-dependency-plugin_MDEP-625-3I6V7G3727HFCGSCWRQH5RTCWRSMXZQ3ZEOVZRI3U3XLP2Z7WCCQ\windows-jdk10-m3.5.x_build\target\it\collect\build.log, f:\jenkins\jenkins-slave\workspace\-dependency-plugin_MDEP-625-3I6V7G3727HFCGSCWRQH5RTCWRSMXZQ3ZEOVZRI3U3XLP2Z7WCCQ\windows-jdk10-m3.5.x_build\target\it\copy-and-unpack-with-alternate-local-repo\build.log, f:\jenkins\jenkins-slave\workspace\-dependency-plugin_MDEP-625-3I6V7G3727HFCGSCWRQH5RTCWRSMXZQ3ZEOVZRI3U3XLP2Z7WCCQ\windows-jdk10-m3.5.x_build\target\it\copy-cli\build.log, f:\jenkins\jenkins-slave\workspace\-dependency-plugin_MDEP-625-3I6V7G3727HFCGSCWRQH5RTCWRSMXZQ3ZEOVZRI3U3XLP2Z7WCCQ\windows-jdk10-m3.5.x_build\target\it\copy-dependencies\build.log, f:\jenkins\jenkins-slave\workspace\-dependency-plugin_MDEP-625-3I6V7G3727HFCGSCWRQH5RTCWRSMXZQ3ZEOVZRI3U3XLP2Z7WCCQ\windows-jdk10-m3.5.x_build\target\it\copy-from-reactor\build.log, f:\jenkins\jenkins-slave\workspace\-dependency-plugin_MDEP-625-3I6V7G3727HFCGSCWRQH5RTCWRSMXZQ3ZEOVZRI3U3XLP2Z7WCCQ\windows-jdk10-m3.5.x_build\target\it\copy-from-remote-repository\build.log, f:\jenkins\jenkins-slave\workspace\-dependency-plugin_MDEP-625-3I6V7G3727HFCGSCWRQH5RTCWRSMXZQ3ZEOVZRI3U3XLP2Z7WCCQ\windows-jdk10-m3.5.x_build\target\it\copy\build.log, f:\jenkins\jenkins-slave\workspace\-dependency-plugin_MDEP-625-3I6V7G3727HFCGSCWRQH5RTCWRSMXZQ3ZEOVZRI3U3XLP2Z7WCCQ\windows-jdk10-m3.5.x_build\target\it\dependency-properties\build.log, f:\jenkins\jenkins-slave\workspace\-dependency-plugin_MDEP-625-3I6V7G3727HFCGSCWRQH5RTCWRSMXZQ3ZEOVZRI3U3XLP2Z7WCCQ\windows-jdk10-m3.5.x_build\target\it\filterunpack\build.log, f:\jenkins\jenkins-slave\workspace\-dependency-plugin_MDEP-625-3I6V7G3727HFCGSCWRQH5RTCWRSMXZQ3ZEOVZRI3U3XLP2Z7WCCQ\windows-jdk10-m3.5.x_build\target\it\get-artifact-maven-plugin\build.log, f:\jenkins\jenkins-slave\workspace\-dependency-plugin_MDEP-625-3I6V7G3727HFCGSCWRQH5RTCWRSMXZQ3ZEOVZRI3U3XLP2Z7WCCQ\windows-jdk10-m3.5.x_build\target\it\get-artifact-no-transitive\build.log, f:\jenkins\jenkins-slave\workspace\-dependency-plugin_MDEP-625-3I6V7G3727HFCGSCWRQH5RTCWRSMXZQ3ZEOVZRI3U3XLP2Z7WCCQ\windows-jdk10-m3.5.x_build\target\it\get-artifact\build.log, f:\jenkins\jenkins-slave\workspace\-dependency-plugin_MDEP-625-3I6V7G3727HFCGSCWRQH5RTCWRSMXZQ3ZEOVZRI3U3XLP2Z7WCCQ\windows-jdk10-m3.5.x_build\target\it\get-gav\build.log, f:\jenkins\jenkins-slave\workspace\-dependency-plugin_MDEP-625-3I6V7G3727HFCGSCWRQH5RTCWRSMXZQ3ZEOVZRI3U3XLP2Z7WCCQ\windows-jdk10-m3.5.x_build\target\it\go-offline\build.log, f:\jenkins\jenkins-slave\workspace\-dependency-plugin_MDEP-625-3I6V7G3727HFCGSCWRQH5RTCWRSMXZQ3ZEOVZRI3U3XLP2Z7WCCQ\windows-jdk10-m3.5.x_build\target\it\list-repositories\build.log, f:\jenkins\jenkins-slave\workspace\-dependency-plugin_MDEP-625-3I6V7G3727HFCGSCWRQH5RTCWRSMXZQ3ZEOVZRI3U3XLP2Z7WCCQ\windows-jdk10-m3.5.x_build\target\it\mdep-439-analyze-java8\build.log, f:\jenkins\jenkins-slave\workspace\-dependency-plugin_MDEP-625-3I6V7G3727HFCGSCWRQH5RTCWRSMXZQ3ZEOVZRI3U3XLP2Z7WCCQ\windows-jdk10-m3.5.x_build\target\it\mdep-450-project-with-ancestor\build.log, f:\jenkins\jenkins-slave\workspace\-dependency-plugin_MDEP-625-3I6V7G3727HFCGSCWRQH5RTCWRSMXZQ3ZEOVZRI3U3XLP2Z7WCCQ\windows-jdk10-m3.5.x_build\target\it\mdep-450-project-without-ancestor\build.log, f:\jenkins\jenkins-slave\workspace\-dependency-plugin_MDEP-625-3I6V7G3727HFCGSCWRQH5RTCWRSMXZQ3ZEOVZRI3U3XLP2Z7WCCQ\windows-jdk10-m3.5.x_build\target\it\mdep-506-dependency-without-version-in-depmgt\build.log, f:\jenkins\jenkins-slave\workspace\-dependency-plugin_MDEP-625-3I6V7G3727HFCGSCWRQH5RTCWRSMXZQ3ZEOVZRI3U3XLP2Z7WCCQ\windows-jdk10-m3.5.x_build\target\it\mdep-571-resolve-java9\build.log, f:\jenkins\jenkins-slave\workspace\-dependency-plugin_MDEP-625-3I6V7G3727HFCGSCWRQH5RTCWRSMXZQ3ZEOVZRI3U3XLP2Z7WCCQ\windows-jdk10-m3.5.x_build\target\it\mdep-572-unpack-tar-long-file\build.log, f:\jenkins\jenkins-slave\workspace\-dependency-plugin_MDEP-625-3I6V7G3727HFCGSCWRQH5RTCWRSMXZQ3ZEOVZRI3U3XLP2Z7WCCQ\windows-jdk10-m3.5.x_build\target\it\mdep-578_display-reason-invalid-module\build.log, f:\jenkins\jenkins-slave\workspace\-dependency-plugin_MDEP-625-3I6V7G3727HFCGSCWRQH5RTCWRSMXZQ3ZEOVZRI3U3XLP2Z7WCCQ\windows-jdk10-m3.5.x_build\target\it\mdep-580_display-manifest-automodules\build.log, f:\jenkins\jenkins-slave\workspace\-dependency-plugin_MDEP-625-3I6V7G3727HFCGSCWRQH5RTCWRSMXZQ3ZEOVZRI3U3XLP2Z7WCCQ\windows-jdk10-m3.5.x_build\target\it\mdep-599-analyze-java9\build.log, f:\jenkins\jenkins-slave\workspace\-dependency-plugin_MDEP-625-3I6V7G3727HFCGSCWRQH5RTCWRSMXZQ3ZEOVZRI3U3XLP2Z7WCCQ\windows-jdk10-m3.5.x_build\target\it\purge-local-repository-bad-dep\build.log, f:\jenkins\jenkins-slave\workspace\-dependency-plugin_MDEP-625-3I6V7G3727HFCGSCWRQH5RTCWRSMXZQ3ZEOVZRI3U3XLP2Z7WCCQ\windows-jdk10-m3.5.x_build\target\it\purge-local-repository-include\build.log, f:\jenkins\jenkins-slave\workspace\-dependency-plugin_MDEP-625-3I6V7G3727HFCGSCWRQH5RTCWRSMXZQ3ZEOVZRI3U3XLP2Z7WCCQ\windows-jdk10-m3.5.x_build\target\it\purge-local-repository-multi-module-execution\build.log, f:\jenkins\jenkins-slave\workspace\-dependency-plugin_MDEP-625-3I6V7G3727HFCGSCWRQH5RTCWRSMXZQ3ZEOVZRI3U3XLP2Z7WCCQ\windows-jdk10-m3.5.x_build\target\it\purge-local-repository-multi-module\build.log, f:\jenkins\jenkins-slave\workspace\-dependency-plugin_MDEP-625-3I6V7G3727HFCGSCWRQH5RTCWRSMXZQ3ZEOVZRI3U3XLP2Z7WCCQ\windows-jdk10-m3.5.x_build\target\it\purge-local-repository-non-transitive\build.log, f:\jenkins\jenkins-slave\workspace\-dependency-plugin_MDEP-625-3I6V7G3727HFCGSCWRQH5RTCWRSMXZQ3ZEOVZRI3U3XLP2Z7WCCQ\windows-jdk10-m3.5.x_build\target\it\purge-local-repository-reresolve\build.log, f:\jenkins\jenkins-slave\workspace\-dependency-plugin_MDEP-625-3I6V7G3727HFCGSCWRQH5RTCWRSMXZQ3ZEOVZRI3U3XLP2Z7WCCQ\windows-jdk10-m3.5.x_build\target\it\purge-local-repository-snapshots-only\build.log, f:\jenkins\jenkins-slave\workspace\-dependency-plugin_MDEP-625-3I6V7G3727HFCGSCWRQH5RTCWRSMXZQ3ZEOVZRI3U3XLP2Z7WCCQ\windows-jdk10-m3.5.x_build\target\it\purge-local-repository-version-range\build.log, f:\jenkins\jenkins-slave\workspace\-dependency-plugin_MDEP-625-3I6V7G3727HFCGSCWRQH5RTCWRSMXZQ3ZEOVZRI3U3XLP2Z7WCCQ\windows-jdk10-m3.5.x_build\target\it\purge-local-repository-without-pom\build.log, f:\jenkins\jenkins-slave\workspace\-dependency-plugin_MDEP-625-3I6V7G3727HFCGSCWRQH5RTCWRSMXZQ3ZEOVZRI3U3XLP2Z7WCCQ\windows-jdk10-m3.5.x_build\target\it\purge-local-repository\build.log, f:\jenkins\jenkins-slave\workspace\-dependency-plugin_MDEP-625-3I6V7G3727HFCGSCWRQH5RTCWRSMXZQ3ZEOVZRI3U3XLP2Z7WCCQ\windows-jdk10-m3.5.x_build\target\it\resolve-plugins-exclude-reactor\build.log, f:\jenkins\jenkins-slave\workspace\-dependency-plugin_MDEP-625-3I6V7G3727HFCGSCWRQH5RTCWRSMXZQ3ZEOVZRI3U3XLP2Z7WCCQ\windows-jdk10-m3.5.x_build\target\it\resolve-plugins-with-exclude\build.log, f:\jenkins\jenkins-slave\workspace\-dependency-plugin_MDEP-625-3I6V7G3727HFCGSCWRQH5RTCWRSMXZQ3ZEOVZRI3U3XLP2Z7WCCQ\windows-jdk10-m3.5.x_build\target\it\resolve-plugins\build.log, f:\jenkins\jenkins-slave\workspace\-dependency-plugin_MDEP-625-3I6V7G3727HFCGSCWRQH5RTCWRSMXZQ3ZEOVZRI3U3XLP2Z7WCCQ\windows-jdk10-m3.5.x_build\target\it\resolve\build.log, f:\jenkins\jenkins-slave\workspace\-dependency-plugin_MDEP-625-3I6V7G3727HFCGSCWRQH5RTCWRSMXZQ3ZEOVZRI3U3XLP2Z7WCCQ\windows-jdk10-m3.5.x_build\target\it\setup-custom-ear-lifecycle\build.log, f:\jenkins\jenkins-slave\workspace\-dependency-plugin_MDEP-625-3I6V7G3727HFCGSCWRQH5RTCWRSMXZQ3ZEOVZRI3U3XLP2Z7WCCQ\windows-jdk10-m3.5.x_build\target\it\sources\build.log, f:\jenkins\jenkins-slave\workspace\-dependency-plugin_MDEP-625-3I6V7G3727HFCGSCWRQH5RTCWRSMXZQ3ZEOVZRI3U3XLP2Z7WCCQ\windows-jdk10-m3.5.x_build\target\it\tree-includes\build.log, f:\jenkins\jenkins-slave\workspace\-dependency-plugin_MDEP-625-3I6V7G3727HFCGSCWRQH5RTCWRSMXZQ3ZEOVZRI3U3XLP2Z7WCCQ\windows-jdk10-m3.5.x_build\target\it\tree-multimodule\build.log, f:\jenkins\jenkins-slave\workspace\-dependency-plugin_MDEP-625-3I6V7G3727HFCGSCWRQH5RTCWRSMXZQ3ZEOVZRI3U3XLP2Z7WCCQ\windows-jdk10-m3.5.x_build\target\it\unpack-cli\build.log, f:\jenkins\jenkins-slave\workspace\-dependency-plugin_MDEP-625-3I6V7G3727HFCGSCWRQH5RTCWRSMXZQ3ZEOVZRI3U3XLP2Z7WCCQ\windows-jdk10-m3.5.x_build\target\it\unpack-custom-ear\build.log, f:\jenkins\jenkins-slave\workspace\-dependency-plugin_MDEP-625-3I6V7G3727HFCGSCWRQH5RTCWRSMXZQ3ZEOVZRI3U3XLP2Z7WCCQ\windows-jdk10-m3.5.x_build\target\it\unpack-dependencies\build.log, f:\jenkins\jenkins-slave\workspace\-dependency-plugin_MDEP-625-3I6V7G3727HFCGSCWRQH5RTCWRSMXZQ3ZEOVZRI3U3XLP2Z7WCCQ\windows-jdk10-m3.5.x_build\target\it\unpack-from-remote-repository\build.log, f:\jenkins\jenkins-slave\workspace\-dependency-plugin_MDEP-625-3I6V7G3727HFCGSCWRQH5RTCWRSMXZQ3ZEOVZRI3U3XLP2Z7WCCQ\windows-jdk10-m3.5.x_build\target\it\unpack\build.log, f:\jenkins\jenkins-slave\workspace\-dependency-plugin_MDEP-625-3I6V7G3727HFCGSCWRQH5RTCWRSMXZQ3ZEOVZRI3U3XLP2Z7WCCQ\windows-jdk10-m3.5.x_build\target\it\used-dependencies\build.log]
[windows-jdk10-m3.5.x_build] Finished parsing Maven Invoker results (found 58)
[windows-jdk10-m3.5.x_build] [withMaven] junitPublisher - Archive test results for Maven artifact org.apache.maven.plugins:maven-dependency-plugin:3.1.2-SNAPSHOT generated by maven-surefire-plugin:test (default-test): windows-jdk10-m3.5.x_build\target\surefire-reports\*.xml
[windows-jdk10-m3.5.x_build] Recording test results
[windows-jdk10-m3.5.x_build] [withMaven] openTasksPublisher - Scan Tasks for Maven artifact org.apache.maven.plugins:maven-dependency-plugin:3.1.2-SNAPSHOT in source directory windows-jdk10-m3.5.x_build\src\main\java
[windows-jdk10-m3.5.x_build] [TASKS] Scanning folder 'f:\jenkins\jenkins-slave\workspace\-dependency-plugin_MDEP-625-3I6V7G3727HFCGSCWRQH5RTCWRSMXZQ3ZEOVZRI3U3XLP2Z7WCCQ' for files matching the pattern 'windows-jdk10-m3.5.x_build\src\main\java\**\*' - excludes: null
[windows-jdk10-m3.5.x_build] [TASKS] Found 48 files to scan for tasks
[windows-jdk10-m3.5.x_build] [TASKS] Found 4 open tasks.
[windows-jdk10-m3.5.x_build] Skipping warnings blame since pipelines do not have an SCM link.%n
[Pipeline] [windows-jdk10-m3.5.x_build] // withMaven
[Pipeline] [windows-jdk10-m3.5.x_build] cleanWs
[windows-jdk10-m3.5.x_build] [WS-CLEANUP] Deleting project workspace...[WS-CLEANUP] done
[Pipeline] [windows-jdk10-m3.5.x_build] cleanWs
[windows-jdk10-m3.5.x_build] [WS-CLEANUP] Deleting project workspace...[WS-CLEANUP] done
[Pipeline] [windows-jdk10-m3.5.x_build] }
[Pipeline] [windows-jdk10-m3.5.x_build] // stage
[Pipeline] [windows-jdk10-m3.5.x_build] }
[Pipeline] [windows-jdk10-m3.5.x_build] // node
[Pipeline] [windows-jdk10-m3.5.x_build] }
[windows-jdk9-m3.5.x_build] [INFO] run post-build script verify.bsh
[windows-jdk9-m3.5.x_build] [INFO]           purge-local-repository-version-range\pom.xml ..... SUCCESS (905.9 s)
[windows-jdk9-m3.5.x_build] [INFO] Building: resolve\pom.xml
[windows-jdk9-m3.5.x_build] [INFO]           resolve\pom.xml .................................. SUCCESS (7.0 s)
[windows-jdk9-m3.5.x_build] [INFO] Building: resolve-plugins\pom.xml
[windows-jdk10-m3.5.x_build] Failed in branch windows-jdk10-m3.5.x_build
[windows-jdk9-m3.5.x_build] [INFO]           resolve-plugins\pom.xml .......................... FAILED (7.7 s)
[windows-jdk9-m3.5.x_build] [INFO]   The build exited with code 1. See f:\jenkins\jenkins-slave\workspace\-dependency-plugin_MDEP-625-3I6V7G3727HFCGSCWRQH5RTCWRSMXZQ3ZEOVZRI3U3XLP2Z7WCCQ@2\windows-jdk9-m3.5.x_build\target\it\resolve-plugins\build.log for details.
[windows-jdk9-m3.5.x_build] [INFO] Building: resolve-plugins-exclude-reactor\pom.xml
[windows-jdk9-m3.5.x_build] [INFO] run post-build script verify.groovy
[windows-jdk9-m3.5.x_build] [INFO]           resolve-plugins-exclude-reactor\pom.xml .......... FAILED (7.5 s)
[windows-jdk9-m3.5.x_build] [INFO]   The post-build script did not succeed. f:\jenkins\jenkins-slave\workspace\-dependency-plugin_MDEP-625-3I6V7G3727HFCGSCWRQH5RTCWRSMXZQ3ZEOVZRI3U3XLP2Z7WCCQ@2\windows-jdk9-m3.5.x_build\target\it\resolve-plugins-exclude-reactor\target\resolved.txt (The system cannot find the path specified)
[windows-jdk9-m3.5.x_build] [INFO] Building: resolve-plugins-with-exclude\pom.xml
[windows-jdk9-m3.5.x_build] [INFO] run post-build script verify.groovy
[windows-jdk9-m3.5.x_build] [INFO]           resolve-plugins-with-exclude\pom.xml ............. FAILED (7.4 s)
[windows-jdk9-m3.5.x_build] [INFO]   The post-build script did not succeed. f:\jenkins\jenkins-slave\workspace\-dependency-plugin_MDEP-625-3I6V7G3727HFCGSCWRQH5RTCWRSMXZQ3ZEOVZRI3U3XLP2Z7WCCQ@2\windows-jdk9-m3.5.x_build\target\it\resolve-plugins-with-exclude\target\resolved.txt (The system cannot find the path specified)
[windows-jdk9-m3.5.x_build] [INFO] Building: sources\pom.xml
[windows-jdk9-m3.5.x_build] [INFO] artifact classworlds.classworlds:1.1-alpha-2: checking for updates from central
[windows-jdk9-m3.5.x_build] [INFO] classworlds.classworlds.1.1-alpha-2: checking for updates from central
[windows-jdk9-m3.5.x_build] [INFO]           sources\pom.xml .................................. SUCCESS (7.8 s)
[windows-jdk9-m3.5.x_build] [INFO] Building: tree\pom.xml
[windows-jdk9-m3.5.x_build] [INFO]           tree\pom.xml ..................................... SKIPPED due to Maven version
[windows-jdk9-m3.5.x_build] [INFO] Building: tree-includes\pom.xml
[windows-jdk9-m3.5.x_build] [INFO] run post-build script verify.bsh
[windows-jdk9-m3.5.x_build] [INFO]           tree-includes\pom.xml ............................ SUCCESS (8.4 s)
[windows-jdk9-m3.5.x_build] [INFO] Building: tree-multimodule\pom.xml
[windows-jdk9-m3.5.x_build] [INFO] snapshot org.apache.maven.its.dependency:tree-multimodule-module-a:1.0-SNAPSHOT: checking for updates from apache-snapshots
[windows-jdk9-m3.5.x_build] [INFO] snapshot org.apache.maven.its.dependency:tree-multimodule-module-a:1.0-SNAPSHOT: checking for updates from Nexus
[windows-jdk9-m3.5.x_build] [INFO] artifact org.apache.maven.its.dependency.tree-multimodule-module-a:1.0-SNAPSHOT: checking for updates from central
[windows-jdk9-m3.5.x_build] [INFO] org.apache.maven.its.dependency.tree-multimodule-module-a.1.0-SNAPSHOT: checking for updates from central
[windows-jdk9-m3.5.x_build] [INFO] run post-build script verify.bsh
[windows-jdk9-m3.5.x_build] [INFO]           tree-multimodule\pom.xml ......................... SUCCESS (7.8 s)
[windows-jdk9-m3.5.x_build] [INFO] Building: unpack\pom.xml
[windows-jdk9-m3.5.x_build] [INFO] run post-build script verify.bsh
[windows-jdk9-m3.5.x_build] [INFO]           unpack\pom.xml ................................... SUCCESS (9.0 s)
[windows-jdk9-m3.5.x_build] [INFO] Building: unpack-cli\pom.xml
[windows-jdk9-m3.5.x_build] [INFO] run post-build script verify.bsh
[windows-jdk9-m3.5.x_build] [INFO]           unpack-cli\pom.xml ............................... SUCCESS (8.0 s)
[windows-jdk9-m3.5.x_build] [INFO] Building: unpack-custom-ear\pom.xml
[windows-jdk9-m3.5.x_build] [INFO] run post-build script verify.groovy
[windows-jdk9-m3.5.x_build] [INFO]           unpack-custom-ear\pom.xml ........................ SUCCESS (8.5 s)
[windows-jdk9-m3.5.x_build] [INFO] Building: unpack-dependencies\pom.xml
[windows-jdk9-m3.5.x_build] [INFO] run post-build script verify.groovy
[windows-jdk9-m3.5.x_build] [INFO]           unpack-dependencies\pom.xml ...................... SUCCESS (9.9 s)
[windows-jdk9-m3.5.x_build] [INFO] Building: unpack-from-remote-repository\pom.xml
[windows-jdk9-m3.5.x_build] [INFO] run pre-build script setup.bsh
[windows-jdk9-m3.5.x_build] [INFO] artifact org.apache.maven.its.dependency.fake-remote-unpack:1.0: checking for updates from central
[windows-jdk9-m3.5.x_build] [INFO] org.apache.maven.its.dependency.fake-remote-unpack.1.0: checking for updates from central
[windows-jdk9-m3.5.x_build] [INFO] run post-build script verify.bsh
[windows-jdk9-m3.5.x_build] [INFO]           unpack-from-remote-repository\pom.xml ............ SUCCESS (9.6 s)
[windows-jdk9-m3.5.x_build] [INFO] Building: used-dependencies\pom.xml
[windows-jdk9-m3.5.x_build] [INFO]           used-dependencies\pom.xml ........................ SUCCESS (10.1 s)
[windows-jdk9-m3.5.x_build] [INFO] Building: purge-local-repository-without-pom
[windows-jdk9-m3.5.x_build] [INFO] run pre-build script setup.bsh
[windows-jdk9-m3.5.x_build] [INFO] run post-build script verify.bsh
[windows-jdk9-m3.5.x_build] [INFO]           purge-local-repository-without-pom ............... SUCCESS (9.4 s)
[windows-jdk9-m3.5.x_build] [INFO]
[windows-jdk9-m3.5.x_build] [INFO] --- mrm-maven-plugin:1.0.0:stop (default) @ maven-dependency-plugin ---
[windows-jdk9-m3.5.x_build] [INFO] Stopping Mock Repository Manager on http://localhost:65157
[windows-jdk9-m3.5.x_build] [INFO] Mock Repository Manager http://localhost:65157 is stopped.
[windows-jdk9-m3.5.x_build] [INFO]
[windows-jdk9-m3.5.x_build] [INFO] --- maven-checkstyle-plugin:3.0.0:check (checkstyle-check) @ maven-dependency-plugin ---
[windows-jdk9-m3.5.x_build] [INFO] Downloading from central: https://repo.maven.apache.org/maven2/org/apache/maven/shared/maven-shared-resources/2/maven-shared-resources-2.pom
[windows-jdk9-m3.5.x_build] [INFO] Downloaded from central: https://repo.maven.apache.org/maven2/org/apache/maven/shared/maven-shared-resources/2/maven-shared-resources-2.pom (3.0 kB at 78 kB/s)
[windows-jdk9-m3.5.x_build] [INFO] Downloading from central: https://repo.maven.apache.org/maven2/org/apache/maven/doxia/doxia-integration-tools/1.6/doxia-integration-tools-1.6.pom
[windows-jdk9-m3.5.x_build] [INFO] Downloaded from central: https://repo.maven.apache.org/maven2/org/apache/maven/doxia/doxia-integration-tools/1.6/doxia-integration-tools-1.6.pom (7.0 kB at 773 kB/s)
[windows-jdk9-m3.5.x_build] [INFO] Downloading from central: https://repo.maven.apache.org/maven2/org/apache/maven/doxia/doxia-tools/3/doxia-tools-3.pom
[windows-jdk9-m3.5.x_build] [INFO] Downloaded from central: https://repo.maven.apache.org/maven2/org/apache/maven/doxia/doxia-tools/3/doxia-tools-3.pom (9.9 kB at 1.1 MB/s)
[windows-jdk9-m3.5.x_build] [INFO] Downloading from central: https://repo.maven.apache.org/maven2/org/codehaus/plexus/plexus-resources/1.1.0/plexus-resources-1.1.0.pom
[windows-jdk9-m3.5.x_build] [INFO] Downloaded from central: https://repo.maven.apache.org/maven2/org/codehaus/plexus/plexus-resources/1.1.0/plexus-resources-1.1.0.pom (3.2 kB at 397 kB/s)
[windows-jdk9-m3.5.x_build] [INFO] Downloading from central: https://repo.maven.apache.org/maven2/com/puppycrawl/tools/checkstyle/6.18/checkstyle-6.18.pom
[windows-jdk9-m3.5.x_build] [INFO] Downloaded from central: https://repo.maven.apache.org/maven2/com/puppycrawl/tools/checkstyle/6.18/checkstyle-6.18.pom (71 kB at 3.6 MB/s)
[windows-jdk9-m3.5.x_build] [INFO] Downloading from central: https://repo.maven.apache.org/maven2/antlr/antlr/2.7.7/antlr-2.7.7.pom
[windows-jdk9-m3.5.x_build] [INFO] Downloaded from central: https://repo.maven.apache.org/maven2/antlr/antlr/2.7.7/antlr-2.7.7.pom (632 B at 90 kB/s)
[windows-jdk9-m3.5.x_build] [INFO] Downloading from central: https://repo.maven.apache.org/maven2/org/antlr/antlr4-runtime/4.5.3/antlr4-runtime-4.5.3.pom
[windows-jdk9-m3.5.x_build] [INFO] Downloaded from central: https://repo.maven.apache.org/maven2/org/antlr/antlr4-runtime/4.5.3/antlr4-runtime-4.5.3.pom (2.3 kB at 257 kB/s)
[windows-jdk9-m3.5.x_build] [INFO] Downloading from central: https://repo.maven.apache.org/maven2/org/antlr/antlr4-master/4.5.3/antlr4-master-4.5.3.pom
[windows-jdk9-m3.5.x_build] [INFO] Downloaded from central: https://repo.maven.apache.org/maven2/org/antlr/antlr4-master/4.5.3/antlr4-master-4.5.3.pom (3.7 kB at 283 kB/s)
[windows-jdk9-m3.5.x_build] [INFO] Downloading from central: https://repo.maven.apache.org/maven2/commons-beanutils/commons-beanutils/1.9.2/commons-beanutils-1.9.2.pom
[windows-jdk9-m3.5.x_build] [INFO] Downloaded from central: https://repo.maven.apache.org/maven2/commons-beanutils/commons-beanutils/1.9.2/commons-beanutils-1.9.2.pom (14 kB at 1.3 MB/s)
[windows-jdk9-m3.5.x_build] [INFO] Downloading from central: https://repo.maven.apache.org/maven2/commons-cli/commons-cli/1.3.1/commons-cli-1.3.1.pom
[windows-jdk9-m3.5.x_build] [INFO] Downloaded from central: https://repo.maven.apache.org/maven2/commons-cli/commons-cli/1.3.1/commons-cli-1.3.1.pom (10 kB at 742 kB/s)
[windows-jdk9-m3.5.x_build] [INFO] Downloading from central: https://repo.maven.apache.org/maven2/com/google/guava/guava/19.0/guava-19.0.pom
[windows-jdk9-m3.5.x_build] [INFO] Downloaded from central: https://repo.maven.apache.org/maven2/com/google/guava/guava/19.0/guava-19.0.pom (6.8 kB at 679 kB/s)
[windows-jdk9-m3.5.x_build] [INFO] Downloading from central: https://repo.maven.apache.org/maven2/com/google/guava/guava-parent/19.0/guava-parent-19.0.pom
[windows-jdk9-m3.5.x_build] [INFO] Downloaded from central: https://repo.maven.apache.org/maven2/com/google/guava/guava-parent/19.0/guava-parent-19.0.pom (9.9 kB at 823 kB/s)
[windows-jdk9-m3.5.x_build] [INFO] Downloading from central: https://repo.maven.apache.org/maven2/org/sonatype/oss/oss-parent/7/oss-parent-7.pom
[windows-jdk9-m3.5.x_build] [INFO] Downloaded from central: https://repo.maven.apache.org/maven2/org/sonatype/oss/oss-parent/7/oss-parent-7.pom (4.8 kB at 302 kB/s)
[windows-jdk9-m3.5.x_build] [INFO] Downloading from central: https://repo.maven.apache.org/maven2/javax/xml/bind/jaxb-api/2.3.0/jaxb-api-2.3.0.pom
[windows-jdk9-m3.5.x_build] [INFO] Downloaded from central: https://repo.maven.apache.org/maven2/javax/xml/bind/jaxb-api/2.3.0/jaxb-api-2.3.0.pom (23 kB at 2.1 MB/s)
[windows-jdk9-m3.5.x_build] [INFO] Downloading from central: https://repo.maven.apache.org/maven2/javax/xml/bind/jaxb-api-parent/2.3.0/jaxb-api-parent-2.3.0.pom
[windows-jdk9-m3.5.x_build] [INFO] Downloaded from central: https://repo.maven.apache.org/maven2/javax/xml/bind/jaxb-api-parent/2.3.0/jaxb-api-parent-2.3.0.pom (5.6 kB at 627 kB/s)
[windows-jdk9-m3.5.x_build] [INFO] Downloading from central: https://repo.maven.apache.org/maven2/net/java/jvnet-parent/5/jvnet-parent-5.pom
[windows-jdk9-m3.5.x_build] [INFO] Downloaded from central: https://repo.maven.apache.org/maven2/net/java/jvnet-parent/5/jvnet-parent-5.pom (8.9 kB at 1.1 MB/s)
[windows-jdk9-m3.5.x_build] [INFO] Downloading from central: https://repo.maven.apache.org/maven2/org/codehaus/plexus/plexus-resources/1.1.0/plexus-resources-1.1.0.jar
[windows-jdk9-m3.5.x_build] [INFO] Downloading from central: https://repo.maven.apache.org/maven2/org/apache/maven/shared/maven-shared-resources/2/maven-shared-resources-2.jar
[windows-jdk9-m3.5.x_build] [INFO] Downloading from central: https://repo.maven.apache.org/maven2/com/puppycrawl/tools/checkstyle/6.18/checkstyle-6.18.jar
[windows-jdk9-m3.5.x_build] [INFO] Downloading from central: https://repo.maven.apache.org/maven2/commons-io/commons-io/1.4/commons-io-1.4.jar
[windows-jdk9-m3.5.x_build] [INFO] Downloading from central: https://repo.maven.apache.org/maven2/org/apache/maven/doxia/doxia-integration-tools/1.6/doxia-integration-tools-1.6.jar
[windows-jdk9-m3.5.x_build] [INFO] Downloaded from central: https://repo.maven.apache.org/maven2/org/codehaus/plexus/plexus-resources/1.1.0/plexus-resources-1.1.0.jar (23 kB at 774 kB/s)
[windows-jdk9-m3.5.x_build] [INFO] Downloading from central: https://repo.maven.apache.org/maven2/antlr/antlr/2.7.7/antlr-2.7.7.jar
[windows-jdk9-m3.5.x_build] [INFO] Downloaded from central: https://repo.maven.apache.org/maven2/org/apache/maven/shared/maven-shared-resources/2/maven-shared-resources-2.jar (13 kB at 326 kB/s)
[windows-jdk9-m3.5.x_build] [INFO] Downloading from central: https://repo.maven.apache.org/maven2/org/antlr/antlr4-runtime/4.5.3/antlr4-runtime-4.5.3.jar
[windows-jdk9-m3.5.x_build] [INFO] Downloaded from central: https://repo.maven.apache.org/maven2/org/antlr/antlr4-runtime/4.5.3/antlr4-runtime-4.5.3.jar (302 kB at 3.6 MB/s)
[windows-jdk9-m3.5.x_build] [INFO] Downloading from central: https://repo.maven.apache.org/maven2/commons-beanutils/commons-beanutils/1.9.2/commons-beanutils-1.9.2.jar
[windows-jdk9-m3.5.x_build] [INFO] Downloaded from central: https://repo.maven.apache.org/maven2/org/apache/maven/doxia/doxia-integration-tools/1.6/doxia-integration-tools-1.6.jar (45 kB at 490 kB/s)
[windows-jdk9-m3.5.x_build] [INFO] Downloading from central: https://repo.maven.apache.org/maven2/commons-cli/commons-cli/1.3.1/commons-cli-1.3.1.jar
[windows-jdk9-m3.5.x_build] [INFO] Downloaded from central: https://repo.maven.apache.org/maven2/com/puppycrawl/tools/checkstyle/6.18/checkstyle-6.18.jar (1.2 MB at 11 MB/s)
[windows-jdk9-m3.5.x_build] [INFO] Downloading from central: https://repo.maven.apache.org/maven2/com/google/guava/guava/19.0/guava-19.0.jar
[windows-jdk9-m3.5.x_build] [INFO] Downloaded from central: https://repo.maven.apache.org/maven2/commons-cli/commons-cli/1.3.1/commons-cli-1.3.1.jar (53 kB at 473 kB/s)
[windows-jdk9-m3.5.x_build] [INFO] Downloading from central: https://repo.maven.apache.org/maven2/javax/xml/bind/jaxb-api/2.3.0/jaxb-api-2.3.0.jar
[windows-jdk9-m3.5.x_build] [INFO] Downloaded from central: https://repo.maven.apache.org/maven2/commons-io/commons-io/1.4/commons-io-1.4.jar (109 kB at 916 kB/s)
[windows-jdk9-m3.5.x_build] [INFO] Downloaded from central: https://repo.maven.apache.org/maven2/commons-beanutils/commons-beanutils/1.9.2/commons-beanutils-1.9.2.jar (234 kB at 2.0 MB/s)
[windows-jdk9-m3.5.x_build] [INFO] Downloaded from central: https://repo.maven.apache.org/maven2/antlr/antlr/2.7.7/antlr-2.7.7.jar (445 kB at 3.5 MB/s)
[windows-jdk9-m3.5.x_build] [INFO] Downloaded from central: https://repo.maven.apache.org/maven2/javax/xml/bind/jaxb-api/2.3.0/jaxb-api-2.3.0.jar (126 kB at 938 kB/s)
[windows-jdk9-m3.5.x_build] [INFO] Downloaded from central: https://repo.maven.apache.org/maven2/com/google/guava/guava/19.0/guava-19.0.jar (2.3 MB at 12 MB/s)
[windows-jdk9-m3.5.x_build] [INFO] There is 1 error reported by Checkstyle 6.18 with config/maven_checks.xml ruleset.
[windows-jdk9-m3.5.x_build] [INFO] Ignored 1 error, 0 violation remaining.
[windows-jdk9-m3.5.x_build] [INFO]
[windows-jdk9-m3.5.x_build] [INFO] --- maven-invoker-plugin:3.1.0:verify (integration-test) @ maven-dependency-plugin ---
[windows-jdk9-m3.5.x_build] [INFO] -------------------------------------------------
[windows-jdk9-m3.5.x_build] [INFO] Build Summary:
[windows-jdk9-m3.5.x_build] [INFO]   Passed: 50, Failed: 7, Errors: 0, Skipped: 1
[windows-jdk9-m3.5.x_build] [INFO] -------------------------------------------------
[windows-jdk9-m3.5.x_build] [ERROR] The following builds failed:
[windows-jdk9-m3.5.x_build] [ERROR] *  get-artifact-maven-plugin\pom.xml
[windows-jdk9-m3.5.x_build] [ERROR] *  get-artifact\pom.xml
[windows-jdk9-m3.5.x_build] [ERROR] *  get-gav\pom.xml
[windows-jdk9-m3.5.x_build] [ERROR] *  go-offline\pom.xml
[windows-jdk9-m3.5.x_build] [ERROR] *  resolve-plugins-exclude-reactor\pom.xml
[windows-jdk9-m3.5.x_build] [ERROR] *  resolve-plugins-with-exclude\pom.xml
[windows-jdk9-m3.5.x_build] [ERROR] *  resolve-plugins\pom.xml
[windows-jdk9-m3.5.x_build] [INFO] -------------------------------------------------
[windows-jdk9-m3.5.x_build] [INFO] ------------------------------------------------------------------------
[windows-jdk9-m3.5.x_build] [INFO] BUILD FAILURE
[windows-jdk9-m3.5.x_build] [INFO] ------------------------------------------------------------------------
[windows-jdk9-m3.5.x_build] [INFO] Total time: 23:11 min
[windows-jdk9-m3.5.x_build] [INFO] Finished at: 2018-09-14T15:20:23Z
[windows-jdk9-m3.5.x_build] [INFO] Final Memory: 52M/172M
[windows-jdk9-m3.5.x_build] [INFO] ------------------------------------------------------------------------
[windows-jdk9-m3.5.x_build] [INFO] [jenkins-event-spy] Generated F:\jenkins\jenkins-slave\workspace\-dependency-plugin_MDEP-625-3I6V7G3727HFCGSCWRQH5RTCWRSMXZQ3ZEOVZRI3U3XLP2Z7WCCQ@2@tmp\withMaven0cac511d\maven-spy-20180914-145711-4607496676536933675510.log
[windows-jdk9-m3.5.x_build] [ERROR] Failed to execute goal org.apache.maven.plugins:maven-invoker-plugin:3.1.0:verify (integration-test) on project maven-dependency-plugin: 7 builds failed. See console output above for details. -> [Help 1]
[windows-jdk9-m3.5.x_build] [ERROR]
[windows-jdk9-m3.5.x_build] [ERROR] To see the full stack trace of the errors, re-run Maven with the -e switch.
[windows-jdk9-m3.5.x_build] [ERROR] Re-run Maven using the -X switch to enable full debug logging.
[windows-jdk9-m3.5.x_build] [ERROR]
[windows-jdk9-m3.5.x_build] [ERROR] For more information about the errors and possible solutions, please read the following articles:
[windows-jdk9-m3.5.x_build] [ERROR] [Help 1] http://cwiki.apache.org/confluence/display/MAVEN/MojoFailureException
[Pipeline] [windows-jdk9-m3.5.x_build] }
[Pipeline] [windows-jdk9-m3.5.x_build] // dir
[Pipeline] [windows-jdk9-m3.5.x_build] }
[windows-jdk9-m3.5.x_build] [Fast Archiver] No prior successful build to compare, so performing full copy of artifacts
[windows-jdk9-m3.5.x_build] [withMaven] invokerPublisher - Archive invoker results for Maven artifact MavenArtifact{org.apache.maven.plugins:maven-dependency-plugin::3.1.2-SNAPSHOT(version: 3.1.2-SNAPSHOT, snapshot:false) } generated by PluginInvocation{org.apache.maven.plugins:maven-invoker-plugin:3.1.0@integration-test  integration-test}: windows-jdk9-m3.5.x_build\target\invoker-reports\*.xml
[windows-jdk9-m3.5.x_build] performing MavenInvokerRecorder, reportsFilenamePattern:'**/windows-jdk9-m3.5.x_build\target\invoker-reports/BUILD*.xml', invokerBuildDir:'**/windows-jdk9-m3.5.x_build\target\it'
[windows-jdk9-m3.5.x_build] Found reports:[f:\jenkins\jenkins-slave\workspace\-dependency-plugin_MDEP-625-3I6V7G3727HFCGSCWRQH5RTCWRSMXZQ3ZEOVZRI3U3XLP2Z7WCCQ@2\windows-jdk9-m3.5.x_build\target\invoker-reports\BUILD-analyze-dep-mgt.xml, f:\jenkins\jenkins-slave\workspace\-dependency-plugin_MDEP-625-3I6V7G3727HFCGSCWRQH5RTCWRSMXZQ3ZEOVZRI3U3XLP2Z7WCCQ@2\windows-jdk9-m3.5.x_build\target\invoker-reports\BUILD-analyze-ignore-dependency.xml, f:\jenkins\jenkins-slave\workspace\-dependency-plugin_MDEP-625-3I6V7G3727HFCGSCWRQH5RTCWRSMXZQ3ZEOVZRI3U3XLP2Z7WCCQ@2\windows-jdk9-m3.5.x_build\target\invoker-reports\BUILD-analyze-ignore-unused-declared-dependency.xml, f:\jenkins\jenkins-slave\workspace\-dependency-plugin_MDEP-625-3I6V7G3727HFCGSCWRQH5RTCWRSMXZQ3ZEOVZRI3U3XLP2Z7WCCQ@2\windows-jdk9-m3.5.x_build\target\invoker-reports\BUILD-analyze-ignore-used-undeclared-dependency.xml, f:\jenkins\jenkins-slave\workspace\-dependency-plugin_MDEP-625-3I6V7G3727HFCGSCWRQH5RTCWRSMXZQ3ZEOVZRI3U3XLP2Z7WCCQ@2\windows-jdk9-m3.5.x_build\target\invoker-reports\BUILD-analyze-multimodule-project.xml, f:\jenkins\jenkins-slave\workspace\-dependency-plugin_MDEP-625-3I6V7G3727HFCGSCWRQH5RTCWRSMXZQ3ZEOVZRI3U3XLP2Z7WCCQ@2\windows-jdk9-m3.5.x_build\target\invoker-reports\BUILD-analyze-report.xml, f:\jenkins\jenkins-slave\workspace\-dependency-plugin_MDEP-625-3I6V7G3727HFCGSCWRQH5RTCWRSMXZQ3ZEOVZRI3U3XLP2Z7WCCQ@2\windows-jdk9-m3.5.x_build\target\invoker-reports\BUILD-analyze.xml, f:\jenkins\jenkins-slave\workspace\-dependency-plugin_MDEP-625-3I6V7G3727HFCGSCWRQH5RTCWRSMXZQ3ZEOVZRI3U3XLP2Z7WCCQ@2\windows-jdk9-m3.5.x_build\target\invoker-reports\BUILD-build-classpath-output-file-and-property.xml, f:\jenkins\jenkins-slave\workspace\-dependency-plugin_MDEP-625-3I6V7G3727HFCGSCWRQH5RTCWRSMXZQ3ZEOVZRI3U3XLP2Z7WCCQ@2\windows-jdk9-m3.5.x_build\target\invoker-reports\BUILD-build-classpath.xml, f:\jenkins\jenkins-slave\workspace\-dependency-plugin_MDEP-625-3I6V7G3727HFCGSCWRQH5RTCWRSMXZQ3ZEOVZRI3U3XLP2Z7WCCQ@2\windows-jdk9-m3.5.x_build\target\invoker-reports\BUILD-collect.xml, f:\jenkins\jenkins-slave\workspace\-dependency-plugin_MDEP-625-3I6V7G3727HFCGSCWRQH5RTCWRSMXZQ3ZEOVZRI3U3XLP2Z7WCCQ@2\windows-jdk9-m3.5.x_build\target\invoker-reports\BUILD-copy-and-unpack-with-alternate-local-repo.xml, f:\jenkins\jenkins-slave\workspace\-dependency-plugin_MDEP-625-3I6V7G3727HFCGSCWRQH5RTCWRSMXZQ3ZEOVZRI3U3XLP2Z7WCCQ@2\windows-jdk9-m3.5.x_build\target\invoker-reports\BUILD-copy-cli.xml, f:\jenkins\jenkins-slave\workspace\-dependency-plugin_MDEP-625-3I6V7G3727HFCGSCWRQH5RTCWRSMXZQ3ZEOVZRI3U3XLP2Z7WCCQ@2\windows-jdk9-m3.5.x_build\target\invoker-reports\BUILD-copy-dependencies.xml, f:\jenkins\jenkins-slave\workspace\-dependency-plugin_MDEP-625-3I6V7G3727HFCGSCWRQH5RTCWRSMXZQ3ZEOVZRI3U3XLP2Z7WCCQ@2\windows-jdk9-m3.5.x_build\target\invoker-reports\BUILD-copy-from-reactor.xml, f:\jenkins\jenkins-slave\workspace\-dependency-plugin_MDEP-625-3I6V7G3727HFCGSCWRQH5RTCWRSMXZQ3ZEOVZRI3U3XLP2Z7WCCQ@2\windows-jdk9-m3.5.x_build\target\invoker-reports\BUILD-copy-from-remote-repository.xml, f:\jenkins\jenkins-slave\workspace\-dependency-plugin_MDEP-625-3I6V7G3727HFCGSCWRQH5RTCWRSMXZQ3ZEOVZRI3U3XLP2Z7WCCQ@2\windows-jdk9-m3.5.x_build\target\invoker-reports\BUILD-copy.xml, f:\jenkins\jenkins-slave\workspace\-dependency-plugin_MDEP-625-3I6V7G3727HFCGSCWRQH5RTCWRSMXZQ3ZEOVZRI3U3XLP2Z7WCCQ@2\windows-jdk9-m3.5.x_build\target\invoker-reports\BUILD-dependency-properties.xml, f:\jenkins\jenkins-slave\workspace\-dependency-plugin_MDEP-625-3I6V7G3727HFCGSCWRQH5RTCWRSMXZQ3ZEOVZRI3U3XLP2Z7WCCQ@2\windows-jdk9-m3.5.x_build\target\invoker-reports\BUILD-filterunpack.xml, f:\jenkins\jenkins-slave\workspace\-dependency-plugin_MDEP-625-3I6V7G3727HFCGSCWRQH5RTCWRSMXZQ3ZEOVZRI3U3XLP2Z7WCCQ@2\windows-jdk9-m3.5.x_build\target\invoker-reports\BUILD-get-artifact-maven-plugin.xml, f:\jenkins\jenkins-slave\workspace\-dependency-plugin_MDEP-625-3I6V7G3727HFCGSCWRQH5RTCWRSMXZQ3ZEOVZRI3U3XLP2Z7WCCQ@2\windows-jdk9-m3.5.x_build\target\invoker-reports\BUILD-get-artifact-no-transitive.xml, f:\jenkins\jenkins-slave\workspace\-dependency-plugin_MDEP-625-3I6V7G3727HFCGSCWRQH5RTCWRSMXZQ3ZEOVZRI3U3XLP2Z7WCCQ@2\windows-jdk9-m3.5.x_build\target\invoker-reports\BUILD-get-artifact.xml, f:\jenkins\jenkins-slave\workspace\-dependency-plugin_MDEP-625-3I6V7G3727HFCGSCWRQH5RTCWRSMXZQ3ZEOVZRI3U3XLP2Z7WCCQ@2\windows-jdk9-m3.5.x_build\target\invoker-reports\BUILD-get-gav.xml, f:\jenkins\jenkins-slave\workspace\-dependency-plugin_MDEP-625-3I6V7G3727HFCGSCWRQH5RTCWRSMXZQ3ZEOVZRI3U3XLP2Z7WCCQ@2\windows-jdk9-m3.5.x_build\target\invoker-reports\BUILD-go-offline.xml, f:\jenkins\jenkins-slave\workspace\-dependency-plugin_MDEP-625-3I6V7G3727HFCGSCWRQH5RTCWRSMXZQ3ZEOVZRI3U3XLP2Z7WCCQ@2\windows-jdk9-m3.5.x_build\target\invoker-reports\BUILD-list-repositories.xml, f:\jenkins\jenkins-slave\workspace\-dependency-plugin_MDEP-625-3I6V7G3727HFCGSCWRQH5RTCWRSMXZQ3ZEOVZRI3U3XLP2Z7WCCQ@2\windows-jdk9-m3.5.x_build\target\invoker-reports\BUILD-mdep-439-analyze-java8.xml, f:\jenkins\jenkins-slave\workspace\-dependency-plugin_MDEP-625-3I6V7G3727HFCGSCWRQH5RTCWRSMXZQ3ZEOVZRI3U3XLP2Z7WCCQ@2\windows-jdk9-m3.5.x_build\target\invoker-reports\BUILD-mdep-450-project-with-ancestor.xml, f:\jenkins\jenkins-slave\workspace\-dependency-plugin_MDEP-625-3I6V7G3727HFCGSCWRQH5RTCWRSMXZQ3ZEOVZRI3U3XLP2Z7WCCQ@2\windows-jdk9-m3.5.x_build\target\invoker-reports\BUILD-mdep-450-project-without-ancestor.xml, f:\jenkins\jenkins-slave\workspace\-dependency-plugin_MDEP-625-3I6V7G3727HFCGSCWRQH5RTCWRSMXZQ3ZEOVZRI3U3XLP2Z7WCCQ@2\windows-jdk9-m3.5.x_build\target\invoker-reports\BUILD-mdep-506-dependency-without-version-in-depmgt.xml, f:\jenkins\jenkins-slave\workspace\-dependency-plugin_MDEP-625-3I6V7G3727HFCGSCWRQH5RTCWRSMXZQ3ZEOVZRI3U3XLP2Z7WCCQ@2\windows-jdk9-m3.5.x_build\target\invoker-reports\BUILD-mdep-571-resolve-java9.xml, f:\jenkins\jenkins-slave\workspace\-dependency-plugin_MDEP-625-3I6V7G3727HFCGSCWRQH5RTCWRSMXZQ3ZEOVZRI3U3XLP2Z7WCCQ@2\windows-jdk9-m3.5.x_build\target\invoker-reports\BUILD-mdep-572-unpack-tar-long-file.xml, f:\jenkins\jenkins-slave\workspace\-dependency-plugin_MDEP-625-3I6V7G3727HFCGSCWRQH5RTCWRSMXZQ3ZEOVZRI3U3XLP2Z7WCCQ@2\windows-jdk9-m3.5.x_build\target\invoker-reports\BUILD-mdep-578_display-reason-invalid-module.xml, f:\jenkins\jenkins-slave\workspace\-dependency-plugin_MDEP-625-3I6V7G3727HFCGSCWRQH5RTCWRSMXZQ3ZEOVZRI3U3XLP2Z7WCCQ@2\windows-jdk9-m3.5.x_build\target\invoker-reports\BUILD-mdep-580_display-manifest-automodules.xml, f:\jenkins\jenkins-slave\workspace\-dependency-plugin_MDEP-625-3I6V7G3727HFCGSCWRQH5RTCWRSMXZQ3ZEOVZRI3U3XLP2Z7WCCQ@2\windows-jdk9-m3.5.x_build\target\invoker-reports\BUILD-mdep-599-analyze-java9.xml, f:\jenkins\jenkins-slave\workspace\-dependency-plugin_MDEP-625-3I6V7G3727HFCGSCWRQH5RTCWRSMXZQ3ZEOVZRI3U3XLP2Z7WCCQ@2\windows-jdk9-m3.5.x_build\target\invoker-reports\BUILD-purge-local-repository-bad-dep.xml, f:\jenkins\jenkins-slave\workspace\-dependency-plugin_MDEP-625-3I6V7G3727HFCGSCWRQH5RTCWRSMXZQ3ZEOVZRI3U3XLP2Z7WCCQ@2\windows-jdk9-m3.5.x_build\target\invoker-reports\BUILD-purge-local-repository-include.xml, f:\jenkins\jenkins-slave\workspace\-dependency-plugin_MDEP-625-3I6V7G3727HFCGSCWRQH5RTCWRSMXZQ3ZEOVZRI3U3XLP2Z7WCCQ@2\windows-jdk9-m3.5.x_build\target\invoker-reports\BUILD-purge-local-repository-multi-module-execution.xml, f:\jenkins\jenkins-slave\workspace\-dependency-plugin_MDEP-625-3I6V7G3727HFCGSCWRQH5RTCWRSMXZQ3ZEOVZRI3U3XLP2Z7WCCQ@2\windows-jdk9-m3.5.x_build\target\invoker-reports\BUILD-purge-local-repository-multi-module.xml, f:\jenkins\jenkins-slave\workspace\-dependency-plugin_MDEP-625-3I6V7G3727HFCGSCWRQH5RTCWRSMXZQ3ZEOVZRI3U3XLP2Z7WCCQ@2\windows-jdk9-m3.5.x_build\target\invoker-reports\BUILD-purge-local-repository-non-transitive.xml, f:\jenkins\jenkins-slave\workspace\-dependency-plugin_MDEP-625-3I6V7G3727HFCGSCWRQH5RTCWRSMXZQ3ZEOVZRI3U3XLP2Z7WCCQ@2\windows-jdk9-m3.5.x_build\target\invoker-reports\BUILD-purge-local-repository-reresolve.xml, f:\jenkins\jenkins-slave\workspace\-dependency-plugin_MDEP-625-3I6V7G3727HFCGSCWRQH5RTCWRSMXZQ3ZEOVZRI3U3XLP2Z7WCCQ@2\windows-jdk9-m3.5.x_build\target\invoker-reports\BUILD-purge-local-repository-snapshots-only.xml, f:\jenkins\jenkins-slave\workspace\-dependency-plugin_MDEP-625-3I6V7G3727HFCGSCWRQH5RTCWRSMXZQ3ZEOVZRI3U3XLP2Z7WCCQ@2\windows-jdk9-m3.5.x_build\target\invoker-reports\BUILD-purge-local-repository-version-range.xml, f:\jenkins\jenkins-slave\workspace\-dependency-plugin_MDEP-625-3I6V7G3727HFCGSCWRQH5RTCWRSMXZQ3ZEOVZRI3U3XLP2Z7WCCQ@2\windows-jdk9-m3.5.x_build\target\invoker-reports\BUILD-purge-local-repository-without-pom.xml, f:\jenkins\jenkins-slave\workspace\-dependency-plugin_MDEP-625-3I6V7G3727HFCGSCWRQH5RTCWRSMXZQ3ZEOVZRI3U3XLP2Z7WCCQ@2\windows-jdk9-m3.5.x_build\target\invoker-reports\BUILD-purge-local-repository.xml, f:\jenkins\jenkins-slave\workspace\-dependency-plugin_MDEP-625-3I6V7G3727HFCGSCWRQH5RTCWRSMXZQ3ZEOVZRI3U3XLP2Z7WCCQ@2\windows-jdk9-m3.5.x_build\target\invoker-reports\BUILD-resolve-plugins-exclude-reactor.xml, f:\jenkins\jenkins-slave\workspace\-dependency-plugin_MDEP-625-3I6V7G3727HFCGSCWRQH5RTCWRSMXZQ3ZEOVZRI3U3XLP2Z7WCCQ@2\windows-jdk9-m3.5.x_build\target\invoker-reports\BUILD-resolve-plugins-with-exclude.xml, f:\jenkins\jenkins-slave\workspace\-dependency-plugin_MDEP-625-3I6V7G3727HFCGSCWRQH5RTCWRSMXZQ3ZEOVZRI3U3XLP2Z7WCCQ@2\windows-jdk9-m3.5.x_build\target\invoker-reports\BUILD-resolve-plugins.xml, f:\jenkins\jenkins-slave\workspace\-dependency-plugin_MDEP-625-3I6V7G3727HFCGSCWRQH5RTCWRSMXZQ3ZEOVZRI3U3XLP2Z7WCCQ@2\windows-jdk9-m3.5.x_build\target\invoker-reports\BUILD-resolve.xml, f:\jenkins\jenkins-slave\workspace\-dependency-plugin_MDEP-625-3I6V7G3727HFCGSCWRQH5RTCWRSMXZQ3ZEOVZRI3U3XLP2Z7WCCQ@2\windows-jdk9-m3.5.x_build\target\invoker-reports\BUILD-setup-custom-ear-lifecycle.xml, f:\jenkins\jenkins-slave\workspace\-dependency-plugin_MDEP-625-3I6V7G3727HFCGSCWRQH5RTCWRSMXZQ3ZEOVZRI3U3XLP2Z7WCCQ@2\windows-jdk9-m3.5.x_build\target\invoker-reports\BUILD-sources.xml, f:\jenkins\jenkins-slave\workspace\-dependency-plugin_MDEP-625-3I6V7G3727HFCGSCWRQH5RTCWRSMXZQ3ZEOVZRI3U3XLP2Z7WCCQ@2\windows-jdk9-m3.5.x_build\target\invoker-reports\BUILD-tree-includes.xml, f:\jenkins\jenkins-slave\workspace\-dependency-plugin_MDEP-625-3I6V7G3727HFCGSCWRQH5RTCWRSMXZQ3ZEOVZRI3U3XLP2Z7WCCQ@2\windows-jdk9-m3.5.x_build\target\invoker-reports\BUILD-tree-multimodule.xml, f:\jenkins\jenkins-slave\workspace\-dependency-plugin_MDEP-625-3I6V7G3727HFCGSCWRQH5RTCWRSMXZQ3ZEOVZRI3U3XLP2Z7WCCQ@2\windows-jdk9-m3.5.x_build\target\invoker-reports\BUILD-tree.xml, f:\jenkins\jenkins-slave\workspace\-dependency-plugin_MDEP-625-3I6V7G3727HFCGSCWRQH5RTCWRSMXZQ3ZEOVZRI3U3XLP2Z7WCCQ@2\windows-jdk9-m3.5.x_build\target\invoker-reports\BUILD-unpack-cli.xml, f:\jenkins\jenkins-slave\workspace\-dependency-plugin_MDEP-625-3I6V7G3727HFCGSCWRQH5RTCWRSMXZQ3ZEOVZRI3U3XLP2Z7WCCQ@2\windows-jdk9-m3.5.x_build\target\invoker-reports\BUILD-unpack-custom-ear.xml, f:\jenkins\jenkins-slave\workspace\-dependency-plugin_MDEP-625-3I6V7G3727HFCGSCWRQH5RTCWRSMXZQ3ZEOVZRI3U3XLP2Z7WCCQ@2\windows-jdk9-m3.5.x_build\target\invoker-reports\BUILD-unpack-dependencies.xml, f:\jenkins\jenkins-slave\workspace\-dependency-plugin_MDEP-625-3I6V7G3727HFCGSCWRQH5RTCWRSMXZQ3ZEOVZRI3U3XLP2Z7WCCQ@2\windows-jdk9-m3.5.x_build\target\invoker-reports\BUILD-unpack-from-remote-repository.xml, f:\jenkins\jenkins-slave\workspace\-dependency-plugin_MDEP-625-3I6V7G3727HFCGSCWRQH5RTCWRSMXZQ3ZEOVZRI3U3XLP2Z7WCCQ@2\windows-jdk9-m3.5.x_build\target\invoker-reports\BUILD-unpack.xml, f:\jenkins\jenkins-slave\workspace\-dependency-plugin_MDEP-625-3I6V7G3727HFCGSCWRQH5RTCWRSMXZQ3ZEOVZRI3U3XLP2Z7WCCQ@2\windows-jdk9-m3.5.x_build\target\invoker-reports\BUILD-used-dependencies.xml]
[windows-jdk9-m3.5.x_build] Found logs:[f:\jenkins\jenkins-slave\workspace\-dependency-plugin_MDEP-625-3I6V7G3727HFCGSCWRQH5RTCWRSMXZQ3ZEOVZRI3U3XLP2Z7WCCQ@2\windows-jdk9-m3.5.x_build\target\it\analyze-dep-mgt\build.log, f:\jenkins\jenkins-slave\workspace\-dependency-plugin_MDEP-625-3I6V7G3727HFCGSCWRQH5RTCWRSMXZQ3ZEOVZRI3U3XLP2Z7WCCQ@2\windows-jdk9-m3.5.x_build\target\it\analyze-ignore-dependency\build.log, f:\jenkins\jenkins-slave\workspace\-dependency-plugin_MDEP-625-3I6V7G3727HFCGSCWRQH5RTCWRSMXZQ3ZEOVZRI3U3XLP2Z7WCCQ@2\windows-jdk9-m3.5.x_build\target\it\analyze-ignore-unused-declared-dependency\build.log, f:\jenkins\jenkins-slave\workspace\-dependency-plugin_MDEP-625-3I6V7G3727HFCGSCWRQH5RTCWRSMXZQ3ZEOVZRI3U3XLP2Z7WCCQ@2\windows-jdk9-m3.5.x_build\target\it\analyze-ignore-used-undeclared-dependency\build.log, f:\jenkins\jenkins-slave\workspace\-dependency-plugin_MDEP-625-3I6V7G3727HFCGSCWRQH5RTCWRSMXZQ3ZEOVZRI3U3XLP2Z7WCCQ@2\windows-jdk9-m3.5.x_build\target\it\analyze-multimodule-project\build.log, f:\jenkins\jenkins-slave\workspace\-dependency-plugin_MDEP-625-3I6V7G3727HFCGSCWRQH5RTCWRSMXZQ3ZEOVZRI3U3XLP2Z7WCCQ@2\windows-jdk9-m3.5.x_build\target\it\analyze-report\build.log, f:\jenkins\jenkins-slave\workspace\-dependency-plugin_MDEP-625-3I6V7G3727HFCGSCWRQH5RTCWRSMXZQ3ZEOVZRI3U3XLP2Z7WCCQ@2\windows-jdk9-m3.5.x_build\target\it\analyze\build.log, f:\jenkins\jenkins-slave\workspace\-dependency-plugin_MDEP-625-3I6V7G3727HFCGSCWRQH5RTCWRSMXZQ3ZEOVZRI3U3XLP2Z7WCCQ@2\windows-jdk9-m3.5.x_build\target\it\build-classpath-output-file-and-property\build.log, f:\jenkins\jenkins-slave\workspace\-dependency-plugin_MDEP-625-3I6V7G3727HFCGSCWRQH5RTCWRSMXZQ3ZEOVZRI3U3XLP2Z7WCCQ@2\windows-jdk9-m3.5.x_build\target\it\build-classpath\build.log, f:\jenkins\jenkins-slave\workspace\-dependency-plugin_MDEP-625-3I6V7G3727HFCGSCWRQH5RTCWRSMXZQ3ZEOVZRI3U3XLP2Z7WCCQ@2\windows-jdk9-m3.5.x_build\target\it\collect\build.log, f:\jenkins\jenkins-slave\workspace\-dependency-plugin_MDEP-625-3I6V7G3727HFCGSCWRQH5RTCWRSMXZQ3ZEOVZRI3U3XLP2Z7WCCQ@2\windows-jdk9-m3.5.x_build\target\it\copy-and-unpack-with-alternate-local-repo\build.log, f:\jenkins\jenkins-slave\workspace\-dependency-plugin_MDEP-625-3I6V7G3727HFCGSCWRQH5RTCWRSMXZQ3ZEOVZRI3U3XLP2Z7WCCQ@2\windows-jdk9-m3.5.x_build\target\it\copy-cli\build.log, f:\jenkins\jenkins-slave\workspace\-dependency-plugin_MDEP-625-3I6V7G3727HFCGSCWRQH5RTCWRSMXZQ3ZEOVZRI3U3XLP2Z7WCCQ@2\windows-jdk9-m3.5.x_build\target\it\copy-dependencies\build.log, f:\jenkins\jenkins-slave\workspace\-dependency-plugin_MDEP-625-3I6V7G3727HFCGSCWRQH5RTCWRSMXZQ3ZEOVZRI3U3XLP2Z7WCCQ@2\windows-jdk9-m3.5.x_build\target\it\copy-from-reactor\build.log, f:\jenkins\jenkins-slave\workspace\-dependency-plugin_MDEP-625-3I6V7G3727HFCGSCWRQH5RTCWRSMXZQ3ZEOVZRI3U3XLP2Z7WCCQ@2\windows-jdk9-m3.5.x_build\target\it\copy-from-remote-repository\build.log, f:\jenkins\jenkins-slave\workspace\-dependency-plugin_MDEP-625-3I6V7G3727HFCGSCWRQH5RTCWRSMXZQ3ZEOVZRI3U3XLP2Z7WCCQ@2\windows-jdk9-m3.5.x_build\target\it\copy\build.log, f:\jenkins\jenkins-slave\workspace\-dependency-plugin_MDEP-625-3I6V7G3727HFCGSCWRQH5RTCWRSMXZQ3ZEOVZRI3U3XLP2Z7WCCQ@2\windows-jdk9-m3.5.x_build\target\it\dependency-properties\build.log, f:\jenkins\jenkins-slave\workspace\-dependency-plugin_MDEP-625-3I6V7G3727HFCGSCWRQH5RTCWRSMXZQ3ZEOVZRI3U3XLP2Z7WCCQ@2\windows-jdk9-m3.5.x_build\target\it\filterunpack\build.log, f:\jenkins\jenkins-slave\workspace\-dependency-plugin_MDEP-625-3I6V7G3727HFCGSCWRQH5RTCWRSMXZQ3ZEOVZRI3U3XLP2Z7WCCQ@2\windows-jdk9-m3.5.x_build\target\it\get-artifact-maven-plugin\build.log, f:\jenkins\jenkins-slave\workspace\-dependency-plugin_MDEP-625-3I6V7G3727HFCGSCWRQH5RTCWRSMXZQ3ZEOVZRI3U3XLP2Z7WCCQ@2\windows-jdk9-m3.5.x_build\target\it\get-artifact-no-transitive\build.log, f:\jenkins\jenkins-slave\workspace\-dependency-plugin_MDEP-625-3I6V7G3727HFCGSCWRQH5RTCWRSMXZQ3ZEOVZRI3U3XLP2Z7WCCQ@2\windows-jdk9-m3.5.x_build\target\it\get-artifact\build.log, f:\jenkins\jenkins-slave\workspace\-dependency-plugin_MDEP-625-3I6V7G3727HFCGSCWRQH5RTCWRSMXZQ3ZEOVZRI3U3XLP2Z7WCCQ@2\windows-jdk9-m3.5.x_build\target\it\get-gav\build.log, f:\jenkins\jenkins-slave\workspace\-dependency-plugin_MDEP-625-3I6V7G3727HFCGSCWRQH5RTCWRSMXZQ3ZEOVZRI3U3XLP2Z7WCCQ@2\windows-jdk9-m3.5.x_build\target\it\go-offline\build.log, f:\jenkins\jenkins-slave\workspace\-dependency-plugin_MDEP-625-3I6V7G3727HFCGSCWRQH5RTCWRSMXZQ3ZEOVZRI3U3XLP2Z7WCCQ@2\windows-jdk9-m3.5.x_build\target\it\list-repositories\build.log, f:\jenkins\jenkins-slave\workspace\-dependency-plugin_MDEP-625-3I6V7G3727HFCGSCWRQH5RTCWRSMXZQ3ZEOVZRI3U3XLP2Z7WCCQ@2\windows-jdk9-m3.5.x_build\target\it\mdep-439-analyze-java8\build.log, f:\jenkins\jenkins-slave\workspace\-dependency-plugin_MDEP-625-3I6V7G3727HFCGSCWRQH5RTCWRSMXZQ3ZEOVZRI3U3XLP2Z7WCCQ@2\windows-jdk9-m3.5.x_build\target\it\mdep-450-project-with-ancestor\build.log, f:\jenkins\jenkins-slave\workspace\-dependency-plugin_MDEP-625-3I6V7G3727HFCGSCWRQH5RTCWRSMXZQ3ZEOVZRI3U3XLP2Z7WCCQ@2\windows-jdk9-m3.5.x_build\target\it\mdep-450-project-without-ancestor\build.log, f:\jenkins\jenkins-slave\workspace\-dependency-plugin_MDEP-625-3I6V7G3727HFCGSCWRQH5RTCWRSMXZQ3ZEOVZRI3U3XLP2Z7WCCQ@2\windows-jdk9-m3.5.x_build\target\it\mdep-506-dependency-without-version-in-depmgt\build.log, f:\jenkins\jenkins-slave\workspace\-dependency-plugin_MDEP-625-3I6V7G3727HFCGSCWRQH5RTCWRSMXZQ3ZEOVZRI3U3XLP2Z7WCCQ@2\windows-jdk9-m3.5.x_build\target\it\mdep-571-resolve-java9\build.log, f:\jenkins\jenkins-slave\workspace\-dependency-plugin_MDEP-625-3I6V7G3727HFCGSCWRQH5RTCWRSMXZQ3ZEOVZRI3U3XLP2Z7WCCQ@2\windows-jdk9-m3.5.x_build\target\it\mdep-572-unpack-tar-long-file\build.log, f:\jenkins\jenkins-slave\workspace\-dependency-plugin_MDEP-625-3I6V7G3727HFCGSCWRQH5RTCWRSMXZQ3ZEOVZRI3U3XLP2Z7WCCQ@2\windows-jdk9-m3.5.x_build\target\it\mdep-578_display-reason-invalid-module\build.log, f:\jenkins\jenkins-slave\workspace\-dependency-plugin_MDEP-625-3I6V7G3727HFCGSCWRQH5RTCWRSMXZQ3ZEOVZRI3U3XLP2Z7WCCQ@2\windows-jdk9-m3.5.x_build\target\it\mdep-580_display-manifest-automodules\build.log, f:\jenkins\jenkins-slave\workspace\-dependency-plugin_MDEP-625-3I6V7G3727HFCGSCWRQH5RTCWRSMXZQ3ZEOVZRI3U3XLP2Z7WCCQ@2\windows-jdk9-m3.5.x_build\target\it\mdep-599-analyze-java9\build.log, f:\jenkins\jenkins-slave\workspace\-dependency-plugin_MDEP-625-3I6V7G3727HFCGSCWRQH5RTCWRSMXZQ3ZEOVZRI3U3XLP2Z7WCCQ@2\windows-jdk9-m3.5.x_build\target\it\purge-local-repository-bad-dep\build.log, f:\jenkins\jenkins-slave\workspace\-dependency-plugin_MDEP-625-3I6V7G3727HFCGSCWRQH5RTCWRSMXZQ3ZEOVZRI3U3XLP2Z7WCCQ@2\windows-jdk9-m3.5.x_build\target\it\purge-local-repository-include\build.log, f:\jenkins\jenkins-slave\workspace\-dependency-plugin_MDEP-625-3I6V7G3727HFCGSCWRQH5RTCWRSMXZQ3ZEOVZRI3U3XLP2Z7WCCQ@2\windows-jdk9-m3.5.x_build\target\it\purge-local-repository-multi-module-execution\build.log, f:\jenkins\jenkins-slave\workspace\-dependency-plugin_MDEP-625-3I6V7G3727HFCGSCWRQH5RTCWRSMXZQ3ZEOVZRI3U3XLP2Z7WCCQ@2\windows-jdk9-m3.5.x_build\target\it\purge-local-repository-multi-module\build.log, f:\jenkins\jenkins-slave\workspace\-dependency-plugin_MDEP-625-3I6V7G3727HFCGSCWRQH5RTCWRSMXZQ3ZEOVZRI3U3XLP2Z7WCCQ@2\windows-jdk9-m3.5.x_build\target\it\purge-local-repository-non-transitive\build.log, f:\jenkins\jenkins-slave\workspace\-dependency-plugin_MDEP-625-3I6V7G3727HFCGSCWRQH5RTCWRSMXZQ3ZEOVZRI3U3XLP2Z7WCCQ@2\windows-jdk9-m3.5.x_build\target\it\purge-local-repository-reresolve\build.log, f:\jenkins\jenkins-slave\workspace\-dependency-plugin_MDEP-625-3I6V7G3727HFCGSCWRQH5RTCWRSMXZQ3ZEOVZRI3U3XLP2Z7WCCQ@2\windows-jdk9-m3.5.x_build\target\it\purge-local-repository-snapshots-only\build.log, f:\jenkins\jenkins-slave\workspace\-dependency-plugin_MDEP-625-3I6V7G3727HFCGSCWRQH5RTCWRSMXZQ3ZEOVZRI3U3XLP2Z7WCCQ@2\windows-jdk9-m3.5.x_build\target\it\purge-local-repository-version-range\build.log, f:\jenkins\jenkins-slave\workspace\-dependency-plugin_MDEP-625-3I6V7G3727HFCGSCWRQH5RTCWRSMXZQ3ZEOVZRI3U3XLP2Z7WCCQ@2\windows-jdk9-m3.5.x_build\target\it\purge-local-repository-without-pom\build.log, f:\jenkins\jenkins-slave\workspace\-dependency-plugin_MDEP-625-3I6V7G3727HFCGSCWRQH5RTCWRSMXZQ3ZEOVZRI3U3XLP2Z7WCCQ@2\windows-jdk9-m3.5.x_build\target\it\purge-local-repository\build.log, f:\jenkins\jenkins-slave\workspace\-dependency-plugin_MDEP-625-3I6V7G3727HFCGSCWRQH5RTCWRSMXZQ3ZEOVZRI3U3XLP2Z7WCCQ@2\windows-jdk9-m3.5.x_build\target\it\resolve-plugins-exclude-reactor\build.log, f:\jenkins\jenkins-slave\workspace\-dependency-plugin_MDEP-625-3I6V7G3727HFCGSCWRQH5RTCWRSMXZQ3ZEOVZRI3U3XLP2Z7WCCQ@2\windows-jdk9-m3.5.x_build\target\it\resolve-plugins-with-exclude\build.log, f:\jenkins\jenkins-slave\workspace\-dependency-plugin_MDEP-625-3I6V7G3727HFCGSCWRQH5RTCWRSMXZQ3ZEOVZRI3U3XLP2Z7WCCQ@2\windows-jdk9-m3.5.x_build\target\it\resolve-plugins\build.log, f:\jenkins\jenkins-slave\workspace\-dependency-plugin_MDEP-625-3I6V7G3727HFCGSCWRQH5RTCWRSMXZQ3ZEOVZRI3U3XLP2Z7WCCQ@2\windows-jdk9-m3.5.x_build\target\it\resolve\build.log, f:\jenkins\jenkins-slave\workspace\-dependency-plugin_MDEP-625-3I6V7G3727HFCGSCWRQH5RTCWRSMXZQ3ZEOVZRI3U3XLP2Z7WCCQ@2\windows-jdk9-m3.5.x_build\target\it\setup-custom-ear-lifecycle\build.log, f:\jenkins\jenkins-slave\workspace\-dependency-plugin_MDEP-625-3I6V7G3727HFCGSCWRQH5RTCWRSMXZQ3ZEOVZRI3U3XLP2Z7WCCQ@2\windows-jdk9-m3.5.x_build\target\it\sources\build.log, f:\jenkins\jenkins-slave\workspace\-dependency-plugin_MDEP-625-3I6V7G3727HFCGSCWRQH5RTCWRSMXZQ3ZEOVZRI3U3XLP2Z7WCCQ@2\windows-jdk9-m3.5.x_build\target\it\tree-includes\build.log, f:\jenkins\jenkins-slave\workspace\-dependency-plugin_MDEP-625-3I6V7G3727HFCGSCWRQH5RTCWRSMXZQ3ZEOVZRI3U3XLP2Z7WCCQ@2\windows-jdk9-m3.5.x_build\target\it\tree-multimodule\build.log, f:\jenkins\jenkins-slave\workspace\-dependency-plugin_MDEP-625-3I6V7G3727HFCGSCWRQH5RTCWRSMXZQ3ZEOVZRI3U3XLP2Z7WCCQ@2\windows-jdk9-m3.5.x_build\target\it\unpack-cli\build.log, f:\jenkins\jenkins-slave\workspace\-dependency-plugin_MDEP-625-3I6V7G3727HFCGSCWRQH5RTCWRSMXZQ3ZEOVZRI3U3XLP2Z7WCCQ@2\windows-jdk9-m3.5.x_build\target\it\unpack-custom-ear\build.log, f:\jenkins\jenkins-slave\workspace\-dependency-plugin_MDEP-625-3I6V7G3727HFCGSCWRQH5RTCWRSMXZQ3ZEOVZRI3U3XLP2Z7WCCQ@2\windows-jdk9-m3.5.x_build\target\it\unpack-dependencies\build.log, f:\jenkins\jenkins-slave\workspace\-dependency-plugin_MDEP-625-3I6V7G3727HFCGSCWRQH5RTCWRSMXZQ3ZEOVZRI3U3XLP2Z7WCCQ@2\windows-jdk9-m3.5.x_build\target\it\unpack-from-remote-repository\build.log, f:\jenkins\jenkins-slave\workspace\-dependency-plugin_MDEP-625-3I6V7G3727HFCGSCWRQH5RTCWRSMXZQ3ZEOVZRI3U3XLP2Z7WCCQ@2\windows-jdk9-m3.5.x_build\target\it\unpack\build.log, f:\jenkins\jenkins-slave\workspace\-dependency-plugin_MDEP-625-3I6V7G3727HFCGSCWRQH5RTCWRSMXZQ3ZEOVZRI3U3XLP2Z7WCCQ@2\windows-jdk9-m3.5.x_build\target\it\used-dependencies\build.log]
[windows-jdk9-m3.5.x_build] Finished parsing Maven Invoker results (found 58)
[windows-jdk9-m3.5.x_build] [withMaven] junitPublisher - Archive test results for Maven artifact org.apache.maven.plugins:maven-dependency-plugin:3.1.2-SNAPSHOT generated by maven-surefire-plugin:test (default-test): windows-jdk9-m3.5.x_build\target\surefire-reports\*.xml
[windows-jdk9-m3.5.x_build] Recording test results
[windows-jdk9-m3.5.x_build] [withMaven] openTasksPublisher - Scan Tasks for Maven artifact org.apache.maven.plugins:maven-dependency-plugin:3.1.2-SNAPSHOT in source directory windows-jdk9-m3.5.x_build\src\main\java
[windows-jdk9-m3.5.x_build] [TASKS] Scanning folder 'f:\jenkins\jenkins-slave\workspace\-dependency-plugin_MDEP-625-3I6V7G3727HFCGSCWRQH5RTCWRSMXZQ3ZEOVZRI3U3XLP2Z7WCCQ@2' for files matching the pattern 'windows-jdk9-m3.5.x_build\src\main\java\**\*' - excludes: null
[windows-jdk9-m3.5.x_build] [TASKS] Found 48 files to scan for tasks
[windows-jdk9-m3.5.x_build] [TASKS] Found 4 open tasks.
[windows-jdk9-m3.5.x_build] Skipping warnings blame since pipelines do not have an SCM link.%n
[Pipeline] [windows-jdk9-m3.5.x_build] // withMaven
[Pipeline] [windows-jdk9-m3.5.x_build] cleanWs
[windows-jdk9-m3.5.x_build] [WS-CLEANUP] Deleting project workspace...[WS-CLEANUP] done
[Pipeline] [windows-jdk9-m3.5.x_build] cleanWs
[windows-jdk9-m3.5.x_build] [WS-CLEANUP] Deleting project workspace...[WS-CLEANUP] done
[Pipeline] [windows-jdk9-m3.5.x_build] }
[Pipeline] [windows-jdk9-m3.5.x_build] // stage
[Pipeline] [windows-jdk9-m3.5.x_build] }
[Pipeline] [windows-jdk9-m3.5.x_build] // node
[Pipeline] [windows-jdk9-m3.5.x_build] }
[windows-jdk9-m3.5.x_build] Failed in branch windows-jdk9-m3.5.x_build
[Pipeline] // parallel
[Pipeline] stage
[Pipeline] { (Notifications)
[Pipeline] echo
Build result: FAILURE
[Pipeline] jiraIssueSelector
[Pipeline] emailext