Build failed in Jenkins: Maven TLP » maven-dependency-plugin » MDEP-579 #1

classic Classic list List threaded Threaded
4 messages Options
Reply | Threaded
Open this post in threaded view
|

Build failed in Jenkins: Maven TLP » maven-dependency-plugin » MDEP-579 #1

Apache Jenkins Server-2
See https://builds.apache.org/job/maven-box/job/maven-dependency-plugin/job/MDEP-579/1/

No changes.

All tests passed

Build log:
[...truncated 9859 lines...]
[INFO] artifact org.apache.maven.its.dependency.fake-remote-unpack:1.0: checking for updates from central
[INFO] run post-build script verify.bsh
[INFO]           unpack-from-remote-repository/pom.xml ............ SUCCESS (10.4 s)
[INFO] Building: filterunpack/pom.xml
[INFO] snapshot org.apache.maven.its.dependency:tree-multimodule-module-a:1.0-SNAPSHOT: checking for updates from Nexus
[INFO] artifact org.apache.maven.its.dependency.tree-multimodule-module-a:1.0-SNAPSHOT: checking for updates from central
[INFO] run post-build script verify.bsh
[INFO]           tree-multimodule/pom.xml ......................... SUCCESS (8.8 s)
[INFO] Building: copy-and-unpack-with-alternate-local-repo/pom.xml
[INFO] run post-build script verify.groovy
[INFO]           filterunpack/pom.xml ............................. SUCCESS (8.4 s)
[INFO] Building: unpack/pom.xml
[INFO] run post-build script verify.bsh
[INFO]           copy-and-unpack-with-alternate-local-repo/pom.xml  SUCCESS (9.9 s)
[INFO] Building: mdep-578_display-reason-invalid-module/pom.xml
[INFO]           mdep-578_display-reason-invalid-module/pom.xml ... SKIPPED due to JRE version
[INFO] Building: purge-local-repository-without-pom
[INFO] run pre-build script setup.bsh
[INFO] run post-build script verify.bsh
[INFO]           unpack/pom.xml ................................... SUCCESS (10.0 s)
[INFO] Building: mdep-571-resolve-java9/pom.xml
[INFO]           mdep-571-resolve-java9/pom.xml ................... SKIPPED due to JRE version
[INFO] Building: copy-dependencies/pom.xml
[INFO] run post-build script verify.groovy
[INFO]           purge-local-repository-without-pom ............... SUCCESS (7.7 s)
[INFO]
[INFO] --- mrm-maven-plugin:1.2.0:stop (default) @ maven-dependency-plugin ---
[INFO] Stopping Mock Repository Manager on http://localhost:46731
[INFO] Stopped SocketConnector@0.0.0.0:46731
[INFO] Mock Repository Manager http://localhost:46731 is stopped.
[INFO]
[INFO] --- maven-checkstyle-plugin:3.0.0:check (checkstyle-check) @ maven-dependency-plugin ---
[INFO] There is 1 error reported by Checkstyle 6.18 with config/maven_checks.xml ruleset.
[INFO] Ignored 1 error, 0 violation remaining.
[INFO]
[INFO] --- maven-invoker-plugin:3.1.0:verify (integration-test) @ maven-dependency-plugin ---
[INFO] -------------------------------------------------
[INFO] Build Summary:
[INFO]   Passed: 56, Failed: 0, Errors: 0, Skipped: 5
[INFO] -------------------------------------------------
[INFO] ------------------------------------------------------------------------
[INFO] BUILD SUCCESS
[INFO] ------------------------------------------------------------------------
[INFO] Total time: 10:18 min
[INFO] Finished at: 2019-10-27T21:53:54+00:00
[INFO] run post-build script verify.bsh
[INFO]           copy-dependencies/pom.xml ........................ SUCCESS (8.9 s)
[INFO] Building: copy-from-remote-repository/pom.xml
[INFO] run pre-build script setup.bsh
[INFO] Final Memory: 68M/1759M
[INFO] ------------------------------------------------------------------------
[INFO] [jenkins-event-spy] Generated /home/jenkins/jenkins-slave/workspace/maven-dependency-plugin_MDEP-579@2@tmp/withMaven4bcddfa9/maven-spy-20191027-214335-2592692587835164373083.log
[Pipeline] }
[Pipeline] // dir
[Pipeline] }
[withMaven] artifactsPublisher - Archive artifact linux-jdk7-m3.2.x_build/pom.xml under org/apache/maven/plugins/maven-dependency-plugin/3.1.2-SNAPSHOT/maven-dependency-plugin-3.1.2-SNAPSHOT.pom
[withMaven] artifactsPublisher - Archive artifact linux-jdk7-m3.2.x_build/target/maven-dependency-plugin-3.1.2-SNAPSHOT.jar under org/apache/maven/plugins/maven-dependency-plugin/3.1.2-SNAPSHOT/maven-dependency-plugin-3.1.2-SNAPSHOT.jar
[Fast Archiver] No prior successful build to compare, so performing full copy of artifacts
[withMaven] junitPublisher - Archive test results for Maven artifact org.apache.maven.plugins:maven-dependency-plugin:maven-plugin:3.1.2-SNAPSHOT generated by maven-surefire-plugin:test (default-test): linux-jdk7-m3.2.x_build/target/surefire-reports/*.xml
Recording test results
[INFO] artifact org.apache.maven.its.dependency.fake-remote-copy:1.0: checking for updates from central
[INFO] run post-build script verify.bsh
[INFO]           copy-from-remote-repository/pom.xml .............. SUCCESS (10.4 s)
[INFO] Building: purge-local-repository-without-pom
[INFO] run pre-build script setup.bsh
[withMaven] openTasksPublisher - Scan Tasks for Maven artifact org.apache.maven.plugins:maven-dependency-plugin:maven-plugin:3.1.2-SNAPSHOT in source directory linux-jdk7-m3.2.x_build/src/main/java
[TASKS] Scanning folder '/home/jenkins/jenkins-slave/workspace/maven-dependency-plugin_MDEP-579@2' for files matching the pattern 'linux-jdk7-m3.2.x_build/src/main/java/**/*' - excludes: null
[TASKS] Found 50 files to scan for tasks
[TASKS] Found 4 open tasks.
Skipping warnings blame since pipelines do not have an SCM link.%n
[withMaven] invokerPublisher - Archive invoker results for Maven artifact MavenArtifact{org.apache.maven.plugins:maven-dependency-plugin:maven-plugin:3.1.2-SNAPSHOT(version: 3.1.2-SNAPSHOT, snapshot:false) } generated by PluginInvocation{org.apache.maven.plugins:maven-invoker-plugin:3.1.0@integration-test  integration-test}: linux-jdk7-m3.2.x_build/target/invoker-reports/*.xml
[INFO] run post-build script verify.groovy
[INFO]           purge-local-repository-without-pom ............... SUCCESS (8.1 s)
[INFO]
[INFO] --- mrm-maven-plugin:1.2.0:stop (default) @ maven-dependency-plugin ---
[INFO] Stopping Mock Repository Manager on http://localhost:38905
[INFO] Stopped SocketConnector@0.0.0.0:38905
[INFO] Mock Repository Manager http://localhost:38905 is stopped.
[INFO]
[INFO] --- maven-checkstyle-plugin:3.0.0:check (checkstyle-check) @ maven-dependency-plugin ---
[INFO] There is 1 error reported by Checkstyle 6.18 with config/maven_checks.xml ruleset.
[INFO] Ignored 1 error, 0 violation remaining.
[INFO]
[INFO] --- maven-invoker-plugin:3.1.0:verify (integration-test) @ maven-dependency-plugin ---
[INFO] -------------------------------------------------
[INFO] Build Summary:
[INFO]   Passed: 55, Failed: 0, Errors: 0, Skipped: 6
[INFO] -------------------------------------------------
[INFO] ------------------------------------------------------------------------
[INFO] BUILD SUCCESS
[INFO] ------------------------------------------------------------------------
[INFO] Total time:  10:37 min
[INFO] Finished at: 2019-10-27T21:54:17Z
[INFO] ------------------------------------------------------------------------
[INFO] [jenkins-event-spy] Generated /home/jenkins/jenkins-slave/workspace/maven-dependency-plugin_MDEP-579@2@tmp/withMaven172db6cb/maven-spy-20191027-214340-1808147786702481521737.log
[Pipeline] }
[Pipeline] // dir
[Pipeline] }
[withMaven] artifactsPublisher - Archive artifact linux-jdk7-m3.6.x_build/pom.xml under org/apache/maven/plugins/maven-dependency-plugin/3.1.2-SNAPSHOT/maven-dependency-plugin-3.1.2-SNAPSHOT.pom
[withMaven] artifactsPublisher - Archive artifact linux-jdk7-m3.6.x_build/target/maven-dependency-plugin-3.1.2-SNAPSHOT.jar under org/apache/maven/plugins/maven-dependency-plugin/3.1.2-SNAPSHOT/maven-dependency-plugin-3.1.2-SNAPSHOT.jar
[Fast Archiver] No prior successful build to compare, so performing full copy of artifacts
[withMaven] junitPublisher - Archive test results for Maven artifact org.apache.maven.plugins:maven-dependency-plugin:maven-plugin:3.1.2-SNAPSHOT generated by maven-surefire-plugin:test (default-test): linux-jdk7-m3.6.x_build/target/surefire-reports/*.xml
Recording test results
[withMaven] openTasksPublisher - Scan Tasks for Maven artifact org.apache.maven.plugins:maven-dependency-plugin:maven-plugin:3.1.2-SNAPSHOT in source directory linux-jdk7-m3.6.x_build/src/main/java
[TASKS] Scanning folder '/home/jenkins/jenkins-slave/workspace/maven-dependency-plugin_MDEP-579@2' for files matching the pattern 'linux-jdk7-m3.6.x_build/src/main/java/**/*' - excludes: null
[TASKS] Found 50 files to scan for tasks
[TASKS] Found 4 open tasks.
Skipping warnings blame since pipelines do not have an SCM link.%n
[withMaven] invokerPublisher - Archive invoker results for Maven artifact MavenArtifact{org.apache.maven.plugins:maven-dependency-plugin:maven-plugin:3.1.2-SNAPSHOT(version: 3.1.2-SNAPSHOT, snapshot:false) } generated by PluginInvocation{org.apache.maven.plugins:maven-invoker-plugin:3.1.0@integration-test  integration-test}: linux-jdk7-m3.6.x_build/target/invoker-reports/*.xml
[withMaven] Publishers: Generated Artifacts Publisher: 1095 ms, Junit Publisher: 14551 ms, Open Task Scanner Publisher: 912 ms, Dependencies Fingerprint Publisher: 1 ms, Invoker Publisher: 57974 ms, Pipeline Graph Publisher: 1 ms
[Pipeline] // withMaven
[Pipeline] cleanWs
[WS-CLEANUP] Deleting project workspace...
[WS-CLEANUP] Deferred wipeout is used...
[WS-CLEANUP] done
[Pipeline] }
[Pipeline] // stage
[Pipeline] }
[Pipeline] // ws
[Pipeline] }
[Pipeline] // node
[Pipeline] }
[withMaven] Publishers: Generated Artifacts Publisher: 1104 ms, Junit Publisher: 14629 ms, Open Task Scanner Publisher: 923 ms, Dependencies Fingerprint Publisher: 1 ms, Invoker Publisher: 59937 ms, Pipeline Graph Publisher: 1 ms
[Pipeline] // withMaven
[Pipeline] cleanWs
[WS-CLEANUP] Deleting project workspace...
[WS-CLEANUP] Deferred wipeout is used...
[WS-CLEANUP] done
[Pipeline] }
[Pipeline] // stage
[Pipeline] }
[Pipeline] // ws
[Pipeline] }
[Pipeline] // node
[Pipeline] }
[INFO] run post-build script verify.bsh
[INFO]           purge-local-repository-version-range\pom.xml ..... SUCCESS (904.3 s)
[INFO] Building: resolve\pom.xml
[INFO]           resolve\pom.xml .................................. SUCCESS (4.3 s)
[INFO] Building: resolve-plugins\pom.xml
[INFO]           resolve-plugins\pom.xml .......................... SUCCESS (4.2 s)
[INFO] Building: resolve-plugins-exclude-reactor\pom.xml
[INFO] run post-build script verify.groovy
[INFO]           resolve-plugins-exclude-reactor\pom.xml .......... SUCCESS (6.9 s)
[INFO] Building: resolve-plugins-with-exclude\pom.xml
[INFO] run post-build script verify.groovy
[INFO]           resolve-plugins-with-exclude\pom.xml ............. SUCCESS (4.5 s)
[INFO] Building: sources\pom.xml
[INFO] artifact classworlds.classworlds:1.1-alpha-2: checking for updates from central
[INFO]           sources\pom.xml .................................. SUCCESS (5.2 s)
[INFO] Building: tree\pom.xml
[INFO]           tree\pom.xml ..................................... SKIPPED due to Maven version
[INFO] Building: tree-includes\pom.xml
[INFO] run post-build script verify.bsh
[INFO]           tree-includes\pom.xml ............................ SUCCESS (3.5 s)
[INFO] Building: tree-multimodule\pom.xml
[INFO] snapshot org.apache.maven.its.dependency:tree-multimodule-module-a:1.0-SNAPSHOT: checking for updates from apache-snapshots
[INFO] snapshot org.apache.maven.its.dependency:tree-multimodule-module-a:1.0-SNAPSHOT: checking for updates from Nexus
[INFO] artifact org.apache.maven.its.dependency.tree-multimodule-module-a:1.0-SNAPSHOT: checking for updates from central
[INFO] run post-build script verify.bsh
[INFO]           tree-multimodule\pom.xml ......................... SUCCESS (5.0 s)
[INFO] Building: unpack\pom.xml
[INFO] run post-build script verify.bsh
[INFO]           unpack\pom.xml ................................... SUCCESS (6.0 s)
[INFO] Building: unpack-cli\pom.xml
[INFO] run post-build script verify.bsh
[INFO]           unpack-cli\pom.xml ............................... SUCCESS (4.8 s)
[INFO] Building: unpack-custom-ear\pom.xml
[INFO] run post-build script verify.groovy
[INFO]           unpack-custom-ear\pom.xml ........................ SUCCESS (4.2 s)
[INFO] Building: unpack-dependencies\pom.xml
[INFO] run post-build script verify.groovy
[INFO]           unpack-dependencies\pom.xml ...................... SUCCESS (7.1 s)
[INFO] Building: unpack-dependencies-with-filemappers\pom.xml
[INFO] run post-build script verify.groovy
[INFO]           unpack-dependencies-with-filemappers\pom.xml ..... SUCCESS (6.1 s)
[INFO] Building: unpack-from-remote-repository\pom.xml
[INFO] run pre-build script setup.bsh
[INFO] artifact org.apache.maven.its.dependency.fake-remote-unpack:1.0: checking for updates from central
[INFO] run post-build script verify.bsh
[INFO]           unpack-from-remote-repository\pom.xml ............ SUCCESS (5.5 s)
[INFO] Building: used-dependencies\pom.xml
[INFO]           used-dependencies\pom.xml ........................ SUCCESS (4.9 s)
[INFO] Building: purge-local-repository-without-pom
[INFO] run pre-build script setup.bsh
[INFO] run post-build script verify.groovy
[INFO]           purge-local-repository-without-pom ............... SUCCESS (3.9 s)
[INFO]
[INFO] --- mrm-maven-plugin:1.2.0:stop (default) @ maven-dependency-plugin ---
[INFO] Stopping Mock Repository Manager on http://localhost:61887
[INFO] Stopped SocketConnector@0.0.0.0:61887
[INFO] Mock Repository Manager http://localhost:61887 is stopped.
[INFO]
[INFO] --- maven-checkstyle-plugin:3.0.0:check (checkstyle-check) @ maven-dependency-plugin ---
[INFO] There is 1 error reported by Checkstyle 6.18 with config/maven_checks.xml ruleset.
[INFO] Ignored 1 error, 0 violation remaining.
[INFO]
[INFO] --- maven-invoker-plugin:3.1.0:verify (integration-test) @ maven-dependency-plugin ---
[INFO] -------------------------------------------------
[INFO] Build Summary:
[INFO]   Passed: 55, Failed: 0, Errors: 0, Skipped: 6
[INFO] -------------------------------------------------
[INFO] ------------------------------------------------------------------------
[INFO] BUILD SUCCESS
[INFO] ------------------------------------------------------------------------
[INFO] Total time: 22:28 min
[INFO] Finished at: 2019-10-27T15:06:03-07:00
[INFO] Final Memory: 61M/629M
[INFO] ------------------------------------------------------------------------
[INFO] [jenkins-event-spy] Generated F:\jenkins\jenkins-slave\workspace\maven-dependency-plugin_MDEP-579@3@tmp\withMaven6b56f738\maven-spy-20191027-144334-191323927762537304558.log
Picked up JAVA_TOOL_OPTIONS: -Dmaven.ext.class.path="f:\jenkins\jenkins-slave\workspace\maven-dependency-plugin_MDEP-579@3@tmp\withMaven6b56f738\pipeline-maven-spy.jar" -Dorg.jenkinsci.plugins.pipeline.maven.reportsFolder="f:\jenkins\jenkins-slave\workspace\maven-dependency-plugin_MDEP-579@3@tmp\withMaven6b56f738"
[Pipeline] }
[Pipeline] // dir
[Pipeline] }
[withMaven] artifactsPublisher - Archive artifact windows-jdk7-m3.5.x_build\pom.xml under org\apache\maven\plugins\maven-dependency-plugin\3.1.2-SNAPSHOT\maven-dependency-plugin-3.1.2-SNAPSHOT.pom
[withMaven] artifactsPublisher - Archive artifact windows-jdk7-m3.5.x_build\target\maven-dependency-plugin-3.1.2-SNAPSHOT.jar under org\apache\maven\plugins\maven-dependency-plugin\3.1.2-SNAPSHOT\maven-dependency-plugin-3.1.2-SNAPSHOT.jar
[Fast Archiver] No prior successful build to compare, so performing full copy of artifacts
[withMaven] junitPublisher - Archive test results for Maven artifact org.apache.maven.plugins:maven-dependency-plugin:maven-plugin:3.1.2-SNAPSHOT generated by maven-surefire-plugin:test (default-test): windows-jdk7-m3.5.x_build\target\surefire-reports\*.xml
Recording test results
[withMaven] openTasksPublisher - Scan Tasks for Maven artifact org.apache.maven.plugins:maven-dependency-plugin:maven-plugin:3.1.2-SNAPSHOT in source directory windows-jdk7-m3.5.x_build\src\main\java
[TASKS] Scanning folder 'f:\jenkins\jenkins-slave\workspace\maven-dependency-plugin_MDEP-579@3' for files matching the pattern 'windows-jdk7-m3.5.x_build\src\main\java\**\*' - excludes: null
[TASKS] Found 50 files to scan for tasks
[TASKS] Found 4 open tasks.
Skipping warnings blame since pipelines do not have an SCM link.%n
[withMaven] invokerPublisher - Archive invoker results for Maven artifact MavenArtifact{org.apache.maven.plugins:maven-dependency-plugin:maven-plugin:3.1.2-SNAPSHOT(version: 3.1.2-SNAPSHOT, snapshot:false) } generated by PluginInvocation{org.apache.maven.plugins:maven-invoker-plugin:3.1.0@integration-test  integration-test}: windows-jdk7-m3.5.x_build\target\invoker-reports\*.xml
[withMaven] Publishers: Generated Artifacts Publisher: 86 ms, Junit Publisher: 819 ms, Open Task Scanner Publisher: 131 ms, Invoker Publisher: 20514 ms, Pipeline Graph Publisher: 1 ms
[Pipeline] // withMaven
[Pipeline] cleanWs
[WS-CLEANUP] Deleting project workspace...
[WS-CLEANUP] Deferred wipeout is used...
[WS-CLEANUP] done
[Pipeline] }
[Pipeline] // stage
[Pipeline] }
[Pipeline] // ws
[Pipeline] }
[Pipeline] // node
[Pipeline] }
[Pipeline] // parallel
[Pipeline] stage
[Pipeline] { (Notifications)
[Pipeline] echo
Build result: FAILURE
[Pipeline] jiraIssueSelector
[Pipeline] echo
The authors of changes [].
[Pipeline] echo
Sending email ...
[Pipeline] emailext
Reply | Threaded
Open this post in threaded view
|

Build failed in Jenkins: Maven TLP » maven-dependency-plugin » MDEP-579 #2

Apache Jenkins Server-2
See https://builds.apache.org/job/maven-box/job/maven-dependency-plugin/job/MDEP-579/2/

No changes.

All tests passed

Build log:
[...truncated 11101 lines...]
[INFO] Building: copy-from-remote-repository/pom.xml
[INFO] run pre-build script setup.bsh
[INFO] There is 1 error reported by Checkstyle 6.18 with config/maven_checks.xml ruleset.
[INFO] Ignored 1 error, 0 violation remaining.
[INFO]
[INFO] --- maven-invoker-plugin:3.1.0:verify (integration-test) @ maven-dependency-plugin ---
[INFO] -------------------------------------------------
[INFO] Build Summary:
[INFO]   Passed: 55, Failed: 0, Errors: 0, Skipped: 6
[INFO] -------------------------------------------------
[INFO] ------------------------------------------------------------------------
[INFO] BUILD SUCCESS
[INFO] ------------------------------------------------------------------------
[INFO] Total time: 10:26 min
[INFO] Finished at: 2019-10-28T21:36:54Z
[INFO] ------------------------------------------------------------------------
[INFO] [jenkins-event-spy] Generated /home/jenkins/jenkins-slave/workspace/maven-dependency-plugin_MDEP-579@2@tmp/withMaven9c802fe5/maven-spy-20191028-212627-578593549804939157274.log
[Pipeline] }
[Pipeline] // dir
[Pipeline] }
[withMaven] artifactsPublisher - Archive artifact linux-jdk7-m3.5.x_build/pom.xml under org/apache/maven/plugins/maven-dependency-plugin/3.1.2-SNAPSHOT/maven-dependency-plugin-3.1.2-SNAPSHOT.pom
[withMaven] artifactsPublisher - Archive artifact linux-jdk7-m3.5.x_build/target/maven-dependency-plugin-3.1.2-SNAPSHOT.jar under org/apache/maven/plugins/maven-dependency-plugin/3.1.2-SNAPSHOT/maven-dependency-plugin-3.1.2-SNAPSHOT.jar
[Fast Archiver] No prior successful build to compare, so performing full copy of artifacts
[withMaven] junitPublisher - Archive test results for Maven artifact org.apache.maven.plugins:maven-dependency-plugin:maven-plugin:3.1.2-SNAPSHOT generated by maven-surefire-plugin:test (default-test): linux-jdk7-m3.5.x_build/target/surefire-reports/*.xml
Recording test results
[INFO] artifact org.apache.maven.its.dependency.fake-remote-copy:1.0: checking for updates from central
[INFO] run post-build script verify.bsh
[INFO]           copy-from-remote-repository/pom.xml .............. SUCCESS (13.4 s)
[INFO] Building: collect/pom.xml
[withMaven] Publishers: Generated Artifacts Publisher: 94 ms, Junit Publisher: 1478 ms, Open Task Scanner Publisher: 168 ms, Dependencies Fingerprint Publisher: 1 ms, Invoker Publisher: 24330 ms, Pipeline Graph Publisher: 1 ms
[Pipeline] // withMaven
[Pipeline] cleanWs
[withMaven] openTasksPublisher - Scan Tasks for Maven artifact org.apache.maven.plugins:maven-dependency-plugin:maven-plugin:3.1.2-SNAPSHOT in source directory linux-jdk7-m3.5.x_build/src/main/java
[WS-CLEANUP] Deleting project workspace...
[WS-CLEANUP] Deferred wipeout is used...
[TASKS] Scanning folder '/home/jenkins/jenkins-slave/workspace/maven-dependency-plugin_MDEP-579@2' for files matching the pattern 'linux-jdk7-m3.5.x_build/src/main/java/**/*' - excludes: null
[TASKS] Found 50 files to scan for tasks
[TASKS] Found 4 open tasks.
Skipping warnings blame since pipelines do not have an SCM link.%n
[WS-CLEANUP] done
[Pipeline] }
[Pipeline] // stage
[Pipeline] }
[Pipeline] // ws
[Pipeline] }
[Pipeline] // node
[Pipeline] }
[withMaven] invokerPublisher - Archive invoker results for Maven artifact MavenArtifact{org.apache.maven.plugins:maven-dependency-plugin:maven-plugin:3.1.2-SNAPSHOT(version: 3.1.2-SNAPSHOT, snapshot:false) } generated by PluginInvocation{org.apache.maven.plugins:maven-invoker-plugin:3.1.0@integration-test  integration-test}: linux-jdk7-m3.5.x_build/target/invoker-reports/*.xml
[INFO]           collect/pom.xml .................................. SUCCESS (9.5 s)
[INFO] Building: build-classpath-output-file-and-property/pom.xml
[INFO] run post-build script verify.bsh
[INFO]           build-classpath-output-file-and-property/pom.xml . SUCCESS (12.0 s)
[INFO] Building: get-artifact-maven-plugin/pom.xml
[INFO] run pre-build script setup.bsh
[INFO] run post-build script verify.bsh
[INFO]           get-artifact-maven-plugin/pom.xml ................ SUCCESS (7.9 s)
[INFO] Building: analyze-ignore-used-undeclared-dependency/pom.xml
[INFO]           analyze-ignore-used-undeclared-dependency/pom.xml  SUCCESS (10.1 s)
[INFO] Building: tree-multimodule/pom.xml
[INFO] snapshot org.apache.maven.its.dependency:tree-multimodule-module-a:1.0-SNAPSHOT: checking for updates from Nexus
[INFO] artifact org.apache.maven.its.dependency.tree-multimodule-module-a:1.0-SNAPSHOT: checking for updates from central
[INFO] run post-build script verify.bsh
[INFO]           tree-multimodule/pom.xml ......................... SUCCESS (8.3 s)
[INFO] Building: copy-and-unpack-with-alternate-local-repo/pom.xml
[INFO] run post-build script verify.bsh
[INFO]           copy-and-unpack-with-alternate-local-repo/pom.xml  SUCCESS (9.7 s)
[INFO] Building: mdep-578_display-reason-invalid-module/pom.xml
[INFO]           mdep-578_display-reason-invalid-module/pom.xml ... SKIPPED due to JRE version
[INFO] Building: purge-local-repository-without-pom
[INFO] run pre-build script setup.bsh
[INFO] run post-build script verify.groovy
[INFO]           purge-local-repository-without-pom ............... SUCCESS (7.5 s)
[INFO]
[INFO] --- mrm-maven-plugin:1.2.0:stop (default) @ maven-dependency-plugin ---
[INFO] Stopping Mock Repository Manager on http://localhost:33531
[INFO] Stopped SocketConnector@0.0.0.0:33531
[INFO] Mock Repository Manager http://localhost:33531 is stopped.
[INFO]
[INFO] --- maven-checkstyle-plugin:3.0.0:check (checkstyle-check) @ maven-dependency-plugin ---
[withMaven] Publishers: Generated Artifacts Publisher: 1102 ms, Junit Publisher: 14718 ms, Open Task Scanner Publisher: 931 ms, Dependencies Fingerprint Publisher: 1 ms, Invoker Publisher: 60404 ms, Pipeline Graph Publisher: 1 ms
[Pipeline] // withMaven
[Pipeline] cleanWs
[WS-CLEANUP] Deleting project workspace...
[WS-CLEANUP] Deferred wipeout is used...
[WS-CLEANUP] done
[Pipeline] }
[Pipeline] // stage
[Pipeline] }
[Pipeline] // ws
[Pipeline] }
[Pipeline] // node
[Pipeline] }
[INFO] There is 1 error reported by Checkstyle 6.18 with config/maven_checks.xml ruleset.
[INFO] Ignored 1 error, 0 violation remaining.
[INFO]
[INFO] --- maven-invoker-plugin:3.1.0:verify (integration-test) @ maven-dependency-plugin ---
[INFO] -------------------------------------------------
[INFO] Build Summary:
[INFO]   Passed: 56, Failed: 0, Errors: 0, Skipped: 5
[INFO] -------------------------------------------------
[INFO] ------------------------------------------------------------------------
[INFO] BUILD SUCCESS
[INFO] ------------------------------------------------------------------------
[INFO] Total time: 11:17 min
[INFO] Finished at: 2019-10-28T21:38:22+00:00
[INFO] Final Memory: 53M/1397M
[INFO] ------------------------------------------------------------------------
[INFO] [jenkins-event-spy] Generated /home/jenkins/jenkins-slave/workspace/maven-dependency-plugin_MDEP-579@2@tmp/withMaven744319c4/maven-spy-20191028-212703-2925220567359337252860.log
[Pipeline] }
[Pipeline] // dir
[Pipeline] }
[withMaven] artifactsPublisher - Archive artifact linux-jdk7-m3.2.x_build/pom.xml under org/apache/maven/plugins/maven-dependency-plugin/3.1.2-SNAPSHOT/maven-dependency-plugin-3.1.2-SNAPSHOT.pom
[withMaven] artifactsPublisher - Archive artifact linux-jdk7-m3.2.x_build/target/maven-dependency-plugin-3.1.2-SNAPSHOT.jar under org/apache/maven/plugins/maven-dependency-plugin/3.1.2-SNAPSHOT/maven-dependency-plugin-3.1.2-SNAPSHOT.jar
[Fast Archiver] No prior successful build to compare, so performing full copy of artifacts
[withMaven] junitPublisher - Archive test results for Maven artifact org.apache.maven.plugins:maven-dependency-plugin:maven-plugin:3.1.2-SNAPSHOT generated by maven-surefire-plugin:test (default-test): linux-jdk7-m3.2.x_build/target/surefire-reports/*.xml
Recording test results
[withMaven] openTasksPublisher - Scan Tasks for Maven artifact org.apache.maven.plugins:maven-dependency-plugin:maven-plugin:3.1.2-SNAPSHOT in source directory linux-jdk7-m3.2.x_build/src/main/java
[TASKS] Scanning folder '/home/jenkins/jenkins-slave/workspace/maven-dependency-plugin_MDEP-579@2' for files matching the pattern 'linux-jdk7-m3.2.x_build/src/main/java/**/*' - excludes: null
[TASKS] Found 50 files to scan for tasks
[TASKS] Found 4 open tasks.
Skipping warnings blame since pipelines do not have an SCM link.%n
[withMaven] invokerPublisher - Archive invoker results for Maven artifact MavenArtifact{org.apache.maven.plugins:maven-dependency-plugin:maven-plugin:3.1.2-SNAPSHOT(version: 3.1.2-SNAPSHOT, snapshot:false) } generated by PluginInvocation{org.apache.maven.plugins:maven-invoker-plugin:3.1.0@integration-test  integration-test}: linux-jdk7-m3.2.x_build/target/invoker-reports/*.xml
[withMaven] Publishers: Generated Artifacts Publisher: 4468 ms, Junit Publisher: 31170 ms, Open Task Scanner Publisher: 5465 ms, Invoker Publisher: 62570 ms, Pipeline Graph Publisher: 1 ms
[Pipeline] // withMaven
[Pipeline] cleanWs
[WS-CLEANUP] Deleting project workspace...
[WS-CLEANUP] Deferred wipeout is used...
[WS-CLEANUP] done
[Pipeline] }
[Pipeline] // stage
[Pipeline] }
[Pipeline] // ws
[Pipeline] }
[Pipeline] // node
[Pipeline] }
[INFO] run post-build script verify.bsh
[INFO]           purge-local-repository-version-range\pom.xml ..... SUCCESS (905.1 s)
[INFO] Building: resolve\pom.xml
[INFO]           resolve\pom.xml .................................. SUCCESS (4.2 s)
[INFO] Building: resolve-plugins\pom.xml
[INFO]           resolve-plugins\pom.xml .......................... SUCCESS (4.1 s)
[INFO] Building: resolve-plugins-exclude-reactor\pom.xml
[INFO] run post-build script verify.groovy
[INFO]           resolve-plugins-exclude-reactor\pom.xml .......... SUCCESS (7.0 s)
[INFO] Building: resolve-plugins-with-exclude\pom.xml
[INFO] run post-build script verify.groovy
[INFO]           resolve-plugins-with-exclude\pom.xml ............. SUCCESS (4.5 s)
[INFO] Building: sources\pom.xml
[INFO] artifact classworlds.classworlds:1.1-alpha-2: checking for updates from central
[INFO]           sources\pom.xml .................................. SUCCESS (5.4 s)
[INFO] Building: tree\pom.xml
[INFO]           tree\pom.xml ..................................... SKIPPED due to Maven version
[INFO] Building: tree-includes\pom.xml
[INFO] run post-build script verify.bsh
[INFO]           tree-includes\pom.xml ............................ SUCCESS (3.8 s)
[INFO] Building: tree-multimodule\pom.xml
[INFO] snapshot org.apache.maven.its.dependency:tree-multimodule-module-a:1.0-SNAPSHOT: checking for updates from apache-snapshots
[INFO] snapshot org.apache.maven.its.dependency:tree-multimodule-module-a:1.0-SNAPSHOT: checking for updates from Nexus
[INFO] artifact org.apache.maven.its.dependency.tree-multimodule-module-a:1.0-SNAPSHOT: checking for updates from central
[INFO] run post-build script verify.bsh
[INFO]           tree-multimodule\pom.xml ......................... SUCCESS (5.2 s)
[INFO] Building: unpack\pom.xml
[INFO] run post-build script verify.bsh
[INFO]           unpack\pom.xml ................................... SUCCESS (6.0 s)
[INFO] Building: unpack-cli\pom.xml
[INFO] run post-build script verify.bsh
[INFO]           unpack-cli\pom.xml ............................... SUCCESS (4.2 s)
[INFO] Building: unpack-custom-ear\pom.xml
[INFO] run post-build script verify.groovy
[INFO]           unpack-custom-ear\pom.xml ........................ SUCCESS (4.3 s)
[INFO] Building: unpack-dependencies\pom.xml
[INFO] run post-build script verify.groovy
[INFO]           unpack-dependencies\pom.xml ...................... SUCCESS (6.4 s)
[INFO] Building: unpack-dependencies-with-filemappers\pom.xml
[INFO] run post-build script verify.groovy
[INFO]           unpack-dependencies-with-filemappers\pom.xml ..... SUCCESS (7.1 s)
[INFO] Building: unpack-from-remote-repository\pom.xml
[INFO] run pre-build script setup.bsh
[INFO] artifact org.apache.maven.its.dependency.fake-remote-unpack:1.0: checking for updates from central
[INFO] run post-build script verify.bsh
[INFO]           unpack-from-remote-repository\pom.xml ............ SUCCESS (4.9 s)
[INFO] Building: used-dependencies\pom.xml
[INFO]           used-dependencies\pom.xml ........................ SUCCESS (4.7 s)
[INFO] Building: purge-local-repository-without-pom
[INFO] run pre-build script setup.bsh
[INFO] run post-build script verify.groovy
[INFO]           purge-local-repository-without-pom ............... SUCCESS (3.6 s)
[INFO]
[INFO] --- mrm-maven-plugin:1.2.0:stop (default) @ maven-dependency-plugin ---
[INFO] Stopping Mock Repository Manager on http://localhost:53510
[INFO] Stopped SocketConnector@0.0.0.0:53510
[INFO] Mock Repository Manager http://localhost:53510 is stopped.
[INFO]
[INFO] --- maven-checkstyle-plugin:3.0.0:check (checkstyle-check) @ maven-dependency-plugin ---
[INFO] There is 1 error reported by Checkstyle 6.18 with config/maven_checks.xml ruleset.
[INFO] Ignored 1 error, 0 violation remaining.
[INFO]
[INFO] --- maven-invoker-plugin:3.1.0:verify (integration-test) @ maven-dependency-plugin ---
[INFO] -------------------------------------------------
[INFO] Build Summary:
[INFO]   Passed: 55, Failed: 0, Errors: 0, Skipped: 6
[INFO] -------------------------------------------------
[INFO] ------------------------------------------------------------------------
[INFO] BUILD SUCCESS
[INFO] ------------------------------------------------------------------------
[INFO] Total time: 21:59 min
[INFO] Finished at: 2019-10-28T14:48:34-07:00
[INFO] Final Memory: 62M/801M
[INFO] ------------------------------------------------------------------------
[INFO] [jenkins-event-spy] Generated F:\jenkins\jenkins-slave\workspace\maven-dependency-plugin_MDEP-579@3@tmp\withMavenc2d58d73\maven-spy-20191028-142633-9952139751116049376068.log
Picked up JAVA_TOOL_OPTIONS: -Dmaven.ext.class.path="f:\jenkins\jenkins-slave\workspace\maven-dependency-plugin_MDEP-579@3@tmp\withMavenc2d58d73\pipeline-maven-spy.jar" -Dorg.jenkinsci.plugins.pipeline.maven.reportsFolder="f:\jenkins\jenkins-slave\workspace\maven-dependency-plugin_MDEP-579@3@tmp\withMavenc2d58d73"
[Pipeline] }
[Pipeline] // dir
[Pipeline] }
[withMaven] artifactsPublisher - Archive artifact windows-jdk7-m3.5.x_build\pom.xml under org\apache\maven\plugins\maven-dependency-plugin\3.1.2-SNAPSHOT\maven-dependency-plugin-3.1.2-SNAPSHOT.pom
[withMaven] artifactsPublisher - Archive artifact windows-jdk7-m3.5.x_build\target\maven-dependency-plugin-3.1.2-SNAPSHOT.jar under org\apache\maven\plugins\maven-dependency-plugin\3.1.2-SNAPSHOT\maven-dependency-plugin-3.1.2-SNAPSHOT.jar
[Fast Archiver] No prior successful build to compare, so performing full copy of artifacts
[withMaven] junitPublisher - Archive test results for Maven artifact org.apache.maven.plugins:maven-dependency-plugin:maven-plugin:3.1.2-SNAPSHOT generated by maven-surefire-plugin:test (default-test): windows-jdk7-m3.5.x_build\target\surefire-reports\*.xml
Recording test results
[withMaven] openTasksPublisher - Scan Tasks for Maven artifact org.apache.maven.plugins:maven-dependency-plugin:maven-plugin:3.1.2-SNAPSHOT in source directory windows-jdk7-m3.5.x_build\src\main\java
[TASKS] Scanning folder 'f:\jenkins\jenkins-slave\workspace\maven-dependency-plugin_MDEP-579@3' for files matching the pattern 'windows-jdk7-m3.5.x_build\src\main\java\**\*' - excludes: null
[TASKS] Found 50 files to scan for tasks
[TASKS] Found 4 open tasks.
Skipping warnings blame since pipelines do not have an SCM link.%n
[withMaven] invokerPublisher - Archive invoker results for Maven artifact MavenArtifact{org.apache.maven.plugins:maven-dependency-plugin:maven-plugin:3.1.2-SNAPSHOT(version: 3.1.2-SNAPSHOT, snapshot:false) } generated by PluginInvocation{org.apache.maven.plugins:maven-invoker-plugin:3.1.0@integration-test  integration-test}: windows-jdk7-m3.5.x_build\target\invoker-reports\*.xml
[withMaven] Publishers: Generated Artifacts Publisher: 71 ms, Junit Publisher: 767 ms, Open Task Scanner Publisher: 112 ms, Invoker Publisher: 20346 ms, Pipeline Graph Publisher: 2 ms
[Pipeline] // withMaven
[Pipeline] cleanWs
[WS-CLEANUP] Deleting project workspace...
[WS-CLEANUP] Deferred wipeout is used...
[WS-CLEANUP] done
[Pipeline] }
[Pipeline] // stage
[Pipeline] }
[Pipeline] // ws
[Pipeline] }
[Pipeline] // node
[Pipeline] }
[Pipeline] // parallel
[Pipeline] stage
[Pipeline] { (Notifications)
[Pipeline] echo
Build result: FAILURE
[Pipeline] jiraIssueSelector
[Pipeline] echo
The authors of changes [].
[Pipeline] echo
Sending email ...
[Pipeline] emailext
Reply | Threaded
Open this post in threaded view
|

Build failed in Jenkins: Maven TLP » maven-dependency-plugin » MDEP-579 #3

Apache Jenkins Server-2
See https://builds.apache.org/job/maven-box/job/maven-dependency-plugin/job/MDEP-579/3/

No changes.

All tests passed

Build log:
[...truncated 7402 lines...]
[WS-CLEANUP] done
[Pipeline] }
[Pipeline] // stage
[Pipeline] }
[Pipeline] // ws
[Pipeline] }
[Pipeline] // node
[Pipeline] }
[withMaven] Publishers: Generated Artifacts Publisher: 358 ms, Junit Publisher: 1838 ms, Open Task Scanner Publisher: 154 ms, Dependencies Fingerprint Publisher: 1 ms, Invoker Publisher: 23230 ms, Pipeline Graph Publisher: 1 ms
[Pipeline] // withMaven
[Pipeline] cleanWs
[WS-CLEANUP] Deleting project workspace...
[WS-CLEANUP] Deferred wipeout is used...
[WS-CLEANUP] done
[Pipeline] }
[Pipeline] // stage
[Pipeline] }
[Pipeline] // ws
[Pipeline] }
[Pipeline] // node
[Pipeline] }
[INFO]           used-dependencies\pom.xml ........................ SUCCESS (7.3 s)
[INFO] Building: purge-local-repository-without-pom
[INFO] run pre-build script setup.bsh
[INFO] There is 1 error reported by Checkstyle 6.18 with config/maven_checks.xml ruleset.
[INFO] Ignored 1 error, 0 violation remaining.
[INFO]
[INFO] --- maven-invoker-plugin:3.1.0:verify (integration-test) @ maven-dependency-plugin ---
[INFO] -------------------------------------------------
[INFO] Build Summary:
[INFO]   Passed: 60, Failed: 0, Errors: 0, Skipped: 1
[INFO] -------------------------------------------------
[INFO] ------------------------------------------------------------------------
[INFO] BUILD SUCCESS
[INFO] ------------------------------------------------------------------------
[INFO] Total time:  06:02 min
[INFO] Finished at: 2019-10-28T22:29:09Z
[INFO] ------------------------------------------------------------------------
[INFO] [jenkins-event-spy] Generated /home/jenkins/jenkins-slave/workspace/maven-dependency-plugin_MDEP-579@2@tmp/withMaven052c9d26/maven-spy-20191028-222307-7423443484520670694317.log
[Pipeline] }
[Pipeline] // dir
[Pipeline] }
[withMaven] artifactsPublisher - Archive artifact linux-jdk11-m3.6.x_build/pom.xml under org/apache/maven/plugins/maven-dependency-plugin/3.1.2-SNAPSHOT/maven-dependency-plugin-3.1.2-SNAPSHOT.pom
[withMaven] artifactsPublisher - Archive artifact linux-jdk11-m3.6.x_build/target/maven-dependency-plugin-3.1.2-SNAPSHOT.jar under org/apache/maven/plugins/maven-dependency-plugin/3.1.2-SNAPSHOT/maven-dependency-plugin-3.1.2-SNAPSHOT.jar
[Fast Archiver] No prior successful build to compare, so performing full copy of artifacts
[withMaven] junitPublisher - Archive test results for Maven artifact org.apache.maven.plugins:maven-dependency-plugin:maven-plugin:3.1.2-SNAPSHOT generated by maven-surefire-plugin:test (default-test): linux-jdk11-m3.6.x_build/target/surefire-reports/*.xml
Recording test results
[INFO] run post-build script verify.groovy
[INFO]           purge-local-repository-without-pom ............... SUCCESS (5.1 s)
[INFO]
[INFO] --- mrm-maven-plugin:1.2.0:stop (default) @ maven-dependency-plugin ---
[INFO] Stopping Mock Repository Manager on http://localhost:58663
[INFO] Stopped SocketConnector@0.0.0.0:58663
[INFO] Mock Repository Manager http://localhost:58663 is stopped.
[INFO]
[INFO] --- maven-checkstyle-plugin:3.0.0:check (checkstyle-check) @ maven-dependency-plugin ---
[INFO] There is 1 error reported by Checkstyle 6.18 with config/maven_checks.xml ruleset.
[INFO] Ignored 1 error, 0 violation remaining.
[INFO]
[INFO] --- maven-invoker-plugin:3.1.0:verify (integration-test) @ maven-dependency-plugin ---
[INFO] -------------------------------------------------
[INFO] Build Summary:
[INFO]   Passed: 60, Failed: 0, Errors: 0, Skipped: 1
[INFO] -------------------------------------------------
[INFO] ------------------------------------------------------------------------
[INFO] BUILD SUCCESS
[INFO] ------------------------------------------------------------------------
[INFO] Total time:  08:30 min
[INFO] Finished at: 2019-10-28T15:29:16-07:00
[INFO] ------------------------------------------------------------------------
[INFO] [jenkins-event-spy] Generated F:\jenkins\jenkins-slave\workspace\maven-dependency-plugin_MDEP-579@2@tmp\withMaven39d9d310\maven-spy-20191028-152046-758944456175436209452.log
[Pipeline] }
[Pipeline] // dir
[Pipeline] }
[withMaven] artifactsPublisher - Archive artifact windows-jdk13-m3.6.x_build\pom.xml under org\apache\maven\plugins\maven-dependency-plugin\3.1.2-SNAPSHOT\maven-dependency-plugin-3.1.2-SNAPSHOT.pom
[withMaven] artifactsPublisher - Archive artifact windows-jdk13-m3.6.x_build\target\maven-dependency-plugin-3.1.2-SNAPSHOT.jar under org\apache\maven\plugins\maven-dependency-plugin\3.1.2-SNAPSHOT\maven-dependency-plugin-3.1.2-SNAPSHOT.jar
[Fast Archiver] No prior successful build to compare, so performing full copy of artifacts
[withMaven] junitPublisher - Archive test results for Maven artifact org.apache.maven.plugins:maven-dependency-plugin:maven-plugin:3.1.2-SNAPSHOT generated by maven-surefire-plugin:test (default-test): windows-jdk13-m3.6.x_build\target\surefire-reports\*.xml
Recording test results
[withMaven] openTasksPublisher - Scan Tasks for Maven artifact org.apache.maven.plugins:maven-dependency-plugin:maven-plugin:3.1.2-SNAPSHOT in source directory linux-jdk11-m3.6.x_build/src/main/java
[TASKS] Scanning folder '/home/jenkins/jenkins-slave/workspace/maven-dependency-plugin_MDEP-579@2' for files matching the pattern 'linux-jdk11-m3.6.x_build/src/main/java/**/*' - excludes: null
[TASKS] Found 50 files to scan for tasks
[TASKS] Found 4 open tasks.
Skipping warnings blame since pipelines do not have an SCM link.%n
[withMaven] openTasksPublisher - Scan Tasks for Maven artifact org.apache.maven.plugins:maven-dependency-plugin:maven-plugin:3.1.2-SNAPSHOT in source directory windows-jdk13-m3.6.x_build\src\main\java
[TASKS] Scanning folder 'f:\jenkins\jenkins-slave\workspace\maven-dependency-plugin_MDEP-579@2' for files matching the pattern 'windows-jdk13-m3.6.x_build\src\main\java\**\*' - excludes: null
[TASKS] Found 50 files to scan for tasks
[TASKS] Found 4 open tasks.
Skipping warnings blame since pipelines do not have an SCM link.%n
[withMaven] invokerPublisher - Archive invoker results for Maven artifact MavenArtifact{org.apache.maven.plugins:maven-dependency-plugin:maven-plugin:3.1.2-SNAPSHOT(version: 3.1.2-SNAPSHOT, snapshot:false) } generated by PluginInvocation{org.apache.maven.plugins:maven-invoker-plugin:3.1.0@integration-test  integration-test}: windows-jdk13-m3.6.x_build\target\invoker-reports\*.xml
[withMaven] invokerPublisher - Archive invoker results for Maven artifact MavenArtifact{org.apache.maven.plugins:maven-dependency-plugin:maven-plugin:3.1.2-SNAPSHOT(version: 3.1.2-SNAPSHOT, snapshot:false) } generated by PluginInvocation{org.apache.maven.plugins:maven-invoker-plugin:3.1.0@integration-test  integration-test}: linux-jdk11-m3.6.x_build/target/invoker-reports/*.xml
[withMaven] Publishers: Generated Artifacts Publisher: 51 ms, Junit Publisher: 588 ms, Open Task Scanner Publisher: 85 ms, Invoker Publisher: 20261 ms, Pipeline Graph Publisher: 1 ms
[Pipeline] // withMaven
[Pipeline] cleanWs
[WS-CLEANUP] Deleting project workspace...
[WS-CLEANUP] Deferred wipeout is used...
[WS-CLEANUP] done
[Pipeline] }
[Pipeline] // stage
[Pipeline] }
[Pipeline] // ws
[Pipeline] }
[Pipeline] // node
[Pipeline] }
[withMaven] Publishers: Generated Artifacts Publisher: 1094 ms, Junit Publisher: 20522 ms, Open Task Scanner Publisher: 1150 ms, Dependencies Fingerprint Publisher: 1 ms, Invoker Publisher: 55890 ms, Pipeline Graph Publisher: 2 ms
[Pipeline] // withMaven
[Pipeline] cleanWs
[WS-CLEANUP] Deleting project workspace...
[WS-CLEANUP] Deferred wipeout is used...
[WS-CLEANUP] done
[Pipeline] }
[Pipeline] // stage
[Pipeline] }
[Pipeline] // ws
[Pipeline] }
[Pipeline] // node
[Pipeline] }
[INFO] run post-build script verify.bsh
[INFO]           purge-local-repository-version-range\pom.xml ..... SUCCESS (904.4 s)
[INFO] Building: resolve\pom.xml
[INFO]           resolve\pom.xml .................................. SUCCESS (4.5 s)
[INFO] Building: resolve-plugins\pom.xml
[INFO]           resolve-plugins\pom.xml .......................... SUCCESS (4.9 s)
[INFO] Building: resolve-plugins-exclude-reactor\pom.xml
[INFO] run post-build script verify.groovy
[INFO]           resolve-plugins-exclude-reactor\pom.xml .......... SUCCESS (7.0 s)
[INFO] Building: resolve-plugins-with-exclude\pom.xml
[INFO] run post-build script verify.groovy
[INFO]           resolve-plugins-with-exclude\pom.xml ............. SUCCESS (4.1 s)
[INFO] Building: sources\pom.xml
[INFO]           sources\pom.xml .................................. SUCCESS (5.4 s)
[INFO] Building: tree\pom.xml
[INFO]           tree\pom.xml ..................................... SKIPPED due to Maven version
[INFO] Building: tree-includes\pom.xml
[INFO] run post-build script verify.bsh
[INFO]           tree-includes\pom.xml ............................ SUCCESS (3.5 s)
[INFO] Building: tree-multimodule\pom.xml
[INFO] run post-build script verify.bsh
[INFO]           tree-multimodule\pom.xml ......................... SUCCESS (4.8 s)
[INFO] Building: unpack\pom.xml
[INFO] run post-build script verify.bsh
[INFO]           unpack\pom.xml ................................... SUCCESS (5.5 s)
[INFO] Building: unpack-cli\pom.xml
[INFO] run post-build script verify.bsh
[INFO]           unpack-cli\pom.xml ............................... SUCCESS (4.3 s)
[INFO] Building: unpack-custom-ear\pom.xml
[INFO] run post-build script verify.groovy
[INFO]           unpack-custom-ear\pom.xml ........................ SUCCESS (4.2 s)
[INFO] Building: unpack-dependencies\pom.xml
[INFO] run post-build script verify.groovy
[INFO]           unpack-dependencies\pom.xml ...................... SUCCESS (7.0 s)
[INFO] Building: unpack-dependencies-with-filemappers\pom.xml
[INFO] run post-build script verify.groovy
[INFO]           unpack-dependencies-with-filemappers\pom.xml ..... SUCCESS (6.3 s)
[INFO] Building: unpack-from-remote-repository\pom.xml
[INFO] run pre-build script setup.bsh
[INFO] run post-build script verify.bsh
[INFO]           unpack-from-remote-repository\pom.xml ............ SUCCESS (4.7 s)
[INFO] Building: used-dependencies\pom.xml
[INFO]           used-dependencies\pom.xml ........................ SUCCESS (4.7 s)
[INFO] Building: purge-local-repository-without-pom
[INFO] run pre-build script setup.bsh
[INFO] run post-build script verify.groovy
[INFO]           purge-local-repository-without-pom ............... SUCCESS (3.8 s)
[INFO]
[INFO] --- mrm-maven-plugin:1.2.0:stop (default) @ maven-dependency-plugin ---
[INFO] Stopping Mock Repository Manager on http://localhost:55901
[INFO] Stopped SocketConnector@0.0.0.0:55901
[INFO] Mock Repository Manager http://localhost:55901 is stopped.
[INFO]
[INFO] --- maven-checkstyle-plugin:3.0.0:check (checkstyle-check) @ maven-dependency-plugin ---
[INFO] There is 1 error reported by Checkstyle 6.18 with config/maven_checks.xml ruleset.
[INFO] Ignored 1 error, 0 violation remaining.
[INFO]
[INFO] --- maven-invoker-plugin:3.1.0:verify (integration-test) @ maven-dependency-plugin ---
[INFO] -------------------------------------------------
[INFO] Build Summary:
[INFO]   Passed: 55, Failed: 0, Errors: 0, Skipped: 6
[INFO] -------------------------------------------------
[INFO] ------------------------------------------------------------------------
[INFO] BUILD SUCCESS
[INFO] ------------------------------------------------------------------------
[INFO] Total time: 21:54 min
[INFO] Finished at: 2019-10-28T15:42:39-07:00
[INFO] Final Memory: 80M/1476M
[INFO] ------------------------------------------------------------------------
[INFO] [jenkins-event-spy] Generated F:\jenkins\jenkins-slave\workspace\maven-dependency-plugin_MDEP-579@3@tmp\withMaven5b535ce2\maven-spy-20191028-152044-680122875529738955266.log
Picked up JAVA_TOOL_OPTIONS: -Dmaven.ext.class.path="f:\jenkins\jenkins-slave\workspace\maven-dependency-plugin_MDEP-579@3@tmp\withMaven5b535ce2\pipeline-maven-spy.jar" -Dorg.jenkinsci.plugins.pipeline.maven.reportsFolder="f:\jenkins\jenkins-slave\workspace\maven-dependency-plugin_MDEP-579@3@tmp\withMaven5b535ce2"
[Pipeline] }
[Pipeline] // dir
[Pipeline] }
[withMaven] artifactsPublisher - Archive artifact windows-jdk7-m3.5.x_build\pom.xml under org\apache\maven\plugins\maven-dependency-plugin\3.1.2-SNAPSHOT\maven-dependency-plugin-3.1.2-SNAPSHOT.pom
[withMaven] artifactsPublisher - Archive artifact windows-jdk7-m3.5.x_build\target\maven-dependency-plugin-3.1.2-SNAPSHOT.jar under org\apache\maven\plugins\maven-dependency-plugin\3.1.2-SNAPSHOT\maven-dependency-plugin-3.1.2-SNAPSHOT.jar
[Fast Archiver] No prior successful build to compare, so performing full copy of artifacts
[withMaven] junitPublisher - Archive test results for Maven artifact org.apache.maven.plugins:maven-dependency-plugin:maven-plugin:3.1.2-SNAPSHOT generated by maven-surefire-plugin:test (default-test): windows-jdk7-m3.5.x_build\target\surefire-reports\*.xml
Recording test results
[withMaven] openTasksPublisher - Scan Tasks for Maven artifact org.apache.maven.plugins:maven-dependency-plugin:maven-plugin:3.1.2-SNAPSHOT in source directory windows-jdk7-m3.5.x_build\src\main\java
[TASKS] Scanning folder 'f:\jenkins\jenkins-slave\workspace\maven-dependency-plugin_MDEP-579@3' for files matching the pattern 'windows-jdk7-m3.5.x_build\src\main\java\**\*' - excludes: null
[TASKS] Found 50 files to scan for tasks
[TASKS] Found 4 open tasks.
Skipping warnings blame since pipelines do not have an SCM link.%n
[withMaven] invokerPublisher - Archive invoker results for Maven artifact MavenArtifact{org.apache.maven.plugins:maven-dependency-plugin:maven-plugin:3.1.2-SNAPSHOT(version: 3.1.2-SNAPSHOT, snapshot:false) } generated by PluginInvocation{org.apache.maven.plugins:maven-invoker-plugin:3.1.0@integration-test  integration-test}: windows-jdk7-m3.5.x_build\target\invoker-reports\*.xml
[withMaven] Publishers: Generated Artifacts Publisher: 75 ms, Junit Publisher: 742 ms, Open Task Scanner Publisher: 132 ms, Dependencies Fingerprint Publisher: 1 ms, Invoker Publisher: 20811 ms, Pipeline Graph Publisher: 2 ms
[Pipeline] // withMaven
[Pipeline] cleanWs
[WS-CLEANUP] Deleting project workspace...
[WS-CLEANUP] Deferred wipeout is used...
[WS-CLEANUP] done
[Pipeline] }
[Pipeline] // stage
[Pipeline] }
[Pipeline] // ws
[Pipeline] }
[Pipeline] // node
[Pipeline] }
Cannot contact H42: hudson.remoting.ChannelClosedException: Channel "unknown": Remote call on H42 failed. The channel is closing down or has closed down
wrapper script does not seem to be touching the log file in /home/jenkins/jenkins-slave/workspace/maven-dependency-plugin_MDEP-579@3@2/linux-jdk7-m3.3.x_build@tmp/durable-2cb51795
(JENKINS-48300: if on an extremely laggy filesystem, consider -Dorg.jenkinsci.plugins.durabletask.BourneShellScript.HEARTBEAT_CHECK_INTERVAL=86400)
[Pipeline] }
[Pipeline] // dir
[Pipeline] }
[Pipeline] // withMaven
[Pipeline] cleanWs
[WS-CLEANUP] Deleting project workspace...
[WS-CLEANUP] Deferred wipeout is used...
[WS-CLEANUP] done
[Pipeline] cleanWs
[WS-CLEANUP] Deleting project workspace...
[WS-CLEANUP] Deferred wipeout is used...
[WS-CLEANUP] done
[Pipeline] }
[Pipeline] // stage
[Pipeline] }
[Pipeline] // ws
[Pipeline] }
[Pipeline] // node
[Pipeline] }
Failed in branch linux-jdk7-m3.3.x_build
[Pipeline] // parallel
[Pipeline] stage
[Pipeline] { (Notifications)
[Pipeline] echo
Build result: FAILURE
[Pipeline] jiraIssueSelector
[Pipeline] echo
The authors of changes [].
[Pipeline] echo
Sending email ...
[Pipeline] emailext
Reply | Threaded
Open this post in threaded view
|

Build succeeded in Jenkins: Maven TLP » maven-dependency-plugin » MDEP-579 #4

Apache Jenkins Server-2