Build failed in Jenkins: Maven TLP » maven-dependency-analyzer » MSHARED-674_Detect_Java_8_type_annotations #24

classic Classic list List threaded Threaded
3 messages Options
Reply | Threaded
Open this post in threaded view
|

Build failed in Jenkins: Maven TLP » maven-dependency-analyzer » MSHARED-674_Detect_Java_8_type_annotations #24

Apache Jenkins Server-2
See https://builds.apache.org/job/maven-box/job/maven-dependency-analyzer/job/MSHARED-674_Detect_Java_8_type_annotations/24/

Changes:

* Use Maven 3.6.3 for Linux builds, it should already be on all nodes
* Use Java 8 for Java 7 builds - due to the temporary removal of Java 7
* JDK 1.7.0_80 added back in

34 tests failed.
FAILED:  org.apache.maven.shared.dependency.analyzer.DefaultProjectDependencyAnalyzerTest.linux-jdk11 / Build linux-jdk11 / testJarWithXmlTransitiveDependency

Error Message:
null

Stack Trace:
java.lang.NullPointerException: null
        at org.apache.commons.lang3.SystemUtils.isJavaVersionAtLeast(SystemUtils.java:1626)
        at org.apache.maven.shared.dependency.analyzer.DefaultProjectDependencyAnalyzerTest.compileProject(DefaultProjectDependencyAnalyzerTest.java:342)
        at org.apache.maven.shared.dependency.analyzer.DefaultProjectDependencyAnalyzerTest.compileProject(DefaultProjectDependencyAnalyzerTest.java:337)
        at org.apache.maven.shared.dependency.analyzer.DefaultProjectDependencyAnalyzerTest.testJarWithXmlTransitiveDependency(DefaultProjectDependencyAnalyzerTest.java:262)


FAILED:  org.apache.maven.shared.dependency.analyzer.DefaultProjectDependencyAnalyzerTest.linux-jdk11 / Build linux-jdk11 / testJarWithNoDependencies

Error Message:
null

Stack Trace:
java.lang.NullPointerException: null
        at org.apache.commons.lang3.SystemUtils.isJavaVersionAtLeast(SystemUtils.java:1626)
        at org.apache.maven.shared.dependency.analyzer.DefaultProjectDependencyAnalyzerTest.compileProject(DefaultProjectDependencyAnalyzerTest.java:342)
        at org.apache.maven.shared.dependency.analyzer.DefaultProjectDependencyAnalyzerTest.compileProject(DefaultProjectDependencyAnalyzerTest.java:337)
        at org.apache.maven.shared.dependency.analyzer.DefaultProjectDependencyAnalyzerTest.testJarWithNoDependencies(DefaultProjectDependencyAnalyzerTest.java:111)


FAILED:  org.apache.maven.shared.dependency.analyzer.DefaultProjectDependencyAnalyzerTest.linux-jdk11 / Build linux-jdk11 / testPom

Error Message:
null

Stack Trace:
java.lang.NullPointerException: null
        at org.apache.commons.lang3.SystemUtils.isJavaVersionAtLeast(SystemUtils.java:1626)
        at org.apache.maven.shared.dependency.analyzer.DefaultProjectDependencyAnalyzerTest.compileProject(DefaultProjectDependencyAnalyzerTest.java:342)
        at org.apache.maven.shared.dependency.analyzer.DefaultProjectDependencyAnalyzerTest.compileProject(DefaultProjectDependencyAnalyzerTest.java:337)
        at org.apache.maven.shared.dependency.analyzer.DefaultProjectDependencyAnalyzerTest.testPom(DefaultProjectDependencyAnalyzerTest.java:97)


FAILED:  org.apache.maven.shared.dependency.analyzer.DefaultProjectDependencyAnalyzerTest.linux-jdk11 / Build linux-jdk11 / testForceDeclaredDependenciesUsage

Error Message:
null

Stack Trace:
java.lang.NullPointerException: null
        at org.apache.commons.lang3.SystemUtils.isJavaVersionAtLeast(SystemUtils.java:1626)
        at org.apache.maven.shared.dependency.analyzer.DefaultProjectDependencyAnalyzerTest.compileProject(DefaultProjectDependencyAnalyzerTest.java:342)
        at org.apache.maven.shared.dependency.analyzer.DefaultProjectDependencyAnalyzerTest.compileProject(DefaultProjectDependencyAnalyzerTest.java:337)
        at org.apache.maven.shared.dependency.analyzer.DefaultProjectDependencyAnalyzerTest.testForceDeclaredDependenciesUsage(DefaultProjectDependencyAnalyzerTest.java:198)


FAILED:  org.apache.maven.shared.dependency.analyzer.DefaultProjectDependencyAnalyzerTest.linux-jdk11 / Build linux-jdk11 / testJarWithTestDependency

Error Message:
null

Stack Trace:
java.lang.NullPointerException: null
        at org.apache.commons.lang3.SystemUtils.isJavaVersionAtLeast(SystemUtils.java:1626)
        at org.apache.maven.shared.dependency.analyzer.DefaultProjectDependencyAnalyzerTest.compileProject(DefaultProjectDependencyAnalyzerTest.java:342)
        at org.apache.maven.shared.dependency.analyzer.DefaultProjectDependencyAnalyzerTest.compileProject(DefaultProjectDependencyAnalyzerTest.java:337)
        at org.apache.maven.shared.dependency.analyzer.DefaultProjectDependencyAnalyzerTest.testJarWithTestDependency(DefaultProjectDependencyAnalyzerTest.java:232)


FAILED:  org.apache.maven.shared.dependency.analyzer.DefaultProjectDependencyAnalyzerTest.linux-jdk11 / Build linux-jdk11 / testJarWithCompileDependency

Error Message:
null

Stack Trace:
java.lang.NullPointerException: null
        at org.apache.commons.lang3.SystemUtils.isJavaVersionAtLeast(SystemUtils.java:1626)
        at org.apache.maven.shared.dependency.analyzer.DefaultProjectDependencyAnalyzerTest.compileProject(DefaultProjectDependencyAnalyzerTest.java:342)
        at org.apache.maven.shared.dependency.analyzer.DefaultProjectDependencyAnalyzerTest.compileProject(DefaultProjectDependencyAnalyzerTest.java:337)
        at org.apache.maven.shared.dependency.analyzer.DefaultProjectDependencyAnalyzerTest.testJarWithCompileDependency(DefaultProjectDependencyAnalyzerTest.java:174)


FAILED:  org.apache.maven.shared.dependency.analyzer.DefaultProjectDependencyAnalyzerTest.linux-jdk11 / Build linux-jdk11 / testJava8methodRefs

Error Message:
null

Stack Trace:
java.lang.NullPointerException: null
        at org.apache.commons.lang3.SystemUtils.isJavaVersionAtLeast(SystemUtils.java:1626)
        at org.apache.maven.shared.dependency.analyzer.DefaultProjectDependencyAnalyzerTest.testJava8methodRefs(DefaultProjectDependencyAnalyzerTest.java:125)


FAILED:  org.apache.maven.shared.dependency.analyzer.DefaultProjectDependencyAnalyzerTest.linux-jdk11 / Build linux-jdk11 / testInlinedStaticReference

Error Message:
null

Stack Trace:
java.lang.NullPointerException: null
        at org.apache.commons.lang3.SystemUtils.isJavaVersionAtLeast(SystemUtils.java:1626)
        at org.apache.maven.shared.dependency.analyzer.DefaultProjectDependencyAnalyzerTest.testInlinedStaticReference(DefaultProjectDependencyAnalyzerTest.java:150)


FAILED:  org.apache.maven.shared.dependency.analyzer.DefaultProjectDependencyAnalyzerTest.linux-jdk11 / Build linux-jdk11 / testTypeUseAnnotationDependency

Error Message:
null

Stack Trace:
java.lang.NullPointerException: null
        at org.apache.commons.lang3.SystemUtils.isJavaVersionAtLeast(SystemUtils.java:1626)
        at org.apache.maven.shared.dependency.analyzer.DefaultProjectDependencyAnalyzerTest.testTypeUseAnnotationDependency(DefaultProjectDependencyAnalyzerTest.java:310)


FAILED:  org.apache.maven.shared.dependency.analyzer.DefaultProjectDependencyAnalyzerTest.linux-jdk11 / Build linux-jdk11 / testMultimoduleProject

Error Message:
null

Stack Trace:
java.lang.NullPointerException: null
        at org.apache.commons.lang3.SystemUtils.isJavaVersionAtLeast(SystemUtils.java:1626)
        at org.apache.maven.shared.dependency.analyzer.DefaultProjectDependencyAnalyzerTest.compileProject(DefaultProjectDependencyAnalyzerTest.java:342)
        at org.apache.maven.shared.dependency.analyzer.DefaultProjectDependencyAnalyzerTest.compileProject(DefaultProjectDependencyAnalyzerTest.java:337)
        at org.apache.maven.shared.dependency.analyzer.DefaultProjectDependencyAnalyzerTest.testMultimoduleProject(DefaultProjectDependencyAnalyzerTest.java:280)


FAILED:  org.apache.maven.shared.dependency.analyzer.DefaultProjectDependencyAnalyzerTest.linux-jdk7 / Build linux-jdk7 / testJarWithXmlTransitiveDependency

Error Message:
Error compiling test project expected:<0> but was:<1>

Stack Trace:
junit.framework.AssertionFailedError: Error compiling test project expected:<0> but was:<1>
        at junit.framework.Assert.fail(Assert.java:57)
        at junit.framework.Assert.failNotEquals(Assert.java:329)
        at junit.framework.Assert.assertEquals(Assert.java:78)
        at junit.framework.Assert.assertEquals(Assert.java:234)
        at junit.framework.TestCase.assertEquals(TestCase.java:401)
        at org.apache.maven.shared.dependency.analyzer.DefaultProjectDependencyAnalyzerTest.compileProject(DefaultProjectDependencyAnalyzerTest.java:358)
        at org.apache.maven.shared.dependency.analyzer.DefaultProjectDependencyAnalyzerTest.compileProject(DefaultProjectDependencyAnalyzerTest.java:337)
        at org.apache.maven.shared.dependency.analyzer.DefaultProjectDependencyAnalyzerTest.testJarWithXmlTransitiveDependency(DefaultProjectDependencyAnalyzerTest.java:262)


FAILED:  org.apache.maven.shared.dependency.analyzer.DefaultProjectDependencyAnalyzerTest.linux-jdk7 / Build linux-jdk7 / testJarWithNoDependencies

Error Message:
Error compiling test project expected:<0> but was:<1>

Stack Trace:
junit.framework.AssertionFailedError: Error compiling test project expected:<0> but was:<1>
        at junit.framework.Assert.fail(Assert.java:57)
        at junit.framework.Assert.failNotEquals(Assert.java:329)
        at junit.framework.Assert.assertEquals(Assert.java:78)
        at junit.framework.Assert.assertEquals(Assert.java:234)
        at junit.framework.TestCase.assertEquals(TestCase.java:401)
        at org.apache.maven.shared.dependency.analyzer.DefaultProjectDependencyAnalyzerTest.compileProject(DefaultProjectDependencyAnalyzerTest.java:358)
        at org.apache.maven.shared.dependency.analyzer.DefaultProjectDependencyAnalyzerTest.compileProject(DefaultProjectDependencyAnalyzerTest.java:337)
        at org.apache.maven.shared.dependency.analyzer.DefaultProjectDependencyAnalyzerTest.testJarWithNoDependencies(DefaultProjectDependencyAnalyzerTest.java:111)


FAILED:  org.apache.maven.shared.dependency.analyzer.DefaultProjectDependencyAnalyzerTest.linux-jdk7 / Build linux-jdk7 / testPom

Error Message:
Error compiling test project expected:<0> but was:<1>

Stack Trace:
junit.framework.AssertionFailedError: Error compiling test project expected:<0> but was:<1>
        at junit.framework.Assert.fail(Assert.java:57)
        at junit.framework.Assert.failNotEquals(Assert.java:329)
        at junit.framework.Assert.assertEquals(Assert.java:78)
        at junit.framework.Assert.assertEquals(Assert.java:234)
        at junit.framework.TestCase.assertEquals(TestCase.java:401)
        at org.apache.maven.shared.dependency.analyzer.DefaultProjectDependencyAnalyzerTest.compileProject(DefaultProjectDependencyAnalyzerTest.java:358)
        at org.apache.maven.shared.dependency.analyzer.DefaultProjectDependencyAnalyzerTest.compileProject(DefaultProjectDependencyAnalyzerTest.java:337)
        at org.apache.maven.shared.dependency.analyzer.DefaultProjectDependencyAnalyzerTest.testPom(DefaultProjectDependencyAnalyzerTest.java:97)


FAILED:  org.apache.maven.shared.dependency.analyzer.DefaultProjectDependencyAnalyzerTest.linux-jdk7 / Build linux-jdk7 / testForceDeclaredDependenciesUsage

Error Message:
Error compiling test project expected:<0> but was:<1>

Stack Trace:
junit.framework.AssertionFailedError: Error compiling test project expected:<0> but was:<1>
        at junit.framework.Assert.fail(Assert.java:57)
        at junit.framework.Assert.failNotEquals(Assert.java:329)
        at junit.framework.Assert.assertEquals(Assert.java:78)
        at junit.framework.Assert.assertEquals(Assert.java:234)
        at junit.framework.TestCase.assertEquals(TestCase.java:401)
        at org.apache.maven.shared.dependency.analyzer.DefaultProjectDependencyAnalyzerTest.compileProject(DefaultProjectDependencyAnalyzerTest.java:358)
        at org.apache.maven.shared.dependency.analyzer.DefaultProjectDependencyAnalyzerTest.compileProject(DefaultProjectDependencyAnalyzerTest.java:337)
        at org.apache.maven.shared.dependency.analyzer.DefaultProjectDependencyAnalyzerTest.testForceDeclaredDependenciesUsage(DefaultProjectDependencyAnalyzerTest.java:198)


FAILED:  org.apache.maven.shared.dependency.analyzer.DefaultProjectDependencyAnalyzerTest.linux-jdk7 / Build linux-jdk7 / testJarWithTestDependency

Error Message:
Error compiling test project expected:<0> but was:<1>

Stack Trace:
junit.framework.AssertionFailedError: Error compiling test project expected:<0> but was:<1>
        at junit.framework.Assert.fail(Assert.java:57)
        at junit.framework.Assert.failNotEquals(Assert.java:329)
        at junit.framework.Assert.assertEquals(Assert.java:78)
        at junit.framework.Assert.assertEquals(Assert.java:234)
        at junit.framework.TestCase.assertEquals(TestCase.java:401)
        at org.apache.maven.shared.dependency.analyzer.DefaultProjectDependencyAnalyzerTest.compileProject(DefaultProjectDependencyAnalyzerTest.java:358)
        at org.apache.maven.shared.dependency.analyzer.DefaultProjectDependencyAnalyzerTest.compileProject(DefaultProjectDependencyAnalyzerTest.java:337)
        at org.apache.maven.shared.dependency.analyzer.DefaultProjectDependencyAnalyzerTest.testJarWithTestDependency(DefaultProjectDependencyAnalyzerTest.java:232)


FAILED:  org.apache.maven.shared.dependency.analyzer.DefaultProjectDependencyAnalyzerTest.linux-jdk7 / Build linux-jdk7 / testJarWithCompileDependency

Error Message:
Error compiling test project expected:<0> but was:<1>

Stack Trace:
junit.framework.AssertionFailedError: Error compiling test project expected:<0> but was:<1>
        at junit.framework.Assert.fail(Assert.java:57)
        at junit.framework.Assert.failNotEquals(Assert.java:329)
        at junit.framework.Assert.assertEquals(Assert.java:78)
        at junit.framework.Assert.assertEquals(Assert.java:234)
        at junit.framework.TestCase.assertEquals(TestCase.java:401)
        at org.apache.maven.shared.dependency.analyzer.DefaultProjectDependencyAnalyzerTest.compileProject(DefaultProjectDependencyAnalyzerTest.java:358)
        at org.apache.maven.shared.dependency.analyzer.DefaultProjectDependencyAnalyzerTest.compileProject(DefaultProjectDependencyAnalyzerTest.java:337)
        at org.apache.maven.shared.dependency.analyzer.DefaultProjectDependencyAnalyzerTest.testJarWithCompileDependency(DefaultProjectDependencyAnalyzerTest.java:174)


FAILED:  org.apache.maven.shared.dependency.analyzer.DefaultProjectDependencyAnalyzerTest.linux-jdk7 / Build linux-jdk7 / testMultimoduleProject

Error Message:
Error compiling test project expected:<0> but was:<1>

Stack Trace:
junit.framework.AssertionFailedError: Error compiling test project expected:<0> but was:<1>
        at junit.framework.Assert.fail(Assert.java:57)
        at junit.framework.Assert.failNotEquals(Assert.java:329)
        at junit.framework.Assert.assertEquals(Assert.java:78)
        at junit.framework.Assert.assertEquals(Assert.java:234)
        at junit.framework.TestCase.assertEquals(TestCase.java:401)
        at org.apache.maven.shared.dependency.analyzer.DefaultProjectDependencyAnalyzerTest.compileProject(DefaultProjectDependencyAnalyzerTest.java:358)
        at org.apache.maven.shared.dependency.analyzer.DefaultProjectDependencyAnalyzerTest.compileProject(DefaultProjectDependencyAnalyzerTest.java:337)
        at org.apache.maven.shared.dependency.analyzer.DefaultProjectDependencyAnalyzerTest.testMultimoduleProject(DefaultProjectDependencyAnalyzerTest.java:280)


FAILED:  org.apache.maven.shared.dependency.analyzer.DefaultProjectDependencyAnalyzerTest.windows-jdk7 / Build windows-jdk7 / testJarWithXmlTransitiveDependency

Error Message:
Error compiling test project expected:<0> but was:<1>

Stack Trace:
junit.framework.AssertionFailedError: Error compiling test project expected:<0> but was:<1>
        at junit.framework.Assert.fail(Assert.java:57)
        at junit.framework.Assert.failNotEquals(Assert.java:329)
        at junit.framework.Assert.assertEquals(Assert.java:78)
        at junit.framework.Assert.assertEquals(Assert.java:234)
        at junit.framework.TestCase.assertEquals(TestCase.java:401)
        at org.apache.maven.shared.dependency.analyzer.DefaultProjectDependencyAnalyzerTest.compileProject(DefaultProjectDependencyAnalyzerTest.java:358)
        at org.apache.maven.shared.dependency.analyzer.DefaultProjectDependencyAnalyzerTest.compileProject(DefaultProjectDependencyAnalyzerTest.java:337)
        at org.apache.maven.shared.dependency.analyzer.DefaultProjectDependencyAnalyzerTest.testJarWithXmlTransitiveDependency(DefaultProjectDependencyAnalyzerTest.java:262)


FAILED:  org.apache.maven.shared.dependency.analyzer.DefaultProjectDependencyAnalyzerTest.windows-jdk7 / Build windows-jdk7 / testJarWithNoDependencies

Error Message:
Error compiling test project expected:<0> but was:<1>

Stack Trace:
junit.framework.AssertionFailedError: Error compiling test project expected:<0> but was:<1>
        at junit.framework.Assert.fail(Assert.java:57)
        at junit.framework.Assert.failNotEquals(Assert.java:329)
        at junit.framework.Assert.assertEquals(Assert.java:78)
        at junit.framework.Assert.assertEquals(Assert.java:234)
        at junit.framework.TestCase.assertEquals(TestCase.java:401)
        at org.apache.maven.shared.dependency.analyzer.DefaultProjectDependencyAnalyzerTest.compileProject(DefaultProjectDependencyAnalyzerTest.java:358)
        at org.apache.maven.shared.dependency.analyzer.DefaultProjectDependencyAnalyzerTest.compileProject(DefaultProjectDependencyAnalyzerTest.java:337)
        at org.apache.maven.shared.dependency.analyzer.DefaultProjectDependencyAnalyzerTest.testJarWithNoDependencies(DefaultProjectDependencyAnalyzerTest.java:111)


FAILED:  org.apache.maven.shared.dependency.analyzer.DefaultProjectDependencyAnalyzerTest.windows-jdk7 / Build windows-jdk7 / testPom

Error Message:
Error compiling test project expected:<0> but was:<1>

Stack Trace:
junit.framework.AssertionFailedError: Error compiling test project expected:<0> but was:<1>
        at junit.framework.Assert.fail(Assert.java:57)
        at junit.framework.Assert.failNotEquals(Assert.java:329)
        at junit.framework.Assert.assertEquals(Assert.java:78)
        at junit.framework.Assert.assertEquals(Assert.java:234)
        at junit.framework.TestCase.assertEquals(TestCase.java:401)
        at org.apache.maven.shared.dependency.analyzer.DefaultProjectDependencyAnalyzerTest.compileProject(DefaultProjectDependencyAnalyzerTest.java:358)
        at org.apache.maven.shared.dependency.analyzer.DefaultProjectDependencyAnalyzerTest.compileProject(DefaultProjectDependencyAnalyzerTest.java:337)
        at org.apache.maven.shared.dependency.analyzer.DefaultProjectDependencyAnalyzerTest.testPom(DefaultProjectDependencyAnalyzerTest.java:97)


FAILED:  org.apache.maven.shared.dependency.analyzer.DefaultProjectDependencyAnalyzerTest.windows-jdk7 / Build windows-jdk7 / testForceDeclaredDependenciesUsage

Error Message:
Error compiling test project expected:<0> but was:<1>

Stack Trace:
junit.framework.AssertionFailedError: Error compiling test project expected:<0> but was:<1>
        at junit.framework.Assert.fail(Assert.java:57)
        at junit.framework.Assert.failNotEquals(Assert.java:329)
        at junit.framework.Assert.assertEquals(Assert.java:78)
        at junit.framework.Assert.assertEquals(Assert.java:234)
        at junit.framework.TestCase.assertEquals(TestCase.java:401)
        at org.apache.maven.shared.dependency.analyzer.DefaultProjectDependencyAnalyzerTest.compileProject(DefaultProjectDependencyAnalyzerTest.java:358)
        at org.apache.maven.shared.dependency.analyzer.DefaultProjectDependencyAnalyzerTest.compileProject(DefaultProjectDependencyAnalyzerTest.java:337)
        at org.apache.maven.shared.dependency.analyzer.DefaultProjectDependencyAnalyzerTest.testForceDeclaredDependenciesUsage(DefaultProjectDependencyAnalyzerTest.java:198)


FAILED:  org.apache.maven.shared.dependency.analyzer.DefaultProjectDependencyAnalyzerTest.windows-jdk7 / Build windows-jdk7 / testJarWithTestDependency

Error Message:
Error compiling test project expected:<0> but was:<1>

Stack Trace:
junit.framework.AssertionFailedError: Error compiling test project expected:<0> but was:<1>
        at junit.framework.Assert.fail(Assert.java:57)
        at junit.framework.Assert.failNotEquals(Assert.java:329)
        at junit.framework.Assert.assertEquals(Assert.java:78)
        at junit.framework.Assert.assertEquals(Assert.java:234)
        at junit.framework.TestCase.assertEquals(TestCase.java:401)
        at org.apache.maven.shared.dependency.analyzer.DefaultProjectDependencyAnalyzerTest.compileProject(DefaultProjectDependencyAnalyzerTest.java:358)
        at org.apache.maven.shared.dependency.analyzer.DefaultProjectDependencyAnalyzerTest.compileProject(DefaultProjectDependencyAnalyzerTest.java:337)
        at org.apache.maven.shared.dependency.analyzer.DefaultProjectDependencyAnalyzerTest.testJarWithTestDependency(DefaultProjectDependencyAnalyzerTest.java:232)


FAILED:  org.apache.maven.shared.dependency.analyzer.DefaultProjectDependencyAnalyzerTest.windows-jdk7 / Build windows-jdk7 / testJarWithCompileDependency

Error Message:
Error compiling test project expected:<0> but was:<1>

Stack Trace:
junit.framework.AssertionFailedError: Error compiling test project expected:<0> but was:<1>
        at junit.framework.Assert.fail(Assert.java:57)
        at junit.framework.Assert.failNotEquals(Assert.java:329)
        at junit.framework.Assert.assertEquals(Assert.java:78)
        at junit.framework.Assert.assertEquals(Assert.java:234)
        at junit.framework.TestCase.assertEquals(TestCase.java:401)
        at org.apache.maven.shared.dependency.analyzer.DefaultProjectDependencyAnalyzerTest.compileProject(DefaultProjectDependencyAnalyzerTest.java:358)
        at org.apache.maven.shared.dependency.analyzer.DefaultProjectDependencyAnalyzerTest.compileProject(DefaultProjectDependencyAnalyzerTest.java:337)
        at org.apache.maven.shared.dependency.analyzer.DefaultProjectDependencyAnalyzerTest.testJarWithCompileDependency(DefaultProjectDependencyAnalyzerTest.java:174)


FAILED:  org.apache.maven.shared.dependency.analyzer.DefaultProjectDependencyAnalyzerTest.windows-jdk7 / Build windows-jdk7 / testMultimoduleProject

Error Message:
Error compiling test project expected:<0> but was:<1>

Stack Trace:
junit.framework.AssertionFailedError: Error compiling test project expected:<0> but was:<1>
        at junit.framework.Assert.fail(Assert.java:57)
        at junit.framework.Assert.failNotEquals(Assert.java:329)
        at junit.framework.Assert.assertEquals(Assert.java:78)
        at junit.framework.Assert.assertEquals(Assert.java:234)
        at junit.framework.TestCase.assertEquals(TestCase.java:401)
        at org.apache.maven.shared.dependency.analyzer.DefaultProjectDependencyAnalyzerTest.compileProject(DefaultProjectDependencyAnalyzerTest.java:358)
        at org.apache.maven.shared.dependency.analyzer.DefaultProjectDependencyAnalyzerTest.compileProject(DefaultProjectDependencyAnalyzerTest.java:337)
        at org.apache.maven.shared.dependency.analyzer.DefaultProjectDependencyAnalyzerTest.testMultimoduleProject(DefaultProjectDependencyAnalyzerTest.java:280)


FAILED:  org.apache.maven.shared.dependency.analyzer.DefaultProjectDependencyAnalyzerTest.windows-jdk11 / Build windows-jdk11 / testJarWithXmlTransitiveDependency

Error Message:
null

Stack Trace:
java.lang.NullPointerException: null
        at org.apache.commons.lang3.SystemUtils.isJavaVersionAtLeast(SystemUtils.java:1626)
        at org.apache.maven.shared.dependency.analyzer.DefaultProjectDependencyAnalyzerTest.compileProject(DefaultProjectDependencyAnalyzerTest.java:342)
        at org.apache.maven.shared.dependency.analyzer.DefaultProjectDependencyAnalyzerTest.compileProject(DefaultProjectDependencyAnalyzerTest.java:337)
        at org.apache.maven.shared.dependency.analyzer.DefaultProjectDependencyAnalyzerTest.testJarWithXmlTransitiveDependency(DefaultProjectDependencyAnalyzerTest.java:262)


FAILED:  org.apache.maven.shared.dependency.analyzer.DefaultProjectDependencyAnalyzerTest.windows-jdk11 / Build windows-jdk11 / testJarWithNoDependencies

Error Message:
null

Stack Trace:
java.lang.NullPointerException: null
        at org.apache.commons.lang3.SystemUtils.isJavaVersionAtLeast(SystemUtils.java:1626)
        at org.apache.maven.shared.dependency.analyzer.DefaultProjectDependencyAnalyzerTest.compileProject(DefaultProjectDependencyAnalyzerTest.java:342)
        at org.apache.maven.shared.dependency.analyzer.DefaultProjectDependencyAnalyzerTest.compileProject(DefaultProjectDependencyAnalyzerTest.java:337)
        at org.apache.maven.shared.dependency.analyzer.DefaultProjectDependencyAnalyzerTest.testJarWithNoDependencies(DefaultProjectDependencyAnalyzerTest.java:111)


FAILED:  org.apache.maven.shared.dependency.analyzer.DefaultProjectDependencyAnalyzerTest.windows-jdk11 / Build windows-jdk11 / testPom

Error Message:
null

Stack Trace:
java.lang.NullPointerException: null
        at org.apache.commons.lang3.SystemUtils.isJavaVersionAtLeast(SystemUtils.java:1626)
        at org.apache.maven.shared.dependency.analyzer.DefaultProjectDependencyAnalyzerTest.compileProject(DefaultProjectDependencyAnalyzerTest.java:342)
        at org.apache.maven.shared.dependency.analyzer.DefaultProjectDependencyAnalyzerTest.compileProject(DefaultProjectDependencyAnalyzerTest.java:337)
        at org.apache.maven.shared.dependency.analyzer.DefaultProjectDependencyAnalyzerTest.testPom(DefaultProjectDependencyAnalyzerTest.java:97)


FAILED:  org.apache.maven.shared.dependency.analyzer.DefaultProjectDependencyAnalyzerTest.windows-jdk11 / Build windows-jdk11 / testForceDeclaredDependenciesUsage

Error Message:
null

Stack Trace:
java.lang.NullPointerException: null
        at org.apache.commons.lang3.SystemUtils.isJavaVersionAtLeast(SystemUtils.java:1626)
        at org.apache.maven.shared.dependency.analyzer.DefaultProjectDependencyAnalyzerTest.compileProject(DefaultProjectDependencyAnalyzerTest.java:342)
        at org.apache.maven.shared.dependency.analyzer.DefaultProjectDependencyAnalyzerTest.compileProject(DefaultProjectDependencyAnalyzerTest.java:337)
        at org.apache.maven.shared.dependency.analyzer.DefaultProjectDependencyAnalyzerTest.testForceDeclaredDependenciesUsage(DefaultProjectDependencyAnalyzerTest.java:198)


FAILED:  org.apache.maven.shared.dependency.analyzer.DefaultProjectDependencyAnalyzerTest.windows-jdk11 / Build windows-jdk11 / testJarWithTestDependency

Error Message:
null

Stack Trace:
java.lang.NullPointerException: null
        at org.apache.commons.lang3.SystemUtils.isJavaVersionAtLeast(SystemUtils.java:1626)
        at org.apache.maven.shared.dependency.analyzer.DefaultProjectDependencyAnalyzerTest.compileProject(DefaultProjectDependencyAnalyzerTest.java:342)
        at org.apache.maven.shared.dependency.analyzer.DefaultProjectDependencyAnalyzerTest.compileProject(DefaultProjectDependencyAnalyzerTest.java:337)
        at org.apache.maven.shared.dependency.analyzer.DefaultProjectDependencyAnalyzerTest.testJarWithTestDependency(DefaultProjectDependencyAnalyzerTest.java:232)


FAILED:  org.apache.maven.shared.dependency.analyzer.DefaultProjectDependencyAnalyzerTest.windows-jdk11 / Build windows-jdk11 / testJarWithCompileDependency

Error Message:
null

Stack Trace:
java.lang.NullPointerException: null
        at org.apache.commons.lang3.SystemUtils.isJavaVersionAtLeast(SystemUtils.java:1626)
        at org.apache.maven.shared.dependency.analyzer.DefaultProjectDependencyAnalyzerTest.compileProject(DefaultProjectDependencyAnalyzerTest.java:342)
        at org.apache.maven.shared.dependency.analyzer.DefaultProjectDependencyAnalyzerTest.compileProject(DefaultProjectDependencyAnalyzerTest.java:337)
        at org.apache.maven.shared.dependency.analyzer.DefaultProjectDependencyAnalyzerTest.testJarWithCompileDependency(DefaultProjectDependencyAnalyzerTest.java:174)


FAILED:  org.apache.maven.shared.dependency.analyzer.DefaultProjectDependencyAnalyzerTest.windows-jdk11 / Build windows-jdk11 / testJava8methodRefs

Error Message:
null

Stack Trace:
java.lang.NullPointerException: null
        at org.apache.commons.lang3.SystemUtils.isJavaVersionAtLeast(SystemUtils.java:1626)
        at org.apache.maven.shared.dependency.analyzer.DefaultProjectDependencyAnalyzerTest.testJava8methodRefs(DefaultProjectDependencyAnalyzerTest.java:125)


FAILED:  org.apache.maven.shared.dependency.analyzer.DefaultProjectDependencyAnalyzerTest.windows-jdk11 / Build windows-jdk11 / testInlinedStaticReference

Error Message:
null

Stack Trace:
java.lang.NullPointerException: null
        at org.apache.commons.lang3.SystemUtils.isJavaVersionAtLeast(SystemUtils.java:1626)
        at org.apache.maven.shared.dependency.analyzer.DefaultProjectDependencyAnalyzerTest.testInlinedStaticReference(DefaultProjectDependencyAnalyzerTest.java:150)


FAILED:  org.apache.maven.shared.dependency.analyzer.DefaultProjectDependencyAnalyzerTest.windows-jdk11 / Build windows-jdk11 / testTypeUseAnnotationDependency

Error Message:
null

Stack Trace:
java.lang.NullPointerException: null
        at org.apache.commons.lang3.SystemUtils.isJavaVersionAtLeast(SystemUtils.java:1626)
        at org.apache.maven.shared.dependency.analyzer.DefaultProjectDependencyAnalyzerTest.testTypeUseAnnotationDependency(DefaultProjectDependencyAnalyzerTest.java:310)


FAILED:  org.apache.maven.shared.dependency.analyzer.DefaultProjectDependencyAnalyzerTest.windows-jdk11 / Build windows-jdk11 / testMultimoduleProject

Error Message:
null

Stack Trace:
java.lang.NullPointerException: null
        at org.apache.commons.lang3.SystemUtils.isJavaVersionAtLeast(SystemUtils.java:1626)
        at org.apache.maven.shared.dependency.analyzer.DefaultProjectDependencyAnalyzerTest.compileProject(DefaultProjectDependencyAnalyzerTest.java:342)
        at org.apache.maven.shared.dependency.analyzer.DefaultProjectDependencyAnalyzerTest.compileProject(DefaultProjectDependencyAnalyzerTest.java:337)
        at org.apache.maven.shared.dependency.analyzer.DefaultProjectDependencyAnalyzerTest.testMultimoduleProject(DefaultProjectDependencyAnalyzerTest.java:280)




Build log:
[...truncated 14828 lines...]
[INFO] Downloaded from central: https://repo.maven.apache.org/maven2/org/parboiled/parboiled-java/1.1.4/parboiled-java-1.1.4.jar (73 kB at 421 kB/s)
[INFO] Downloading from central: https://repo.maven.apache.org/maven2/org/ow2/asm/asm-util/4.1/asm-util-4.1.jar
[INFO] Downloaded from central: https://repo.maven.apache.org/maven2/org/ow2/asm/asm/4.1/asm-4.1.jar (47 kB at 269 kB/s)
[INFO] Downloading from central: https://repo.maven.apache.org/maven2/javax/servlet/servlet-api/2.5/servlet-api-2.5.jar
[INFO] Downloaded from central: https://repo.maven.apache.org/maven2/org/parboiled/parboiled-core/1.1.4/parboiled-core-1.1.4.jar (185 kB at 1000 kB/s)
[INFO] Downloading from central: https://repo.maven.apache.org/maven2/org/apache/maven/doxia/doxia-decoration-model/1.7.1/doxia-decoration-model-1.7.1.jar
[INFO] Downloaded from central: https://repo.maven.apache.org/maven2/org/ow2/asm/asm-tree/4.1/asm-tree-4.1.jar (22 kB at 110 kB/s)
[INFO] Downloaded from central: https://repo.maven.apache.org/maven2/org/ow2/asm/asm-util/4.1/asm-util-4.1.jar (38 kB at 186 kB/s)
[INFO] Downloaded from central: https://repo.maven.apache.org/maven2/org/ow2/asm/asm-analysis/4.1/asm-analysis-4.1.jar (20 kB at 98 kB/s)
[INFO] Downloading from central: https://repo.maven.apache.org/maven2/org/apache/maven/doxia/doxia-site-renderer/1.7.1/doxia-site-renderer-1.7.1.jar
[INFO] Downloading from central: https://repo.maven.apache.org/maven2/org/codehaus/plexus/plexus-velocity/1.2/plexus-velocity-1.2.jar
[INFO] Downloading from central: https://repo.maven.apache.org/maven2/org/apache/maven/doxia/doxia-skin-model/1.7.1/doxia-skin-model-1.7.1.jar
[INFO] Downloaded from central: https://repo.maven.apache.org/maven2/javax/servlet/servlet-api/2.5/servlet-api-2.5.jar (105 kB at 489 kB/s)
[INFO] Downloading from central: https://repo.maven.apache.org/maven2/org/apache/velocity/velocity-tools/2.0/velocity-tools-2.0.jar
[INFO] Downloaded from central: https://repo.maven.apache.org/maven2/org/apache/maven/doxia/doxia-decoration-model/1.7.1/doxia-decoration-model-1.7.1.jar (61 kB at 272 kB/s)
[INFO] Downloading from central: https://repo.maven.apache.org/maven2/commons-beanutils/commons-beanutils/1.7.0/commons-beanutils-1.7.0.jar
[INFO] Downloaded from central: https://repo.maven.apache.org/maven2/org/codehaus/plexus/plexus-velocity/1.2/plexus-velocity-1.2.jar (8.1 kB at 34 kB/s)
[INFO] Downloaded from central: https://repo.maven.apache.org/maven2/org/apache/maven/doxia/doxia-skin-model/1.7.1/doxia-skin-model-1.7.1.jar (16 kB at 66 kB/s)
[INFO] Downloading from central: https://repo.maven.apache.org/maven2/commons-digester/commons-digester/1.8/commons-digester-1.8.jar
[INFO] Downloading from central: https://repo.maven.apache.org/maven2/commons-chain/commons-chain/1.1/commons-chain-1.1.jar
[INFO] Downloaded from central: https://repo.maven.apache.org/maven2/org/apache/maven/doxia/doxia-site-renderer/1.7.1/doxia-site-renderer-1.7.1.jar (63 kB at 257 kB/s)
[INFO] Downloading from central: https://repo.maven.apache.org/maven2/commons-logging/commons-logging/1.1/commons-logging-1.1.jar
[INFO] Downloaded from central: https://repo.maven.apache.org/maven2/commons-beanutils/commons-beanutils/1.7.0/commons-beanutils-1.7.0.jar (189 kB at 723 kB/s)
[INFO] Downloading from central: https://repo.maven.apache.org/maven2/commons-validator/commons-validator/1.3.1/commons-validator-1.3.1.jar
[INFO] Downloaded from central: https://repo.maven.apache.org/maven2/org/apache/velocity/velocity-tools/2.0/velocity-tools-2.0.jar (347 kB at 1.3 MB/s)
[INFO] Downloading from central: https://repo.maven.apache.org/maven2/dom4j/dom4j/1.1/dom4j-1.1.jar
[INFO] Downloaded from central: https://repo.maven.apache.org/maven2/commons-chain/commons-chain/1.1/commons-chain-1.1.jar (90 kB at 324 kB/s)
[INFO] Downloading from central: https://repo.maven.apache.org/maven2/sslext/sslext/1.2-0/sslext-1.2-0.jar
[INFO] Downloaded from central: https://repo.maven.apache.org/maven2/commons-logging/commons-logging/1.1/commons-logging-1.1.jar (53 kB at 187 kB/s)
[INFO] Downloading from central: https://repo.maven.apache.org/maven2/org/apache/struts/struts-core/1.3.8/struts-core-1.3.8.jar
[INFO] Downloaded from central: https://repo.maven.apache.org/maven2/commons-digester/commons-digester/1.8/commons-digester-1.8.jar (144 kB at 506 kB/s)
[INFO] Downloading from central: https://repo.maven.apache.org/maven2/antlr/antlr/2.7.2/antlr-2.7.2.jar
[INFO] Downloaded from central: https://repo.maven.apache.org/maven2/commons-validator/commons-validator/1.3.1/commons-validator-1.3.1.jar (139 kB at 459 kB/s)
[INFO] Downloading from central: https://repo.maven.apache.org/maven2/org/apache/struts/struts-taglib/1.3.8/struts-taglib-1.3.8.jar
[INFO] Downloaded from central: https://repo.maven.apache.org/maven2/sslext/sslext/1.2-0/sslext-1.2-0.jar (26 kB at 85 kB/s)
[INFO] Downloading from central: https://repo.maven.apache.org/maven2/org/apache/struts/struts-tiles/1.3.8/struts-tiles-1.3.8.jar
[INFO] Downloaded from central: https://repo.maven.apache.org/maven2/org/apache/struts/struts-core/1.3.8/struts-core-1.3.8.jar (329 kB at 973 kB/s)
[INFO] Downloading from central: https://repo.maven.apache.org/maven2/org/apache/maven/doxia/doxia-integration-tools/1.7.1/doxia-integration-tools-1.7.1.jar
[INFO] Downloaded from central: https://repo.maven.apache.org/maven2/antlr/antlr/2.7.2/antlr-2.7.2.jar (358 kB at 1.1 MB/s)
[INFO] Downloading from central: https://repo.maven.apache.org/maven2/org/apache/maven/wagon/wagon-provider-api/1.0/wagon-provider-api-1.0.jar
[INFO] Downloaded from central: https://repo.maven.apache.org/maven2/org/apache/struts/struts-tiles/1.3.8/struts-tiles-1.3.8.jar (120 kB at 343 kB/s)
[INFO] Downloading from central: https://repo.maven.apache.org/maven2/org/mortbay/jetty/jetty/6.1.25/jetty-6.1.25.jar
[INFO] Downloaded from central: https://repo.maven.apache.org/maven2/dom4j/dom4j/1.1/dom4j-1.1.jar (457 kB at 1.3 MB/s)
[INFO] Downloading from central: https://repo.maven.apache.org/maven2/org/mortbay/jetty/servlet-api/2.5-20081211/servlet-api-2.5-20081211.jar
[INFO] Downloaded from central: https://repo.maven.apache.org/maven2/org/apache/struts/struts-taglib/1.3.8/struts-taglib-1.3.8.jar (252 kB at 711 kB/s)
[INFO] Downloading from central: https://repo.maven.apache.org/maven2/org/mortbay/jetty/jetty-util/6.1.25/jetty-util-6.1.25.jar
[INFO] Downloaded from central: https://repo.maven.apache.org/maven2/org/apache/maven/doxia/doxia-integration-tools/1.7.1/doxia-integration-tools-1.7.1.jar (47 kB at 124 kB/s)
[INFO] Downloaded from central: https://repo.maven.apache.org/maven2/org/apache/maven/wagon/wagon-provider-api/1.0/wagon-provider-api-1.0.jar (53 kB at 140 kB/s)
[INFO] Downloading from central: https://repo.maven.apache.org/maven2/org/apache/commons/commons-lang3/3.4/commons-lang3-3.4.jar
[INFO] Downloading from central: https://repo.maven.apache.org/maven2/commons-io/commons-io/1.4/commons-io-1.4.jar
[INFO] Downloaded from central: https://repo.maven.apache.org/maven2/org/mortbay/jetty/servlet-api/2.5-20081211/servlet-api-2.5-20081211.jar (134 kB at 339 kB/s)
[INFO] Downloaded from central: https://repo.maven.apache.org/maven2/org/mortbay/jetty/jetty-util/6.1.25/jetty-util-6.1.25.jar (177 kB at 442 kB/s)
[INFO] Downloaded from central: https://repo.maven.apache.org/maven2/commons-io/commons-io/1.4/commons-io-1.4.jar (109 kB at 258 kB/s)
[INFO] Downloaded from central: https://repo.maven.apache.org/maven2/org/mortbay/jetty/jetty/6.1.25/jetty-6.1.25.jar (539 kB at 1.3 MB/s)
[INFO] Downloaded from central: https://repo.maven.apache.org/maven2/org/apache/commons/commons-lang3/3.4/commons-lang3-3.4.jar (435 kB at 1.0 MB/s)
[INFO]
[INFO] --- maven-checkstyle-plugin:2.15:check (checkstyle-check) @ maven-dependency-analyzer ---
[INFO] Downloading from central: https://repo.maven.apache.org/maven2/org/apache/maven/reporting/maven-reporting-impl/2.3/maven-reporting-impl-2.3.pom
[INFO] Downloaded from central: https://repo.maven.apache.org/maven2/org/apache/maven/reporting/maven-reporting-impl/2.3/maven-reporting-impl-2.3.pom (5.0 kB at 172 kB/s)
[INFO] Downloading from central: https://repo.maven.apache.org/maven2/org/apache/maven/shared/maven-shared-utils/0.6/maven-shared-utils-0.6.pom
[INFO] Downloaded from central: https://repo.maven.apache.org/maven2/org/apache/maven/shared/maven-shared-utils/0.6/maven-shared-utils-0.6.pom (4.9 kB at 181 kB/s)
[INFO] Downloading from central: https://repo.maven.apache.org/maven2/org/apache/maven/shared/maven-shared-resources/2/maven-shared-resources-2.pom
[INFO] Downloaded from central: https://repo.maven.apache.org/maven2/org/apache/maven/shared/maven-shared-resources/2/maven-shared-resources-2.pom (3.0 kB at 99 kB/s)
[INFO] Downloading from central: https://repo.maven.apache.org/maven2/org/apache/maven/doxia/doxia-sink-api/1.4/doxia-sink-api-1.4.pom
[INFO] Downloaded from central: https://repo.maven.apache.org/maven2/org/apache/maven/doxia/doxia-sink-api/1.4/doxia-sink-api-1.4.pom (1.5 kB at 55 kB/s)
[INFO] Downloading from central: https://repo.maven.apache.org/maven2/org/apache/maven/doxia/doxia/1.4/doxia-1.4.pom
[INFO] Downloaded from central: https://repo.maven.apache.org/maven2/org/apache/maven/doxia/doxia/1.4/doxia-1.4.pom (18 kB at 619 kB/s)
[INFO] Downloading from central: https://repo.maven.apache.org/maven2/org/apache/maven/doxia/doxia-logging-api/1.4/doxia-logging-api-1.4.pom
[INFO] Downloaded from central: https://repo.maven.apache.org/maven2/org/apache/maven/doxia/doxia-logging-api/1.4/doxia-logging-api-1.4.pom (1.5 kB at 51 kB/s)
[INFO] Downloading from central: https://repo.maven.apache.org/maven2/org/apache/maven/doxia/doxia-decoration-model/1.4/doxia-decoration-model-1.4.pom
[INFO] Downloaded from central: https://repo.maven.apache.org/maven2/org/apache/maven/doxia/doxia-decoration-model/1.4/doxia-decoration-model-1.4.pom (2.7 kB at 89 kB/s)
[INFO] Downloading from central: https://repo.maven.apache.org/maven2/org/apache/maven/doxia/doxia-sitetools/1.4/doxia-sitetools-1.4.pom
[INFO] Downloaded from central: https://repo.maven.apache.org/maven2/org/apache/maven/doxia/doxia-sitetools/1.4/doxia-sitetools-1.4.pom (17 kB at 613 kB/s)
[INFO] Downloading from central: https://repo.maven.apache.org/maven2/org/codehaus/plexus/plexus-utils/3.0.10/plexus-utils-3.0.10.pom
[INFO] Downloaded from central: https://repo.maven.apache.org/maven2/org/codehaus/plexus/plexus-utils/3.0.10/plexus-utils-3.0.10.pom (3.1 kB at 165 kB/s)
[INFO] Downloading from central: https://repo.maven.apache.org/maven2/org/apache/maven/doxia/doxia-site-renderer/1.4/doxia-site-renderer-1.4.pom
[INFO] Downloaded from central: https://repo.maven.apache.org/maven2/org/apache/maven/doxia/doxia-site-renderer/1.4/doxia-site-renderer-1.4.pom (6.1 kB at 235 kB/s)
[INFO] Downloading from central: https://repo.maven.apache.org/maven2/org/apache/maven/doxia/doxia-core/1.4/doxia-core-1.4.pom
[INFO] Downloaded from central: https://repo.maven.apache.org/maven2/org/apache/maven/doxia/doxia-core/1.4/doxia-core-1.4.pom (4.1 kB at 156 kB/s)
[INFO] Downloading from central: https://repo.maven.apache.org/maven2/org/apache/maven/doxia/doxia-module-xhtml/1.4/doxia-module-xhtml-1.4.pom
[INFO] Downloaded from central: https://repo.maven.apache.org/maven2/org/apache/maven/doxia/doxia-module-xhtml/1.4/doxia-module-xhtml-1.4.pom (1.6 kB at 58 kB/s)
[INFO] Downloading from central: https://repo.maven.apache.org/maven2/org/apache/maven/doxia/doxia-modules/1.4/doxia-modules-1.4.pom
[INFO] Downloaded from central: https://repo.maven.apache.org/maven2/org/apache/maven/doxia/doxia-modules/1.4/doxia-modules-1.4.pom (2.6 kB at 114 kB/s)
[INFO] Downloading from central: https://repo.maven.apache.org/maven2/org/apache/maven/doxia/doxia-module-fml/1.4/doxia-module-fml-1.4.pom
[INFO] Downloaded from central: https://repo.maven.apache.org/maven2/org/apache/maven/doxia/doxia-module-fml/1.4/doxia-module-fml-1.4.pom (4.8 kB at 185 kB/s)
[INFO] Downloading from central: https://repo.maven.apache.org/maven2/org/apache/maven/doxia/doxia-integration-tools/1.6/doxia-integration-tools-1.6.pom
[INFO] Downloaded from central: https://repo.maven.apache.org/maven2/org/apache/maven/doxia/doxia-integration-tools/1.6/doxia-integration-tools-1.6.pom (7.0 kB at 302 kB/s)
[INFO] Downloading from central: https://repo.maven.apache.org/maven2/org/apache/maven/doxia/doxia-tools/3/doxia-tools-3.pom
[INFO] Downloaded from central: https://repo.maven.apache.org/maven2/org/apache/maven/doxia/doxia-tools/3/doxia-tools-3.pom (9.9 kB at 451 kB/s)
[INFO] Downloading from central: https://repo.maven.apache.org/maven2/org/apache/maven/doxia/doxia-logging-api/1.6/doxia-logging-api-1.6.pom
[INFO] Downloaded from central: https://repo.maven.apache.org/maven2/org/apache/maven/doxia/doxia-logging-api/1.6/doxia-logging-api-1.6.pom (1.5 kB at 67 kB/s)
[INFO] Downloading from central: https://repo.maven.apache.org/maven2/org/apache/maven/doxia/doxia/1.6/doxia-1.6.pom
[INFO] Downloaded from central: https://repo.maven.apache.org/maven2/org/apache/maven/doxia/doxia/1.6/doxia-1.6.pom (19 kB at 703 kB/s)
[INFO] Downloading from central: https://repo.maven.apache.org/maven2/org/apache/maven/doxia/doxia-decoration-model/1.6/doxia-decoration-model-1.6.pom
[INFO] Downloaded from central: https://repo.maven.apache.org/maven2/org/apache/maven/doxia/doxia-decoration-model/1.6/doxia-decoration-model-1.6.pom (3.0 kB at 111 kB/s)
[INFO] Downloading from central: https://repo.maven.apache.org/maven2/org/apache/maven/doxia/doxia-sitetools/1.6/doxia-sitetools-1.6.pom
[INFO] Downloaded from central: https://repo.maven.apache.org/maven2/org/apache/maven/doxia/doxia-sitetools/1.6/doxia-sitetools-1.6.pom (18 kB at 639 kB/s)
[INFO] Downloading from central: https://repo.maven.apache.org/maven2/org/codehaus/plexus/plexus-resources/1.0.1/plexus-resources-1.0.1.pom
[INFO] Downloaded from central: https://repo.maven.apache.org/maven2/org/codehaus/plexus/plexus-resources/1.0.1/plexus-resources-1.0.1.pom (1.3 kB at 51 kB/s)
[INFO] Downloading from central: https://repo.maven.apache.org/maven2/org/codehaus/plexus/plexus-velocity/1.1.8/plexus-velocity-1.1.8.pom
[INFO] Downloaded from central: https://repo.maven.apache.org/maven2/org/codehaus/plexus/plexus-velocity/1.1.8/plexus-velocity-1.1.8.pom (1.9 kB at 71 kB/s)
[INFO] Downloading from central: https://repo.maven.apache.org/maven2/com/puppycrawl/tools/checkstyle/6.1.1/checkstyle-6.1.1.pom
[INFO] Downloaded from central: https://repo.maven.apache.org/maven2/com/puppycrawl/tools/checkstyle/6.1.1/checkstyle-6.1.1.pom (30 kB at 1.0 MB/s)
[INFO] Downloading from central: https://repo.maven.apache.org/maven2/org/sonatype/oss/oss-parent/7/oss-parent-7.pom
[INFO] Downloaded from central: https://repo.maven.apache.org/maven2/org/sonatype/oss/oss-parent/7/oss-parent-7.pom (4.8 kB at 241 kB/s)
[INFO] Downloading from central: https://repo.maven.apache.org/maven2/antlr/antlr/2.7.7/antlr-2.7.7.pom
[INFO] Downloaded from central: https://repo.maven.apache.org/maven2/antlr/antlr/2.7.7/antlr-2.7.7.pom (632 B at 27 kB/s)
[INFO] Downloading from central: https://repo.maven.apache.org/maven2/org/antlr/antlr4-runtime/4.3/antlr4-runtime-4.3.pom
[INFO] Downloaded from central: https://repo.maven.apache.org/maven2/org/antlr/antlr4-runtime/4.3/antlr4-runtime-4.3.pom (4.8 kB at 200 kB/s)
[INFO] Downloading from central: https://repo.maven.apache.org/maven2/org/antlr/antlr4-master/4.3/antlr4-master-4.3.pom
[INFO] Downloaded from central: https://repo.maven.apache.org/maven2/org/antlr/antlr4-master/4.3/antlr4-master-4.3.pom (7.9 kB at 317 kB/s)
[INFO] Downloading from central: https://repo.maven.apache.org/maven2/org/abego/treelayout/org.abego.treelayout.core/1.0.1/org.abego.treelayout.core-1.0.1.pom
[INFO] Downloaded from central: https://repo.maven.apache.org/maven2/org/abego/treelayout/org.abego.treelayout.core/1.0.1/org.abego.treelayout.core-1.0.1.pom (3.1 kB at 129 kB/s)
[INFO] Downloading from central: https://repo.maven.apache.org/maven2/org/antlr/antlr4-annotations/4.3/antlr4-annotations-4.3.pom
[INFO] Downloaded from central: https://repo.maven.apache.org/maven2/org/antlr/antlr4-annotations/4.3/antlr4-annotations-4.3.pom (1.3 kB at 53 kB/s)
[INFO] Downloading from central: https://repo.maven.apache.org/maven2/commons-beanutils/commons-beanutils-core/1.8.3/commons-beanutils-core-1.8.3.pom
[INFO] Downloaded from central: https://repo.maven.apache.org/maven2/commons-beanutils/commons-beanutils-core/1.8.3/commons-beanutils-core-1.8.3.pom (1.6 kB at 66 kB/s)
[INFO] Downloading from central: https://repo.maven.apache.org/maven2/com/google/guava/guava/18.0/guava-18.0.pom
[INFO] Downloaded from central: https://repo.maven.apache.org/maven2/com/google/guava/guava/18.0/guava-18.0.pom (5.7 kB at 210 kB/s)
[INFO] Downloading from central: https://repo.maven.apache.org/maven2/com/google/guava/guava-parent/18.0/guava-parent-18.0.pom
[INFO] Downloaded from central: https://repo.maven.apache.org/maven2/com/google/guava/guava-parent/18.0/guava-parent-18.0.pom (7.7 kB at 307 kB/s)
[INFO] Downloading from central: https://repo.maven.apache.org/maven2/org/apache/maven/reporting/maven-reporting-impl/2.3/maven-reporting-impl-2.3.jar
[INFO] Downloading from central: https://repo.maven.apache.org/maven2/xml-apis/xml-apis/1.3.04/xml-apis-1.3.04.jar
[INFO] Downloading from central: https://repo.maven.apache.org/maven2/commons-digester/commons-digester/1.6/commons-digester-1.6.jar
[INFO] Downloading from central: https://repo.maven.apache.org/maven2/xerces/xercesImpl/2.9.1/xercesImpl-2.9.1.jar
[INFO] Downloading from central: https://repo.maven.apache.org/maven2/org/apache/maven/shared/maven-shared-utils/0.6/maven-shared-utils-0.6.jar
[INFO] Downloaded from central: https://repo.maven.apache.org/maven2/org/apache/maven/reporting/maven-reporting-impl/2.3/maven-reporting-impl-2.3.jar (18 kB at 620 kB/s)
[INFO] Downloading from central: https://repo.maven.apache.org/maven2/commons-logging/commons-logging/1.0.4/commons-logging-1.0.4.jar
[INFO] Downloaded from central: https://repo.maven.apache.org/maven2/commons-digester/commons-digester/1.6/commons-digester-1.6.jar (168 kB at 4.0 MB/s)
[INFO] Downloaded from central: https://repo.maven.apache.org/maven2/xml-apis/xml-apis/1.3.04/xml-apis-1.3.04.jar (194 kB at 4.5 MB/s)
[INFO] Downloading from central: https://repo.maven.apache.org/maven2/org/apache/maven/shared/maven-shared-resources/2/maven-shared-resources-2.jar
[INFO] Downloaded from central: https://repo.maven.apache.org/maven2/org/apache/maven/shared/maven-shared-utils/0.6/maven-shared-utils-0.6.jar (165 kB at 3.6 MB/s)
[INFO] Downloading from central: https://repo.maven.apache.org/maven2/org/apache/maven/doxia/doxia-sink-api/1.4/doxia-sink-api-1.4.jar
[INFO] Downloading from central: https://repo.maven.apache.org/maven2/org/apache/maven/doxia/doxia-logging-api/1.4/doxia-logging-api-1.4.jar
[INFO] Downloaded from central: https://repo.maven.apache.org/maven2/commons-logging/commons-logging/1.0.4/commons-logging-1.0.4.jar (38 kB at 603 kB/s)
[INFO] Downloading from central: https://repo.maven.apache.org/maven2/org/apache/maven/doxia/doxia-decoration-model/1.4/doxia-decoration-model-1.4.jar
[INFO] Downloaded from central: https://repo.maven.apache.org/maven2/org/apache/maven/doxia/doxia-logging-api/1.4/doxia-logging-api-1.4.jar (11 kB at 164 kB/s)
[INFO] Downloading from central: https://repo.maven.apache.org/maven2/org/apache/maven/doxia/doxia-site-renderer/1.4/doxia-site-renderer-1.4.jar
[INFO] Downloaded from central: https://repo.maven.apache.org/maven2/org/apache/maven/shared/maven-shared-resources/2/maven-shared-resources-2.jar (13 kB at 176 kB/s)
[INFO] Downloading from central: https://repo.maven.apache.org/maven2/org/apache/maven/doxia/doxia-module-xhtml/1.4/doxia-module-xhtml-1.4.jar
[INFO] Downloaded from central: https://repo.maven.apache.org/maven2/org/apache/maven/doxia/doxia-sink-api/1.4/doxia-sink-api-1.4.jar (11 kB at 147 kB/s)
[INFO] Downloading from central: https://repo.maven.apache.org/maven2/org/apache/maven/doxia/doxia-module-fml/1.4/doxia-module-fml-1.4.jar
[INFO] Downloaded from central: https://repo.maven.apache.org/maven2/org/apache/maven/doxia/doxia-decoration-model/1.4/doxia-decoration-model-1.4.jar (61 kB at 607 kB/s)
[INFO] Downloading from central: https://repo.maven.apache.org/maven2/org/apache/maven/doxia/doxia-integration-tools/1.6/doxia-integration-tools-1.6.jar
[INFO] Downloaded from central: https://repo.maven.apache.org/maven2/org/apache/maven/doxia/doxia-site-renderer/1.4/doxia-site-renderer-1.4.jar (53 kB at 510 kB/s)
[INFO] Downloaded from central: https://repo.maven.apache.org/maven2/org/apache/maven/doxia/doxia-module-xhtml/1.4/doxia-module-xhtml-1.4.jar (15 kB at 148 kB/s)
[INFO] Downloading from central: https://repo.maven.apache.org/maven2/org/codehaus/plexus/plexus-resources/1.0.1/plexus-resources-1.0.1.jar
[INFO] Downloading from central: https://repo.maven.apache.org/maven2/org/codehaus/plexus/plexus-interpolation/1.21/plexus-interpolation-1.21.jar
[INFO] Downloaded from central: https://repo.maven.apache.org/maven2/org/apache/maven/doxia/doxia-module-fml/1.4/doxia-module-fml-1.4.jar (38 kB at 335 kB/s)
[INFO] Downloading from central: https://repo.maven.apache.org/maven2/org/codehaus/plexus/plexus-velocity/1.1.8/plexus-velocity-1.1.8.jar
[INFO] Downloaded from central: https://repo.maven.apache.org/maven2/xerces/xercesImpl/2.9.1/xercesImpl-2.9.1.jar (1.2 MB at 11 MB/s)
[INFO] Downloading from central: https://repo.maven.apache.org/maven2/com/puppycrawl/tools/checkstyle/6.1.1/checkstyle-6.1.1.jar
[INFO] Downloaded from central: https://repo.maven.apache.org/maven2/org/apache/maven/doxia/doxia-integration-tools/1.6/doxia-integration-tools-1.6.jar (45 kB at 336 kB/s)
[INFO] Downloaded from central: https://repo.maven.apache.org/maven2/org/codehaus/plexus/plexus-resources/1.0.1/plexus-resources-1.0.1.jar (22 kB at 163 kB/s)
[INFO] Downloading from central: https://repo.maven.apache.org/maven2/antlr/antlr/2.7.7/antlr-2.7.7.jar
[INFO] Downloading from central: https://repo.maven.apache.org/maven2/org/antlr/antlr4-runtime/4.3/antlr4-runtime-4.3.jar
[INFO] Downloaded from central: https://repo.maven.apache.org/maven2/org/codehaus/plexus/plexus-interpolation/1.21/plexus-interpolation-1.21.jar (62 kB at 449 kB/s)
[INFO] Downloading from central: https://repo.maven.apache.org/maven2/org/abego/treelayout/org.abego.treelayout.core/1.0.1/org.abego.treelayout.core-1.0.1.jar
[INFO] Downloaded from central: https://repo.maven.apache.org/maven2/org/codehaus/plexus/plexus-velocity/1.1.8/plexus-velocity-1.1.8.jar (7.9 kB at 56 kB/s)
[INFO] Downloading from central: https://repo.maven.apache.org/maven2/org/antlr/antlr4-annotations/4.3/antlr4-annotations-4.3.jar
[INFO] Downloaded from central: https://repo.maven.apache.org/maven2/org/antlr/antlr4-annotations/4.3/antlr4-annotations-4.3.jar (10 kB at 59 kB/s)
[INFO] Downloaded from central: https://repo.maven.apache.org/maven2/org/abego/treelayout/org.abego.treelayout.core/1.0.1/org.abego.treelayout.core-1.0.1.jar (26 kB at 148 kB/s)
[INFO] Downloading from central: https://repo.maven.apache.org/maven2/commons-beanutils/commons-beanutils-core/1.8.3/commons-beanutils-core-1.8.3.jar
[INFO] Downloading from central: https://repo.maven.apache.org/maven2/com/google/guava/guava/18.0/guava-18.0.jar
[INFO] Downloaded from central: https://repo.maven.apache.org/maven2/org/antlr/antlr4-runtime/4.3/antlr4-runtime-4.3.jar (345 kB at 1.8 MB/s)
[INFO] Downloaded from central: https://repo.maven.apache.org/maven2/antlr/antlr/2.7.7/antlr-2.7.7.jar (445 kB at 2.2 MB/s)
[INFO] Downloaded from central: https://repo.maven.apache.org/maven2/commons-beanutils/commons-beanutils-core/1.8.3/commons-beanutils-core-1.8.3.jar (207 kB at 966 kB/s)
[INFO] Downloaded from central: https://repo.maven.apache.org/maven2/com/google/guava/guava/18.0/guava-18.0.jar (2.3 MB at 6.8 MB/s)
[INFO] Downloaded from central: https://repo.maven.apache.org/maven2/com/puppycrawl/tools/checkstyle/6.1.1/checkstyle-6.1.1.jar (1.0 MB at 692 kB/s)
[INFO] ------------------------------------------------------------------------
[INFO] BUILD SUCCESS
[INFO] ------------------------------------------------------------------------
[INFO] Total time:  01:48 min
[INFO] Finished at: 2020-03-04T11:29:18-08:00
[INFO] ------------------------------------------------------------------------
[WARNING] The requested profile "run-its" could not be activated because it does not exist.
[INFO] [jenkins-event-spy] Generated F:\jenkins\jenkins-slave\workspace\4_Detect_Java_8_type_annotations@tmp\withMaven3a979299\maven-spy-20200304-112729-2903911035692779383560.log
Picked up JAVA_TOOL_OPTIONS: -Dmaven.ext.class.path="f:\jenkins\jenkins-slave\workspace\4_Detect_Java_8_type_annotations@tmp\withMaven3a979299\pipeline-maven-spy.jar" -Dorg.jenkinsci.plugins.pipeline.maven.reportsFolder="f:\jenkins\jenkins-slave\workspace\4_Detect_Java_8_type_annotations@tmp\withMaven3a979299"
[Pipeline] }
[Pipeline] // dir
[Pipeline] }
[withMaven] junitPublisher - Archive test results for Maven artifact org.apache.maven.shared:maven-dependency-analyzer:jar:1.8-SNAPSHOT generated by maven-surefire-plugin:test (default-test): m\target\surefire-reports\*.xml
Recording test results
[withMaven] Publishers: Pipeline Graph Publisher: 1 ms, Junit Publisher: 275 ms
[withMaven] junitPublisher - Archive test results for Maven artifact org.apache.maven.shared.dependency-analyzer.tests:jarWithXercesDependencies:jar:1.0 generated by maven-surefire-plugin:test (default-test): m\target\test-classes\jarWithXmlTransitiveDependency\target\surefire-reports\*.xml
Recording test results
None of the test reports contained any result
[withMaven] Publishers: Junit Publisher: 27 ms
[withMaven] junitPublisher - Archive test results for Maven artifact org.apache.maven.shared.dependency-analyzer.tests:jarWithNoDependencies:jar:1.0 generated by maven-surefire-plugin:test (default-test): m\target\test-classes\jarWithNoDependencies\target\surefire-reports\*.xml
Recording test results
None of the test reports contained any result
[withMaven] Publishers: Junit Publisher: 34 ms
[withMaven] Publishers:
[withMaven] junitPublisher - Archive test results for Maven artifact org.apache.maven.shared.dependency-analyzer.tests:jarWithTestDependency1:jar:1.0 generated by maven-surefire-plugin:test (default-test): m\target\test-classes\jarWithTestDependency\project1\target\surefire-reports\*.xml
[withMaven] junitPublisher - Archive test results for Maven artifact org.apache.maven.shared.dependency-analyzer.tests:jarWithTestDependency2:jar:1.0 generated by maven-surefire-plugin:test (default-test): m\target\test-classes\jarWithTestDependency\project2\target\surefire-reports\*.xml
Recording test results
None of the test reports contained any result
[withMaven] Publishers: Pipeline Graph Publisher: 1 ms, Junit Publisher: 31 ms
[withMaven] junitPublisher - Archive test results for Maven artifact org.apache.maven.shared.dependency-analyzer.tests:jarWithTestDependency1:jar:1.0 generated by maven-surefire-plugin:test (default-test): m\target\test-classes\jarWithTestDependency\project1\target\surefire-reports\*.xml
[withMaven] junitPublisher - Archive test results for Maven artifact org.apache.maven.shared.dependency-analyzer.tests:jarWithTestDependency2:jar:1.0 generated by maven-surefire-plugin:test (default-test): m\target\test-classes\jarWithTestDependency\project2\target\surefire-reports\*.xml
Recording test results
None of the test reports contained any result
[withMaven] Publishers: Pipeline Graph Publisher: 1 ms, Junit Publisher: 46 ms
[withMaven] junitPublisher - Archive test results for Maven artifact org.apache.maven.shared.dependency-analyzer.tests:jarWithCompileDependency1:jar:1.0 generated by maven-surefire-plugin:test (default-test): m\target\test-classes\jarWithCompileDependency\project1\target\surefire-reports\*.xml
[withMaven] junitPublisher - Archive test results for Maven artifact org.apache.maven.shared.dependency-analyzer.tests:jarWithCompileDependency2:jar:1.0 generated by maven-surefire-plugin:test (default-test): m\target\test-classes\jarWithCompileDependency\project2\target\surefire-reports\*.xml
Recording test results
None of the test reports contained any result
[withMaven] Publishers: Junit Publisher: 30 ms
[withMaven] junitPublisher - Archive test results for Maven artifact org.apache.maven.shared.dependency-analyzer.tests:java8methodreferences:jar:1.0 generated by maven-surefire-plugin:test (default-test): m\target\test-classes\java8methodRefs\target\surefire-reports\*.xml
Recording test results
None of the test reports contained any result
[withMaven] Publishers: Junit Publisher: 44 ms
[withMaven] junitPublisher - Archive test results for Maven artifact org.apache.maven.shared.dependency-analyzer.tests:inlinedStaticReference:jar:1.0 generated by maven-surefire-plugin:test (default-test): m\target\test-classes\inlinedStaticReference\target\surefire-reports\*.xml
Recording test results
None of the test reports contained any result
[withMaven] Publishers: Junit Publisher: 22 ms
[withMaven] junitPublisher - Archive test results for Maven artifact org.apache.maven.shared.dependency-analyzer.tests:typeUseAnnotationDependencyAnnotation:jar:1.0 generated by maven-surefire-plugin:test (default-test): m\target\test-classes\typeUseAnnotationDependency\annotation\target\surefire-reports\*.xml
[withMaven] junitPublisher - Archive test results for Maven artifact org.apache.maven.shared.dependency-analyzer.tests:typeUseAnnotationDependencyUsage:jar:1.0 generated by maven-surefire-plugin:test (default-test): m\target\test-classes\typeUseAnnotationDependency\usage\target\surefire-reports\*.xml
Recording test results
None of the test reports contained any result
[withMaven] Publishers: Junit Publisher: 28 ms
[withMaven] junitPublisher - Archive test results for Maven artifact org.apache.maven.its.dependency:test-module1:jar:1.0 generated by maven-surefire-plugin:test (default-test): m\target\test-classes\multimoduleProject\module1\target\surefire-reports\*.xml
[withMaven] junitPublisher - Archive test results for Maven artifact org.apache.maven.its.dependency:test-module2:jar:1.0 generated by maven-surefire-plugin:test (default-test): m\target\test-classes\multimoduleProject\module2\target\surefire-reports\*.xml
Recording test results
None of the test reports contained any result
[withMaven] Publishers: Junit Publisher: 26 ms
[Pipeline] // withMaven
[Pipeline] cleanWs
[WS-CLEANUP] Deleting project workspace...
[WS-CLEANUP] Deferred wipeout is used...
[WS-CLEANUP] done
[Pipeline] }
[Pipeline] // stage
[Pipeline] }
[Pipeline] // node
[Pipeline] }
[Pipeline] // parallel
[Pipeline] echo
[FAILURE-003] AbortException hudson.AbortException: script returned exit code 1
[Pipeline] stage
[Pipeline] { (Notifications)
[Pipeline] echo
Build result: FAILURE
[Pipeline] jiraIssueSelector
[Pipeline] echo
The authors of changes [slachiewicz].
[Pipeline] echo
Sending email ...
[Pipeline] emailext
Reply | Threaded
Open this post in threaded view
|

Build failed in Jenkins: Maven TLP » maven-dependency-analyzer » MSHARED-674_Detect_Java_8_type_annotations #25

Apache Jenkins Server-2
See https://builds.apache.org/job/maven-box/job/maven-dependency-analyzer/job/MSHARED-674_Detect_Java_8_type_annotations/25/

Changes:

* Java 14 released, so Java 13 EOL. Include Java 15-ea

34 tests failed.
FAILED:  org.apache.maven.shared.dependency.analyzer.DefaultProjectDependencyAnalyzerTest.linux-jdk11 / Build linux-jdk11 / testJarWithXmlTransitiveDependency

Error Message:
null

Stack Trace:
java.lang.NullPointerException: null
        at org.apache.commons.lang3.SystemUtils.isJavaVersionAtLeast(SystemUtils.java:1626)
        at org.apache.maven.shared.dependency.analyzer.DefaultProjectDependencyAnalyzerTest.compileProject(DefaultProjectDependencyAnalyzerTest.java:342)
        at org.apache.maven.shared.dependency.analyzer.DefaultProjectDependencyAnalyzerTest.compileProject(DefaultProjectDependencyAnalyzerTest.java:337)
        at org.apache.maven.shared.dependency.analyzer.DefaultProjectDependencyAnalyzerTest.testJarWithXmlTransitiveDependency(DefaultProjectDependencyAnalyzerTest.java:262)


FAILED:  org.apache.maven.shared.dependency.analyzer.DefaultProjectDependencyAnalyzerTest.linux-jdk11 / Build linux-jdk11 / testJarWithNoDependencies

Error Message:
null

Stack Trace:
java.lang.NullPointerException: null
        at org.apache.commons.lang3.SystemUtils.isJavaVersionAtLeast(SystemUtils.java:1626)
        at org.apache.maven.shared.dependency.analyzer.DefaultProjectDependencyAnalyzerTest.compileProject(DefaultProjectDependencyAnalyzerTest.java:342)
        at org.apache.maven.shared.dependency.analyzer.DefaultProjectDependencyAnalyzerTest.compileProject(DefaultProjectDependencyAnalyzerTest.java:337)
        at org.apache.maven.shared.dependency.analyzer.DefaultProjectDependencyAnalyzerTest.testJarWithNoDependencies(DefaultProjectDependencyAnalyzerTest.java:111)


FAILED:  org.apache.maven.shared.dependency.analyzer.DefaultProjectDependencyAnalyzerTest.linux-jdk11 / Build linux-jdk11 / testPom

Error Message:
null

Stack Trace:
java.lang.NullPointerException: null
        at org.apache.commons.lang3.SystemUtils.isJavaVersionAtLeast(SystemUtils.java:1626)
        at org.apache.maven.shared.dependency.analyzer.DefaultProjectDependencyAnalyzerTest.compileProject(DefaultProjectDependencyAnalyzerTest.java:342)
        at org.apache.maven.shared.dependency.analyzer.DefaultProjectDependencyAnalyzerTest.compileProject(DefaultProjectDependencyAnalyzerTest.java:337)
        at org.apache.maven.shared.dependency.analyzer.DefaultProjectDependencyAnalyzerTest.testPom(DefaultProjectDependencyAnalyzerTest.java:97)


FAILED:  org.apache.maven.shared.dependency.analyzer.DefaultProjectDependencyAnalyzerTest.linux-jdk11 / Build linux-jdk11 / testForceDeclaredDependenciesUsage

Error Message:
null

Stack Trace:
java.lang.NullPointerException: null
        at org.apache.commons.lang3.SystemUtils.isJavaVersionAtLeast(SystemUtils.java:1626)
        at org.apache.maven.shared.dependency.analyzer.DefaultProjectDependencyAnalyzerTest.compileProject(DefaultProjectDependencyAnalyzerTest.java:342)
        at org.apache.maven.shared.dependency.analyzer.DefaultProjectDependencyAnalyzerTest.compileProject(DefaultProjectDependencyAnalyzerTest.java:337)
        at org.apache.maven.shared.dependency.analyzer.DefaultProjectDependencyAnalyzerTest.testForceDeclaredDependenciesUsage(DefaultProjectDependencyAnalyzerTest.java:198)


FAILED:  org.apache.maven.shared.dependency.analyzer.DefaultProjectDependencyAnalyzerTest.linux-jdk11 / Build linux-jdk11 / testJarWithTestDependency

Error Message:
null

Stack Trace:
java.lang.NullPointerException: null
        at org.apache.commons.lang3.SystemUtils.isJavaVersionAtLeast(SystemUtils.java:1626)
        at org.apache.maven.shared.dependency.analyzer.DefaultProjectDependencyAnalyzerTest.compileProject(DefaultProjectDependencyAnalyzerTest.java:342)
        at org.apache.maven.shared.dependency.analyzer.DefaultProjectDependencyAnalyzerTest.compileProject(DefaultProjectDependencyAnalyzerTest.java:337)
        at org.apache.maven.shared.dependency.analyzer.DefaultProjectDependencyAnalyzerTest.testJarWithTestDependency(DefaultProjectDependencyAnalyzerTest.java:232)


FAILED:  org.apache.maven.shared.dependency.analyzer.DefaultProjectDependencyAnalyzerTest.linux-jdk11 / Build linux-jdk11 / testJarWithCompileDependency

Error Message:
null

Stack Trace:
java.lang.NullPointerException: null
        at org.apache.commons.lang3.SystemUtils.isJavaVersionAtLeast(SystemUtils.java:1626)
        at org.apache.maven.shared.dependency.analyzer.DefaultProjectDependencyAnalyzerTest.compileProject(DefaultProjectDependencyAnalyzerTest.java:342)
        at org.apache.maven.shared.dependency.analyzer.DefaultProjectDependencyAnalyzerTest.compileProject(DefaultProjectDependencyAnalyzerTest.java:337)
        at org.apache.maven.shared.dependency.analyzer.DefaultProjectDependencyAnalyzerTest.testJarWithCompileDependency(DefaultProjectDependencyAnalyzerTest.java:174)


FAILED:  org.apache.maven.shared.dependency.analyzer.DefaultProjectDependencyAnalyzerTest.linux-jdk11 / Build linux-jdk11 / testJava8methodRefs

Error Message:
null

Stack Trace:
java.lang.NullPointerException: null
        at org.apache.commons.lang3.SystemUtils.isJavaVersionAtLeast(SystemUtils.java:1626)
        at org.apache.maven.shared.dependency.analyzer.DefaultProjectDependencyAnalyzerTest.testJava8methodRefs(DefaultProjectDependencyAnalyzerTest.java:125)


FAILED:  org.apache.maven.shared.dependency.analyzer.DefaultProjectDependencyAnalyzerTest.linux-jdk11 / Build linux-jdk11 / testInlinedStaticReference

Error Message:
null

Stack Trace:
java.lang.NullPointerException: null
        at org.apache.commons.lang3.SystemUtils.isJavaVersionAtLeast(SystemUtils.java:1626)
        at org.apache.maven.shared.dependency.analyzer.DefaultProjectDependencyAnalyzerTest.testInlinedStaticReference(DefaultProjectDependencyAnalyzerTest.java:150)


FAILED:  org.apache.maven.shared.dependency.analyzer.DefaultProjectDependencyAnalyzerTest.linux-jdk11 / Build linux-jdk11 / testTypeUseAnnotationDependency

Error Message:
null

Stack Trace:
java.lang.NullPointerException: null
        at org.apache.commons.lang3.SystemUtils.isJavaVersionAtLeast(SystemUtils.java:1626)
        at org.apache.maven.shared.dependency.analyzer.DefaultProjectDependencyAnalyzerTest.testTypeUseAnnotationDependency(DefaultProjectDependencyAnalyzerTest.java:310)


FAILED:  org.apache.maven.shared.dependency.analyzer.DefaultProjectDependencyAnalyzerTest.linux-jdk11 / Build linux-jdk11 / testMultimoduleProject

Error Message:
null

Stack Trace:
java.lang.NullPointerException: null
        at org.apache.commons.lang3.SystemUtils.isJavaVersionAtLeast(SystemUtils.java:1626)
        at org.apache.maven.shared.dependency.analyzer.DefaultProjectDependencyAnalyzerTest.compileProject(DefaultProjectDependencyAnalyzerTest.java:342)
        at org.apache.maven.shared.dependency.analyzer.DefaultProjectDependencyAnalyzerTest.compileProject(DefaultProjectDependencyAnalyzerTest.java:337)
        at org.apache.maven.shared.dependency.analyzer.DefaultProjectDependencyAnalyzerTest.testMultimoduleProject(DefaultProjectDependencyAnalyzerTest.java:280)


FAILED:  org.apache.maven.shared.dependency.analyzer.DefaultProjectDependencyAnalyzerTest.linux-jdk7 / Build linux-jdk7 / testJarWithXmlTransitiveDependency

Error Message:
Error compiling test project expected:<0> but was:<1>

Stack Trace:
junit.framework.AssertionFailedError: Error compiling test project expected:<0> but was:<1>
        at junit.framework.Assert.fail(Assert.java:57)
        at junit.framework.Assert.failNotEquals(Assert.java:329)
        at junit.framework.Assert.assertEquals(Assert.java:78)
        at junit.framework.Assert.assertEquals(Assert.java:234)
        at junit.framework.TestCase.assertEquals(TestCase.java:401)
        at org.apache.maven.shared.dependency.analyzer.DefaultProjectDependencyAnalyzerTest.compileProject(DefaultProjectDependencyAnalyzerTest.java:358)
        at org.apache.maven.shared.dependency.analyzer.DefaultProjectDependencyAnalyzerTest.compileProject(DefaultProjectDependencyAnalyzerTest.java:337)
        at org.apache.maven.shared.dependency.analyzer.DefaultProjectDependencyAnalyzerTest.testJarWithXmlTransitiveDependency(DefaultProjectDependencyAnalyzerTest.java:262)


FAILED:  org.apache.maven.shared.dependency.analyzer.DefaultProjectDependencyAnalyzerTest.linux-jdk7 / Build linux-jdk7 / testJarWithNoDependencies

Error Message:
Error compiling test project expected:<0> but was:<1>

Stack Trace:
junit.framework.AssertionFailedError: Error compiling test project expected:<0> but was:<1>
        at junit.framework.Assert.fail(Assert.java:57)
        at junit.framework.Assert.failNotEquals(Assert.java:329)
        at junit.framework.Assert.assertEquals(Assert.java:78)
        at junit.framework.Assert.assertEquals(Assert.java:234)
        at junit.framework.TestCase.assertEquals(TestCase.java:401)
        at org.apache.maven.shared.dependency.analyzer.DefaultProjectDependencyAnalyzerTest.compileProject(DefaultProjectDependencyAnalyzerTest.java:358)
        at org.apache.maven.shared.dependency.analyzer.DefaultProjectDependencyAnalyzerTest.compileProject(DefaultProjectDependencyAnalyzerTest.java:337)
        at org.apache.maven.shared.dependency.analyzer.DefaultProjectDependencyAnalyzerTest.testJarWithNoDependencies(DefaultProjectDependencyAnalyzerTest.java:111)


FAILED:  org.apache.maven.shared.dependency.analyzer.DefaultProjectDependencyAnalyzerTest.linux-jdk7 / Build linux-jdk7 / testPom

Error Message:
Error compiling test project expected:<0> but was:<1>

Stack Trace:
junit.framework.AssertionFailedError: Error compiling test project expected:<0> but was:<1>
        at junit.framework.Assert.fail(Assert.java:57)
        at junit.framework.Assert.failNotEquals(Assert.java:329)
        at junit.framework.Assert.assertEquals(Assert.java:78)
        at junit.framework.Assert.assertEquals(Assert.java:234)
        at junit.framework.TestCase.assertEquals(TestCase.java:401)
        at org.apache.maven.shared.dependency.analyzer.DefaultProjectDependencyAnalyzerTest.compileProject(DefaultProjectDependencyAnalyzerTest.java:358)
        at org.apache.maven.shared.dependency.analyzer.DefaultProjectDependencyAnalyzerTest.compileProject(DefaultProjectDependencyAnalyzerTest.java:337)
        at org.apache.maven.shared.dependency.analyzer.DefaultProjectDependencyAnalyzerTest.testPom(DefaultProjectDependencyAnalyzerTest.java:97)


FAILED:  org.apache.maven.shared.dependency.analyzer.DefaultProjectDependencyAnalyzerTest.linux-jdk7 / Build linux-jdk7 / testForceDeclaredDependenciesUsage

Error Message:
Error compiling test project expected:<0> but was:<1>

Stack Trace:
junit.framework.AssertionFailedError: Error compiling test project expected:<0> but was:<1>
        at junit.framework.Assert.fail(Assert.java:57)
        at junit.framework.Assert.failNotEquals(Assert.java:329)
        at junit.framework.Assert.assertEquals(Assert.java:78)
        at junit.framework.Assert.assertEquals(Assert.java:234)
        at junit.framework.TestCase.assertEquals(TestCase.java:401)
        at org.apache.maven.shared.dependency.analyzer.DefaultProjectDependencyAnalyzerTest.compileProject(DefaultProjectDependencyAnalyzerTest.java:358)
        at org.apache.maven.shared.dependency.analyzer.DefaultProjectDependencyAnalyzerTest.compileProject(DefaultProjectDependencyAnalyzerTest.java:337)
        at org.apache.maven.shared.dependency.analyzer.DefaultProjectDependencyAnalyzerTest.testForceDeclaredDependenciesUsage(DefaultProjectDependencyAnalyzerTest.java:198)


FAILED:  org.apache.maven.shared.dependency.analyzer.DefaultProjectDependencyAnalyzerTest.linux-jdk7 / Build linux-jdk7 / testJarWithTestDependency

Error Message:
Error compiling test project expected:<0> but was:<1>

Stack Trace:
junit.framework.AssertionFailedError: Error compiling test project expected:<0> but was:<1>
        at junit.framework.Assert.fail(Assert.java:57)
        at junit.framework.Assert.failNotEquals(Assert.java:329)
        at junit.framework.Assert.assertEquals(Assert.java:78)
        at junit.framework.Assert.assertEquals(Assert.java:234)
        at junit.framework.TestCase.assertEquals(TestCase.java:401)
        at org.apache.maven.shared.dependency.analyzer.DefaultProjectDependencyAnalyzerTest.compileProject(DefaultProjectDependencyAnalyzerTest.java:358)
        at org.apache.maven.shared.dependency.analyzer.DefaultProjectDependencyAnalyzerTest.compileProject(DefaultProjectDependencyAnalyzerTest.java:337)
        at org.apache.maven.shared.dependency.analyzer.DefaultProjectDependencyAnalyzerTest.testJarWithTestDependency(DefaultProjectDependencyAnalyzerTest.java:232)


FAILED:  org.apache.maven.shared.dependency.analyzer.DefaultProjectDependencyAnalyzerTest.linux-jdk7 / Build linux-jdk7 / testJarWithCompileDependency

Error Message:
Error compiling test project expected:<0> but was:<1>

Stack Trace:
junit.framework.AssertionFailedError: Error compiling test project expected:<0> but was:<1>
        at junit.framework.Assert.fail(Assert.java:57)
        at junit.framework.Assert.failNotEquals(Assert.java:329)
        at junit.framework.Assert.assertEquals(Assert.java:78)
        at junit.framework.Assert.assertEquals(Assert.java:234)
        at junit.framework.TestCase.assertEquals(TestCase.java:401)
        at org.apache.maven.shared.dependency.analyzer.DefaultProjectDependencyAnalyzerTest.compileProject(DefaultProjectDependencyAnalyzerTest.java:358)
        at org.apache.maven.shared.dependency.analyzer.DefaultProjectDependencyAnalyzerTest.compileProject(DefaultProjectDependencyAnalyzerTest.java:337)
        at org.apache.maven.shared.dependency.analyzer.DefaultProjectDependencyAnalyzerTest.testJarWithCompileDependency(DefaultProjectDependencyAnalyzerTest.java:174)


FAILED:  org.apache.maven.shared.dependency.analyzer.DefaultProjectDependencyAnalyzerTest.linux-jdk7 / Build linux-jdk7 / testMultimoduleProject

Error Message:
Error compiling test project expected:<0> but was:<1>

Stack Trace:
junit.framework.AssertionFailedError: Error compiling test project expected:<0> but was:<1>
        at junit.framework.Assert.fail(Assert.java:57)
        at junit.framework.Assert.failNotEquals(Assert.java:329)
        at junit.framework.Assert.assertEquals(Assert.java:78)
        at junit.framework.Assert.assertEquals(Assert.java:234)
        at junit.framework.TestCase.assertEquals(TestCase.java:401)
        at org.apache.maven.shared.dependency.analyzer.DefaultProjectDependencyAnalyzerTest.compileProject(DefaultProjectDependencyAnalyzerTest.java:358)
        at org.apache.maven.shared.dependency.analyzer.DefaultProjectDependencyAnalyzerTest.compileProject(DefaultProjectDependencyAnalyzerTest.java:337)
        at org.apache.maven.shared.dependency.analyzer.DefaultProjectDependencyAnalyzerTest.testMultimoduleProject(DefaultProjectDependencyAnalyzerTest.java:280)


FAILED:  org.apache.maven.shared.dependency.analyzer.DefaultProjectDependencyAnalyzerTest.windows-jdk11 / Build windows-jdk11 / testJarWithXmlTransitiveDependency

Error Message:
null

Stack Trace:
java.lang.NullPointerException: null
        at org.apache.commons.lang3.SystemUtils.isJavaVersionAtLeast(SystemUtils.java:1626)
        at org.apache.maven.shared.dependency.analyzer.DefaultProjectDependencyAnalyzerTest.compileProject(DefaultProjectDependencyAnalyzerTest.java:342)
        at org.apache.maven.shared.dependency.analyzer.DefaultProjectDependencyAnalyzerTest.compileProject(DefaultProjectDependencyAnalyzerTest.java:337)
        at org.apache.maven.shared.dependency.analyzer.DefaultProjectDependencyAnalyzerTest.testJarWithXmlTransitiveDependency(DefaultProjectDependencyAnalyzerTest.java:262)


FAILED:  org.apache.maven.shared.dependency.analyzer.DefaultProjectDependencyAnalyzerTest.windows-jdk11 / Build windows-jdk11 / testJarWithNoDependencies

Error Message:
null

Stack Trace:
java.lang.NullPointerException: null
        at org.apache.commons.lang3.SystemUtils.isJavaVersionAtLeast(SystemUtils.java:1626)
        at org.apache.maven.shared.dependency.analyzer.DefaultProjectDependencyAnalyzerTest.compileProject(DefaultProjectDependencyAnalyzerTest.java:342)
        at org.apache.maven.shared.dependency.analyzer.DefaultProjectDependencyAnalyzerTest.compileProject(DefaultProjectDependencyAnalyzerTest.java:337)
        at org.apache.maven.shared.dependency.analyzer.DefaultProjectDependencyAnalyzerTest.testJarWithNoDependencies(DefaultProjectDependencyAnalyzerTest.java:111)


FAILED:  org.apache.maven.shared.dependency.analyzer.DefaultProjectDependencyAnalyzerTest.windows-jdk11 / Build windows-jdk11 / testPom

Error Message:
null

Stack Trace:
java.lang.NullPointerException: null
        at org.apache.commons.lang3.SystemUtils.isJavaVersionAtLeast(SystemUtils.java:1626)
        at org.apache.maven.shared.dependency.analyzer.DefaultProjectDependencyAnalyzerTest.compileProject(DefaultProjectDependencyAnalyzerTest.java:342)
        at org.apache.maven.shared.dependency.analyzer.DefaultProjectDependencyAnalyzerTest.compileProject(DefaultProjectDependencyAnalyzerTest.java:337)
        at org.apache.maven.shared.dependency.analyzer.DefaultProjectDependencyAnalyzerTest.testPom(DefaultProjectDependencyAnalyzerTest.java:97)


FAILED:  org.apache.maven.shared.dependency.analyzer.DefaultProjectDependencyAnalyzerTest.windows-jdk11 / Build windows-jdk11 / testForceDeclaredDependenciesUsage

Error Message:
null

Stack Trace:
java.lang.NullPointerException: null
        at org.apache.commons.lang3.SystemUtils.isJavaVersionAtLeast(SystemUtils.java:1626)
        at org.apache.maven.shared.dependency.analyzer.DefaultProjectDependencyAnalyzerTest.compileProject(DefaultProjectDependencyAnalyzerTest.java:342)
        at org.apache.maven.shared.dependency.analyzer.DefaultProjectDependencyAnalyzerTest.compileProject(DefaultProjectDependencyAnalyzerTest.java:337)
        at org.apache.maven.shared.dependency.analyzer.DefaultProjectDependencyAnalyzerTest.testForceDeclaredDependenciesUsage(DefaultProjectDependencyAnalyzerTest.java:198)


FAILED:  org.apache.maven.shared.dependency.analyzer.DefaultProjectDependencyAnalyzerTest.windows-jdk11 / Build windows-jdk11 / testJarWithTestDependency

Error Message:
null

Stack Trace:
java.lang.NullPointerException: null
        at org.apache.commons.lang3.SystemUtils.isJavaVersionAtLeast(SystemUtils.java:1626)
        at org.apache.maven.shared.dependency.analyzer.DefaultProjectDependencyAnalyzerTest.compileProject(DefaultProjectDependencyAnalyzerTest.java:342)
        at org.apache.maven.shared.dependency.analyzer.DefaultProjectDependencyAnalyzerTest.compileProject(DefaultProjectDependencyAnalyzerTest.java:337)
        at org.apache.maven.shared.dependency.analyzer.DefaultProjectDependencyAnalyzerTest.testJarWithTestDependency(DefaultProjectDependencyAnalyzerTest.java:232)


FAILED:  org.apache.maven.shared.dependency.analyzer.DefaultProjectDependencyAnalyzerTest.windows-jdk11 / Build windows-jdk11 / testJarWithCompileDependency

Error Message:
null

Stack Trace:
java.lang.NullPointerException: null
        at org.apache.commons.lang3.SystemUtils.isJavaVersionAtLeast(SystemUtils.java:1626)
        at org.apache.maven.shared.dependency.analyzer.DefaultProjectDependencyAnalyzerTest.compileProject(DefaultProjectDependencyAnalyzerTest.java:342)
        at org.apache.maven.shared.dependency.analyzer.DefaultProjectDependencyAnalyzerTest.compileProject(DefaultProjectDependencyAnalyzerTest.java:337)
        at org.apache.maven.shared.dependency.analyzer.DefaultProjectDependencyAnalyzerTest.testJarWithCompileDependency(DefaultProjectDependencyAnalyzerTest.java:174)


FAILED:  org.apache.maven.shared.dependency.analyzer.DefaultProjectDependencyAnalyzerTest.windows-jdk11 / Build windows-jdk11 / testJava8methodRefs

Error Message:
null

Stack Trace:
java.lang.NullPointerException: null
        at org.apache.commons.lang3.SystemUtils.isJavaVersionAtLeast(SystemUtils.java:1626)
        at org.apache.maven.shared.dependency.analyzer.DefaultProjectDependencyAnalyzerTest.testJava8methodRefs(DefaultProjectDependencyAnalyzerTest.java:125)


FAILED:  org.apache.maven.shared.dependency.analyzer.DefaultProjectDependencyAnalyzerTest.windows-jdk11 / Build windows-jdk11 / testInlinedStaticReference

Error Message:
null

Stack Trace:
java.lang.NullPointerException: null
        at org.apache.commons.lang3.SystemUtils.isJavaVersionAtLeast(SystemUtils.java:1626)
        at org.apache.maven.shared.dependency.analyzer.DefaultProjectDependencyAnalyzerTest.testInlinedStaticReference(DefaultProjectDependencyAnalyzerTest.java:150)


FAILED:  org.apache.maven.shared.dependency.analyzer.DefaultProjectDependencyAnalyzerTest.windows-jdk11 / Build windows-jdk11 / testTypeUseAnnotationDependency

Error Message:
null

Stack Trace:
java.lang.NullPointerException: null
        at org.apache.commons.lang3.SystemUtils.isJavaVersionAtLeast(SystemUtils.java:1626)
        at org.apache.maven.shared.dependency.analyzer.DefaultProjectDependencyAnalyzerTest.testTypeUseAnnotationDependency(DefaultProjectDependencyAnalyzerTest.java:310)


FAILED:  org.apache.maven.shared.dependency.analyzer.DefaultProjectDependencyAnalyzerTest.windows-jdk11 / Build windows-jdk11 / testMultimoduleProject

Error Message:
null

Stack Trace:
java.lang.NullPointerException: null
        at org.apache.commons.lang3.SystemUtils.isJavaVersionAtLeast(SystemUtils.java:1626)
        at org.apache.maven.shared.dependency.analyzer.DefaultProjectDependencyAnalyzerTest.compileProject(DefaultProjectDependencyAnalyzerTest.java:342)
        at org.apache.maven.shared.dependency.analyzer.DefaultProjectDependencyAnalyzerTest.compileProject(DefaultProjectDependencyAnalyzerTest.java:337)
        at org.apache.maven.shared.dependency.analyzer.DefaultProjectDependencyAnalyzerTest.testMultimoduleProject(DefaultProjectDependencyAnalyzerTest.java:280)


FAILED:  org.apache.maven.shared.dependency.analyzer.DefaultProjectDependencyAnalyzerTest.windows-jdk7 / Build windows-jdk7 / testJarWithXmlTransitiveDependency

Error Message:
Error compiling test project expected:<0> but was:<1>

Stack Trace:
junit.framework.AssertionFailedError: Error compiling test project expected:<0> but was:<1>
        at junit.framework.Assert.fail(Assert.java:57)
        at junit.framework.Assert.failNotEquals(Assert.java:329)
        at junit.framework.Assert.assertEquals(Assert.java:78)
        at junit.framework.Assert.assertEquals(Assert.java:234)
        at junit.framework.TestCase.assertEquals(TestCase.java:401)
        at org.apache.maven.shared.dependency.analyzer.DefaultProjectDependencyAnalyzerTest.compileProject(DefaultProjectDependencyAnalyzerTest.java:358)
        at org.apache.maven.shared.dependency.analyzer.DefaultProjectDependencyAnalyzerTest.compileProject(DefaultProjectDependencyAnalyzerTest.java:337)
        at org.apache.maven.shared.dependency.analyzer.DefaultProjectDependencyAnalyzerTest.testJarWithXmlTransitiveDependency(DefaultProjectDependencyAnalyzerTest.java:262)


FAILED:  org.apache.maven.shared.dependency.analyzer.DefaultProjectDependencyAnalyzerTest.windows-jdk7 / Build windows-jdk7 / testJarWithNoDependencies

Error Message:
Error compiling test project expected:<0> but was:<1>

Stack Trace:
junit.framework.AssertionFailedError: Error compiling test project expected:<0> but was:<1>
        at junit.framework.Assert.fail(Assert.java:57)
        at junit.framework.Assert.failNotEquals(Assert.java:329)
        at junit.framework.Assert.assertEquals(Assert.java:78)
        at junit.framework.Assert.assertEquals(Assert.java:234)
        at junit.framework.TestCase.assertEquals(TestCase.java:401)
        at org.apache.maven.shared.dependency.analyzer.DefaultProjectDependencyAnalyzerTest.compileProject(DefaultProjectDependencyAnalyzerTest.java:358)
        at org.apache.maven.shared.dependency.analyzer.DefaultProjectDependencyAnalyzerTest.compileProject(DefaultProjectDependencyAnalyzerTest.java:337)
        at org.apache.maven.shared.dependency.analyzer.DefaultProjectDependencyAnalyzerTest.testJarWithNoDependencies(DefaultProjectDependencyAnalyzerTest.java:111)


FAILED:  org.apache.maven.shared.dependency.analyzer.DefaultProjectDependencyAnalyzerTest.windows-jdk7 / Build windows-jdk7 / testPom

Error Message:
Error compiling test project expected:<0> but was:<1>

Stack Trace:
junit.framework.AssertionFailedError: Error compiling test project expected:<0> but was:<1>
        at junit.framework.Assert.fail(Assert.java:57)
        at junit.framework.Assert.failNotEquals(Assert.java:329)
        at junit.framework.Assert.assertEquals(Assert.java:78)
        at junit.framework.Assert.assertEquals(Assert.java:234)
        at junit.framework.TestCase.assertEquals(TestCase.java:401)
        at org.apache.maven.shared.dependency.analyzer.DefaultProjectDependencyAnalyzerTest.compileProject(DefaultProjectDependencyAnalyzerTest.java:358)
        at org.apache.maven.shared.dependency.analyzer.DefaultProjectDependencyAnalyzerTest.compileProject(DefaultProjectDependencyAnalyzerTest.java:337)
        at org.apache.maven.shared.dependency.analyzer.DefaultProjectDependencyAnalyzerTest.testPom(DefaultProjectDependencyAnalyzerTest.java:97)


FAILED:  org.apache.maven.shared.dependency.analyzer.DefaultProjectDependencyAnalyzerTest.windows-jdk7 / Build windows-jdk7 / testForceDeclaredDependenciesUsage

Error Message:
Error compiling test project expected:<0> but was:<1>

Stack Trace:
junit.framework.AssertionFailedError: Error compiling test project expected:<0> but was:<1>
        at junit.framework.Assert.fail(Assert.java:57)
        at junit.framework.Assert.failNotEquals(Assert.java:329)
        at junit.framework.Assert.assertEquals(Assert.java:78)
        at junit.framework.Assert.assertEquals(Assert.java:234)
        at junit.framework.TestCase.assertEquals(TestCase.java:401)
        at org.apache.maven.shared.dependency.analyzer.DefaultProjectDependencyAnalyzerTest.compileProject(DefaultProjectDependencyAnalyzerTest.java:358)
        at org.apache.maven.shared.dependency.analyzer.DefaultProjectDependencyAnalyzerTest.compileProject(DefaultProjectDependencyAnalyzerTest.java:337)
        at org.apache.maven.shared.dependency.analyzer.DefaultProjectDependencyAnalyzerTest.testForceDeclaredDependenciesUsage(DefaultProjectDependencyAnalyzerTest.java:198)


FAILED:  org.apache.maven.shared.dependency.analyzer.DefaultProjectDependencyAnalyzerTest.windows-jdk7 / Build windows-jdk7 / testJarWithTestDependency

Error Message:
Error compiling test project expected:<0> but was:<1>

Stack Trace:
junit.framework.AssertionFailedError: Error compiling test project expected:<0> but was:<1>
        at junit.framework.Assert.fail(Assert.java:57)
        at junit.framework.Assert.failNotEquals(Assert.java:329)
        at junit.framework.Assert.assertEquals(Assert.java:78)
        at junit.framework.Assert.assertEquals(Assert.java:234)
        at junit.framework.TestCase.assertEquals(TestCase.java:401)
        at org.apache.maven.shared.dependency.analyzer.DefaultProjectDependencyAnalyzerTest.compileProject(DefaultProjectDependencyAnalyzerTest.java:358)
        at org.apache.maven.shared.dependency.analyzer.DefaultProjectDependencyAnalyzerTest.compileProject(DefaultProjectDependencyAnalyzerTest.java:337)
        at org.apache.maven.shared.dependency.analyzer.DefaultProjectDependencyAnalyzerTest.testJarWithTestDependency(DefaultProjectDependencyAnalyzerTest.java:232)


FAILED:  org.apache.maven.shared.dependency.analyzer.DefaultProjectDependencyAnalyzerTest.windows-jdk7 / Build windows-jdk7 / testJarWithCompileDependency

Error Message:
Error compiling test project expected:<0> but was:<1>

Stack Trace:
junit.framework.AssertionFailedError: Error compiling test project expected:<0> but was:<1>
        at junit.framework.Assert.fail(Assert.java:57)
        at junit.framework.Assert.failNotEquals(Assert.java:329)
        at junit.framework.Assert.assertEquals(Assert.java:78)
        at junit.framework.Assert.assertEquals(Assert.java:234)
        at junit.framework.TestCase.assertEquals(TestCase.java:401)
        at org.apache.maven.shared.dependency.analyzer.DefaultProjectDependencyAnalyzerTest.compileProject(DefaultProjectDependencyAnalyzerTest.java:358)
        at org.apache.maven.shared.dependency.analyzer.DefaultProjectDependencyAnalyzerTest.compileProject(DefaultProjectDependencyAnalyzerTest.java:337)
        at org.apache.maven.shared.dependency.analyzer.DefaultProjectDependencyAnalyzerTest.testJarWithCompileDependency(DefaultProjectDependencyAnalyzerTest.java:174)


FAILED:  org.apache.maven.shared.dependency.analyzer.DefaultProjectDependencyAnalyzerTest.windows-jdk7 / Build windows-jdk7 / testMultimoduleProject

Error Message:
Error compiling test project expected:<0> but was:<1>

Stack Trace:
junit.framework.AssertionFailedError: Error compiling test project expected:<0> but was:<1>
        at junit.framework.Assert.fail(Assert.java:57)
        at junit.framework.Assert.failNotEquals(Assert.java:329)
        at junit.framework.Assert.assertEquals(Assert.java:78)
        at junit.framework.Assert.assertEquals(Assert.java:234)
        at junit.framework.TestCase.assertEquals(TestCase.java:401)
        at org.apache.maven.shared.dependency.analyzer.DefaultProjectDependencyAnalyzerTest.compileProject(DefaultProjectDependencyAnalyzerTest.java:358)
        at org.apache.maven.shared.dependency.analyzer.DefaultProjectDependencyAnalyzerTest.compileProject(DefaultProjectDependencyAnalyzerTest.java:337)
        at org.apache.maven.shared.dependency.analyzer.DefaultProjectDependencyAnalyzerTest.testMultimoduleProject(DefaultProjectDependencyAnalyzerTest.java:280)




Build log:
[...truncated 14818 lines...]
[INFO] Downloaded from central: https://repo.maven.apache.org/maven2/org/ow2/asm/asm/4.1/asm-4.1.jar (47 kB at 451 kB/s)
[INFO] Downloading from central: https://repo.maven.apache.org/maven2/org/ow2/asm/asm-util/4.1/asm-util-4.1.jar
[INFO] Downloaded from central: https://repo.maven.apache.org/maven2/org/parboiled/parboiled-java/1.1.4/parboiled-java-1.1.4.jar (73 kB at 665 kB/s)
[INFO] Downloading from central: https://repo.maven.apache.org/maven2/javax/servlet/servlet-api/2.5/servlet-api-2.5.jar
[INFO] Downloaded from central: https://repo.maven.apache.org/maven2/org/ow2/asm/asm-tree/4.1/asm-tree-4.1.jar (22 kB at 191 kB/s)
[INFO] Downloading from central: https://repo.maven.apache.org/maven2/org/apache/maven/doxia/doxia-decoration-model/1.7.1/doxia-decoration-model-1.7.1.jar
[INFO] Downloaded from central: https://repo.maven.apache.org/maven2/org/ow2/asm/asm-analysis/4.1/asm-analysis-4.1.jar (20 kB at 169 kB/s)
[INFO] Downloading from central: https://repo.maven.apache.org/maven2/org/apache/maven/doxia/doxia-site-renderer/1.7.1/doxia-site-renderer-1.7.1.jar
[INFO] Downloaded from central: https://repo.maven.apache.org/maven2/org/parboiled/parboiled-core/1.1.4/parboiled-core-1.1.4.jar (185 kB at 1.6 MB/s)
[INFO] Downloading from central: https://repo.maven.apache.org/maven2/org/apache/maven/doxia/doxia-skin-model/1.7.1/doxia-skin-model-1.7.1.jar
[INFO] Downloaded from central: https://repo.maven.apache.org/maven2/org/ow2/asm/asm-util/4.1/asm-util-4.1.jar (38 kB at 285 kB/s)
[INFO] Downloaded from central: https://repo.maven.apache.org/maven2/javax/servlet/servlet-api/2.5/servlet-api-2.5.jar (105 kB at 796 kB/s)
[INFO] Downloading from central: https://repo.maven.apache.org/maven2/org/codehaus/plexus/plexus-velocity/1.2/plexus-velocity-1.2.jar
[INFO] Downloading from central: https://repo.maven.apache.org/maven2/org/apache/velocity/velocity-tools/2.0/velocity-tools-2.0.jar
[INFO] Downloaded from central: https://repo.maven.apache.org/maven2/org/apache/maven/doxia/doxia-decoration-model/1.7.1/doxia-decoration-model-1.7.1.jar (61 kB at 439 kB/s)
[INFO] Downloading from central: https://repo.maven.apache.org/maven2/commons-beanutils/commons-beanutils/1.7.0/commons-beanutils-1.7.0.jar
[INFO] Downloaded from central: https://repo.maven.apache.org/maven2/org/apache/maven/doxia/doxia-skin-model/1.7.1/doxia-skin-model-1.7.1.jar (16 kB at 115 kB/s)
[INFO] Downloading from central: https://repo.maven.apache.org/maven2/commons-digester/commons-digester/1.8/commons-digester-1.8.jar
[INFO] Downloaded from central: https://repo.maven.apache.org/maven2/org/apache/maven/doxia/doxia-site-renderer/1.7.1/doxia-site-renderer-1.7.1.jar (63 kB at 432 kB/s)
[INFO] Downloading from central: https://repo.maven.apache.org/maven2/commons-chain/commons-chain/1.1/commons-chain-1.1.jar
[INFO] Downloaded from central: https://repo.maven.apache.org/maven2/org/codehaus/plexus/plexus-velocity/1.2/plexus-velocity-1.2.jar (8.1 kB at 52 kB/s)
[INFO] Downloading from central: https://repo.maven.apache.org/maven2/commons-logging/commons-logging/1.1/commons-logging-1.1.jar
[INFO] Downloaded from central: https://repo.maven.apache.org/maven2/commons-digester/commons-digester/1.8/commons-digester-1.8.jar (144 kB at 855 kB/s)
[INFO] Downloading from central: https://repo.maven.apache.org/maven2/commons-validator/commons-validator/1.3.1/commons-validator-1.3.1.jar
[INFO] Downloaded from central: https://repo.maven.apache.org/maven2/commons-beanutils/commons-beanutils/1.7.0/commons-beanutils-1.7.0.jar (189 kB at 1.1 MB/s)
[INFO] Downloading from central: https://repo.maven.apache.org/maven2/dom4j/dom4j/1.1/dom4j-1.1.jar
[INFO] Downloaded from central: https://repo.maven.apache.org/maven2/commons-chain/commons-chain/1.1/commons-chain-1.1.jar (90 kB at 526 kB/s)
[INFO] Downloading from central: https://repo.maven.apache.org/maven2/sslext/sslext/1.2-0/sslext-1.2-0.jar
[INFO] Downloaded from central: https://repo.maven.apache.org/maven2/org/apache/velocity/velocity-tools/2.0/velocity-tools-2.0.jar (347 kB at 2.0 MB/s)
[INFO] Downloading from central: https://repo.maven.apache.org/maven2/org/apache/struts/struts-core/1.3.8/struts-core-1.3.8.jar
[INFO] Downloaded from central: https://repo.maven.apache.org/maven2/commons-logging/commons-logging/1.1/commons-logging-1.1.jar (53 kB at 286 kB/s)
[INFO] Downloading from central: https://repo.maven.apache.org/maven2/antlr/antlr/2.7.2/antlr-2.7.2.jar
[INFO] Downloaded from central: https://repo.maven.apache.org/maven2/sslext/sslext/1.2-0/sslext-1.2-0.jar (26 kB at 137 kB/s)
[INFO] Downloading from central: https://repo.maven.apache.org/maven2/org/apache/struts/struts-taglib/1.3.8/struts-taglib-1.3.8.jar
[INFO] Downloaded from central: https://repo.maven.apache.org/maven2/commons-validator/commons-validator/1.3.1/commons-validator-1.3.1.jar (139 kB at 705 kB/s)
[INFO] Downloading from central: https://repo.maven.apache.org/maven2/org/apache/struts/struts-tiles/1.3.8/struts-tiles-1.3.8.jar
[INFO] Downloaded from central: https://repo.maven.apache.org/maven2/dom4j/dom4j/1.1/dom4j-1.1.jar (457 kB at 2.1 MB/s)
[INFO] Downloaded from central: https://repo.maven.apache.org/maven2/org/apache/struts/struts-core/1.3.8/struts-core-1.3.8.jar (329 kB at 1.5 MB/s)
[INFO] Downloading from central: https://repo.maven.apache.org/maven2/org/apache/maven/doxia/doxia-integration-tools/1.7.1/doxia-integration-tools-1.7.1.jar
[INFO] Downloading from central: https://repo.maven.apache.org/maven2/org/apache/maven/wagon/wagon-provider-api/1.0/wagon-provider-api-1.0.jar
[INFO] Downloaded from central: https://repo.maven.apache.org/maven2/org/apache/struts/struts-taglib/1.3.8/struts-taglib-1.3.8.jar (252 kB at 1.1 MB/s)
[INFO] Downloading from central: https://repo.maven.apache.org/maven2/org/mortbay/jetty/jetty/6.1.25/jetty-6.1.25.jar
[INFO] Downloaded from central: https://repo.maven.apache.org/maven2/org/apache/struts/struts-tiles/1.3.8/struts-tiles-1.3.8.jar (120 kB at 525 kB/s)
[INFO] Downloaded from central: https://repo.maven.apache.org/maven2/antlr/antlr/2.7.2/antlr-2.7.2.jar (358 kB at 1.6 MB/s)
[INFO] Downloading from central: https://repo.maven.apache.org/maven2/org/mortbay/jetty/servlet-api/2.5-20081211/servlet-api-2.5-20081211.jar
[INFO] Downloading from central: https://repo.maven.apache.org/maven2/org/mortbay/jetty/jetty-util/6.1.25/jetty-util-6.1.25.jar
[INFO] Downloaded from central: https://repo.maven.apache.org/maven2/org/apache/maven/doxia/doxia-integration-tools/1.7.1/doxia-integration-tools-1.7.1.jar (47 kB at 189 kB/s)
[INFO] Downloading from central: https://repo.maven.apache.org/maven2/org/apache/commons/commons-lang3/3.4/commons-lang3-3.4.jar
[INFO] Downloaded from central: https://repo.maven.apache.org/maven2/org/apache/maven/wagon/wagon-provider-api/1.0/wagon-provider-api-1.0.jar (53 kB at 207 kB/s)
[INFO] Downloading from central: https://repo.maven.apache.org/maven2/commons-io/commons-io/1.4/commons-io-1.4.jar
[INFO] Downloaded from central: https://repo.maven.apache.org/maven2/org/mortbay/jetty/servlet-api/2.5-20081211/servlet-api-2.5-20081211.jar (134 kB at 516 kB/s)
[INFO] Downloaded from central: https://repo.maven.apache.org/maven2/org/mortbay/jetty/jetty-util/6.1.25/jetty-util-6.1.25.jar (177 kB at 679 kB/s)
[INFO] Downloaded from central: https://repo.maven.apache.org/maven2/org/mortbay/jetty/jetty/6.1.25/jetty-6.1.25.jar (539 kB at 2.0 MB/s)
[INFO] Downloaded from central: https://repo.maven.apache.org/maven2/commons-io/commons-io/1.4/commons-io-1.4.jar (109 kB at 391 kB/s)
[INFO] Downloaded from central: https://repo.maven.apache.org/maven2/org/apache/commons/commons-lang3/3.4/commons-lang3-3.4.jar (435 kB at 1.5 MB/s)
[INFO]
[INFO] --- maven-checkstyle-plugin:2.15:check (checkstyle-check) @ maven-dependency-analyzer ---
[INFO] Downloading from central: https://repo.maven.apache.org/maven2/org/apache/maven/reporting/maven-reporting-impl/2.3/maven-reporting-impl-2.3.pom
[INFO] Downloaded from central: https://repo.maven.apache.org/maven2/org/apache/maven/reporting/maven-reporting-impl/2.3/maven-reporting-impl-2.3.pom (5.0 kB at 179 kB/s)
[INFO] Downloading from central: https://repo.maven.apache.org/maven2/org/apache/maven/shared/maven-shared-utils/0.6/maven-shared-utils-0.6.pom
[INFO] Downloaded from central: https://repo.maven.apache.org/maven2/org/apache/maven/shared/maven-shared-utils/0.6/maven-shared-utils-0.6.pom (4.9 kB at 257 kB/s)
[INFO] Downloading from central: https://repo.maven.apache.org/maven2/org/apache/maven/shared/maven-shared-resources/2/maven-shared-resources-2.pom
[INFO] Downloaded from central: https://repo.maven.apache.org/maven2/org/apache/maven/shared/maven-shared-resources/2/maven-shared-resources-2.pom (3.0 kB at 164 kB/s)
[INFO] Downloading from central: https://repo.maven.apache.org/maven2/org/apache/maven/doxia/doxia-sink-api/1.4/doxia-sink-api-1.4.pom
[INFO] Downloaded from central: https://repo.maven.apache.org/maven2/org/apache/maven/doxia/doxia-sink-api/1.4/doxia-sink-api-1.4.pom (1.5 kB at 90 kB/s)
[INFO] Downloading from central: https://repo.maven.apache.org/maven2/org/apache/maven/doxia/doxia/1.4/doxia-1.4.pom
[INFO] Downloaded from central: https://repo.maven.apache.org/maven2/org/apache/maven/doxia/doxia/1.4/doxia-1.4.pom (18 kB at 816 kB/s)
[INFO] Downloading from central: https://repo.maven.apache.org/maven2/org/apache/maven/doxia/doxia-logging-api/1.4/doxia-logging-api-1.4.pom
[INFO] Downloaded from central: https://repo.maven.apache.org/maven2/org/apache/maven/doxia/doxia-logging-api/1.4/doxia-logging-api-1.4.pom (1.5 kB at 67 kB/s)
[INFO] Downloading from central: https://repo.maven.apache.org/maven2/org/apache/maven/doxia/doxia-decoration-model/1.4/doxia-decoration-model-1.4.pom
[INFO] Downloaded from central: https://repo.maven.apache.org/maven2/org/apache/maven/doxia/doxia-decoration-model/1.4/doxia-decoration-model-1.4.pom (2.7 kB at 134 kB/s)
[INFO] Downloading from central: https://repo.maven.apache.org/maven2/org/apache/maven/doxia/doxia-sitetools/1.4/doxia-sitetools-1.4.pom
[INFO] Downloaded from central: https://repo.maven.apache.org/maven2/org/apache/maven/doxia/doxia-sitetools/1.4/doxia-sitetools-1.4.pom (17 kB at 817 kB/s)
[INFO] Downloading from central: https://repo.maven.apache.org/maven2/org/codehaus/plexus/plexus-utils/3.0.10/plexus-utils-3.0.10.pom
[INFO] Downloaded from central: https://repo.maven.apache.org/maven2/org/codehaus/plexus/plexus-utils/3.0.10/plexus-utils-3.0.10.pom (3.1 kB at 150 kB/s)
[INFO] Downloading from central: https://repo.maven.apache.org/maven2/org/apache/maven/doxia/doxia-site-renderer/1.4/doxia-site-renderer-1.4.pom
[INFO] Downloaded from central: https://repo.maven.apache.org/maven2/org/apache/maven/doxia/doxia-site-renderer/1.4/doxia-site-renderer-1.4.pom (6.1 kB at 382 kB/s)
[INFO] Downloading from central: https://repo.maven.apache.org/maven2/org/apache/maven/doxia/doxia-core/1.4/doxia-core-1.4.pom
[INFO] Downloaded from central: https://repo.maven.apache.org/maven2/org/apache/maven/doxia/doxia-core/1.4/doxia-core-1.4.pom (4.1 kB at 254 kB/s)
[INFO] Downloading from central: https://repo.maven.apache.org/maven2/org/apache/maven/doxia/doxia-module-xhtml/1.4/doxia-module-xhtml-1.4.pom
[INFO] Downloaded from central: https://repo.maven.apache.org/maven2/org/apache/maven/doxia/doxia-module-xhtml/1.4/doxia-module-xhtml-1.4.pom (1.6 kB at 82 kB/s)
[INFO] Downloading from central: https://repo.maven.apache.org/maven2/org/apache/maven/doxia/doxia-modules/1.4/doxia-modules-1.4.pom
[INFO] Downloaded from central: https://repo.maven.apache.org/maven2/org/apache/maven/doxia/doxia-modules/1.4/doxia-modules-1.4.pom (2.6 kB at 114 kB/s)
[INFO] Downloading from central: https://repo.maven.apache.org/maven2/org/apache/maven/doxia/doxia-module-fml/1.4/doxia-module-fml-1.4.pom
[INFO] Downloaded from central: https://repo.maven.apache.org/maven2/org/apache/maven/doxia/doxia-module-fml/1.4/doxia-module-fml-1.4.pom (4.8 kB at 240 kB/s)
[INFO] Downloading from central: https://repo.maven.apache.org/maven2/org/apache/maven/doxia/doxia-integration-tools/1.6/doxia-integration-tools-1.6.pom
[INFO] Downloaded from central: https://repo.maven.apache.org/maven2/org/apache/maven/doxia/doxia-integration-tools/1.6/doxia-integration-tools-1.6.pom (7.0 kB at 268 kB/s)
[INFO] Downloading from central: https://repo.maven.apache.org/maven2/org/apache/maven/doxia/doxia-tools/3/doxia-tools-3.pom
[INFO] Downloaded from central: https://repo.maven.apache.org/maven2/org/apache/maven/doxia/doxia-tools/3/doxia-tools-3.pom (9.9 kB at 523 kB/s)
[INFO] Downloading from central: https://repo.maven.apache.org/maven2/org/apache/maven/doxia/doxia-logging-api/1.6/doxia-logging-api-1.6.pom
[INFO] Downloaded from central: https://repo.maven.apache.org/maven2/org/apache/maven/doxia/doxia-logging-api/1.6/doxia-logging-api-1.6.pom (1.5 kB at 70 kB/s)
[INFO] Downloading from central: https://repo.maven.apache.org/maven2/org/apache/maven/doxia/doxia/1.6/doxia-1.6.pom
[INFO] Downloaded from central: https://repo.maven.apache.org/maven2/org/apache/maven/doxia/doxia/1.6/doxia-1.6.pom (19 kB at 1.1 MB/s)
[INFO] Downloading from central: https://repo.maven.apache.org/maven2/org/apache/maven/doxia/doxia-decoration-model/1.6/doxia-decoration-model-1.6.pom
[INFO] Downloaded from central: https://repo.maven.apache.org/maven2/org/apache/maven/doxia/doxia-decoration-model/1.6/doxia-decoration-model-1.6.pom (3.0 kB at 176 kB/s)
[INFO] Downloading from central: https://repo.maven.apache.org/maven2/org/apache/maven/doxia/doxia-sitetools/1.6/doxia-sitetools-1.6.pom
[INFO] Downloaded from central: https://repo.maven.apache.org/maven2/org/apache/maven/doxia/doxia-sitetools/1.6/doxia-sitetools-1.6.pom (18 kB at 778 kB/s)
[INFO] Downloading from central: https://repo.maven.apache.org/maven2/org/codehaus/plexus/plexus-resources/1.0.1/plexus-resources-1.0.1.pom
[INFO] Downloaded from central: https://repo.maven.apache.org/maven2/org/codehaus/plexus/plexus-resources/1.0.1/plexus-resources-1.0.1.pom (1.3 kB at 60 kB/s)
[INFO] Downloading from central: https://repo.maven.apache.org/maven2/org/codehaus/plexus/plexus-velocity/1.1.8/plexus-velocity-1.1.8.pom
[INFO] Downloaded from central: https://repo.maven.apache.org/maven2/org/codehaus/plexus/plexus-velocity/1.1.8/plexus-velocity-1.1.8.pom (1.9 kB at 101 kB/s)
[INFO] Downloading from central: https://repo.maven.apache.org/maven2/com/puppycrawl/tools/checkstyle/6.1.1/checkstyle-6.1.1.pom
[INFO] Downloaded from central: https://repo.maven.apache.org/maven2/com/puppycrawl/tools/checkstyle/6.1.1/checkstyle-6.1.1.pom (30 kB at 1.0 MB/s)
[INFO] Downloading from central: https://repo.maven.apache.org/maven2/org/sonatype/oss/oss-parent/7/oss-parent-7.pom
[INFO] Downloaded from central: https://repo.maven.apache.org/maven2/org/sonatype/oss/oss-parent/7/oss-parent-7.pom (4.8 kB at 193 kB/s)
[INFO] Downloading from central: https://repo.maven.apache.org/maven2/antlr/antlr/2.7.7/antlr-2.7.7.pom
[INFO] Downloaded from central: https://repo.maven.apache.org/maven2/antlr/antlr/2.7.7/antlr-2.7.7.pom (632 B at 37 kB/s)
[INFO] Downloading from central: https://repo.maven.apache.org/maven2/org/antlr/antlr4-runtime/4.3/antlr4-runtime-4.3.pom
[INFO] Downloaded from central: https://repo.maven.apache.org/maven2/org/antlr/antlr4-runtime/4.3/antlr4-runtime-4.3.pom (4.8 kB at 266 kB/s)
[INFO] Downloading from central: https://repo.maven.apache.org/maven2/org/antlr/antlr4-master/4.3/antlr4-master-4.3.pom
[INFO] Downloaded from central: https://repo.maven.apache.org/maven2/org/antlr/antlr4-master/4.3/antlr4-master-4.3.pom (7.9 kB at 273 kB/s)
[INFO] Downloading from central: https://repo.maven.apache.org/maven2/org/abego/treelayout/org.abego.treelayout.core/1.0.1/org.abego.treelayout.core-1.0.1.pom
[INFO] Downloaded from central: https://repo.maven.apache.org/maven2/org/abego/treelayout/org.abego.treelayout.core/1.0.1/org.abego.treelayout.core-1.0.1.pom (3.1 kB at 129 kB/s)
[INFO] Downloading from central: https://repo.maven.apache.org/maven2/org/antlr/antlr4-annotations/4.3/antlr4-annotations-4.3.pom
[INFO] Downloaded from central: https://repo.maven.apache.org/maven2/org/antlr/antlr4-annotations/4.3/antlr4-annotations-4.3.pom (1.3 kB at 75 kB/s)
[INFO] Downloading from central: https://repo.maven.apache.org/maven2/commons-beanutils/commons-beanutils-core/1.8.3/commons-beanutils-core-1.8.3.pom
[INFO] Downloaded from central: https://repo.maven.apache.org/maven2/commons-beanutils/commons-beanutils-core/1.8.3/commons-beanutils-core-1.8.3.pom (1.6 kB at 96 kB/s)
[INFO] Downloading from central: https://repo.maven.apache.org/maven2/com/google/guava/guava/18.0/guava-18.0.pom
[INFO] Downloaded from central: https://repo.maven.apache.org/maven2/com/google/guava/guava/18.0/guava-18.0.pom (5.7 kB at 81 kB/s)
[INFO] Downloading from central: https://repo.maven.apache.org/maven2/com/google/guava/guava-parent/18.0/guava-parent-18.0.pom
[INFO] Downloaded from central: https://repo.maven.apache.org/maven2/com/google/guava/guava-parent/18.0/guava-parent-18.0.pom (7.7 kB at 405 kB/s)
[INFO] Downloading from central: https://repo.maven.apache.org/maven2/org/apache/maven/reporting/maven-reporting-impl/2.3/maven-reporting-impl-2.3.jar
[INFO] Downloading from central: https://repo.maven.apache.org/maven2/commons-digester/commons-digester/1.6/commons-digester-1.6.jar
[INFO] Downloading from central: https://repo.maven.apache.org/maven2/org/apache/maven/shared/maven-shared-utils/0.6/maven-shared-utils-0.6.jar
[INFO] Downloading from central: https://repo.maven.apache.org/maven2/xml-apis/xml-apis/1.3.04/xml-apis-1.3.04.jar
[INFO] Downloading from central: https://repo.maven.apache.org/maven2/xerces/xercesImpl/2.9.1/xercesImpl-2.9.1.jar
[INFO] Downloaded from central: https://repo.maven.apache.org/maven2/org/apache/maven/reporting/maven-reporting-impl/2.3/maven-reporting-impl-2.3.jar (18 kB at 529 kB/s)
[INFO] Downloaded from central: https://repo.maven.apache.org/maven2/org/apache/maven/shared/maven-shared-utils/0.6/maven-shared-utils-0.6.jar (165 kB at 4.8 MB/s)
[INFO] Downloading from central: https://repo.maven.apache.org/maven2/org/apache/maven/shared/maven-shared-resources/2/maven-shared-resources-2.jar
[INFO] Downloaded from central: https://repo.maven.apache.org/maven2/xml-apis/xml-apis/1.3.04/xml-apis-1.3.04.jar (194 kB at 5.7 MB/s)
[INFO] Downloading from central: https://repo.maven.apache.org/maven2/commons-logging/commons-logging/1.0.4/commons-logging-1.0.4.jar
[INFO] Downloading from central: https://repo.maven.apache.org/maven2/org/apache/maven/doxia/doxia-sink-api/1.4/doxia-sink-api-1.4.jar
[INFO] Downloaded from central: https://repo.maven.apache.org/maven2/commons-digester/commons-digester/1.6/commons-digester-1.6.jar (168 kB at 4.3 MB/s)
[INFO] Downloading from central: https://repo.maven.apache.org/maven2/org/apache/maven/doxia/doxia-logging-api/1.4/doxia-logging-api-1.4.jar
[INFO] Downloaded from central: https://repo.maven.apache.org/maven2/commons-logging/commons-logging/1.0.4/commons-logging-1.0.4.jar (38 kB at 679 kB/s)
[INFO] Downloaded from central: https://repo.maven.apache.org/maven2/org/apache/maven/doxia/doxia-logging-api/1.4/doxia-logging-api-1.4.jar (11 kB at 198 kB/s)
[INFO] Downloading from central: https://repo.maven.apache.org/maven2/org/apache/maven/doxia/doxia-decoration-model/1.4/doxia-decoration-model-1.4.jar
[INFO] Downloading from central: https://repo.maven.apache.org/maven2/org/apache/maven/doxia/doxia-site-renderer/1.4/doxia-site-renderer-1.4.jar
[INFO] Downloaded from central: https://repo.maven.apache.org/maven2/org/apache/maven/shared/maven-shared-resources/2/maven-shared-resources-2.jar (13 kB at 214 kB/s)
[INFO] Downloaded from central: https://repo.maven.apache.org/maven2/org/apache/maven/doxia/doxia-sink-api/1.4/doxia-sink-api-1.4.jar (11 kB at 184 kB/s)
[INFO] Downloading from central: https://repo.maven.apache.org/maven2/org/apache/maven/doxia/doxia-module-xhtml/1.4/doxia-module-xhtml-1.4.jar
[INFO] Downloading from central: https://repo.maven.apache.org/maven2/org/apache/maven/doxia/doxia-module-fml/1.4/doxia-module-fml-1.4.jar
[INFO] Downloaded from central: https://repo.maven.apache.org/maven2/org/apache/maven/doxia/doxia-site-renderer/1.4/doxia-site-renderer-1.4.jar (53 kB at 689 kB/s)
[INFO] Downloaded from central: https://repo.maven.apache.org/maven2/org/apache/maven/doxia/doxia-decoration-model/1.4/doxia-decoration-model-1.4.jar (61 kB at 796 kB/s)
[INFO] Downloading from central: https://repo.maven.apache.org/maven2/org/apache/maven/doxia/doxia-integration-tools/1.6/doxia-integration-tools-1.6.jar
[INFO] Downloading from central: https://repo.maven.apache.org/maven2/org/codehaus/plexus/plexus-resources/1.0.1/plexus-resources-1.0.1.jar
[INFO] Downloaded from central: https://repo.maven.apache.org/maven2/org/apache/maven/doxia/doxia-module-xhtml/1.4/doxia-module-xhtml-1.4.jar (15 kB at 192 kB/s)
[INFO] Downloading from central: https://repo.maven.apache.org/maven2/org/codehaus/plexus/plexus-interpolation/1.21/plexus-interpolation-1.21.jar
[INFO] Downloaded from central: https://repo.maven.apache.org/maven2/org/apache/maven/doxia/doxia-module-fml/1.4/doxia-module-fml-1.4.jar (38 kB at 445 kB/s)
[INFO] Downloading from central: https://repo.maven.apache.org/maven2/org/codehaus/plexus/plexus-velocity/1.1.8/plexus-velocity-1.1.8.jar
[INFO] Downloaded from central: https://repo.maven.apache.org/maven2/xerces/xercesImpl/2.9.1/xercesImpl-2.9.1.jar (1.2 MB at 13 MB/s)
[INFO] Downloading from central: https://repo.maven.apache.org/maven2/com/puppycrawl/tools/checkstyle/6.1.1/checkstyle-6.1.1.jar
[INFO] Downloaded from central: https://repo.maven.apache.org/maven2/org/codehaus/plexus/plexus-resources/1.0.1/plexus-resources-1.0.1.jar (22 kB at 226 kB/s)
[INFO] Downloading from central: https://repo.maven.apache.org/maven2/antlr/antlr/2.7.7/antlr-2.7.7.jar
[INFO] Downloaded from central: https://repo.maven.apache.org/maven2/org/codehaus/plexus/plexus-interpolation/1.21/plexus-interpolation-1.21.jar (62 kB at 631 kB/s)
[INFO] Downloading from central: https://repo.maven.apache.org/maven2/org/antlr/antlr4-runtime/4.3/antlr4-runtime-4.3.jar
[INFO] Downloaded from central: https://repo.maven.apache.org/maven2/org/apache/maven/doxia/doxia-integration-tools/1.6/doxia-integration-tools-1.6.jar (45 kB at 433 kB/s)
[INFO] Downloading from central: https://repo.maven.apache.org/maven2/org/abego/treelayout/org.abego.treelayout.core/1.0.1/org.abego.treelayout.core-1.0.1.jar
[INFO] Downloaded from central: https://repo.maven.apache.org/maven2/org/codehaus/plexus/plexus-velocity/1.1.8/plexus-velocity-1.1.8.jar (7.9 kB at 75 kB/s)
[INFO] Downloading from central: https://repo.maven.apache.org/maven2/org/antlr/antlr4-annotations/4.3/antlr4-annotations-4.3.jar
[INFO] Downloaded from central: https://repo.maven.apache.org/maven2/org/abego/treelayout/org.abego.treelayout.core/1.0.1/org.abego.treelayout.core-1.0.1.jar (26 kB at 211 kB/s)
[INFO] Downloading from central: https://repo.maven.apache.org/maven2/commons-beanutils/commons-beanutils-core/1.8.3/commons-beanutils-core-1.8.3.jar
[INFO] Downloaded from central: https://repo.maven.apache.org/maven2/org/antlr/antlr4-annotations/4.3/antlr4-annotations-4.3.jar (10 kB at 75 kB/s)
[INFO] Downloading from central: https://repo.maven.apache.org/maven2/com/google/guava/guava/18.0/guava-18.0.jar
[INFO] Downloaded from central: https://repo.maven.apache.org/maven2/org/antlr/antlr4-runtime/4.3/antlr4-runtime-4.3.jar (345 kB at 2.4 MB/s)
[INFO] Downloaded from central: https://repo.maven.apache.org/maven2/antlr/antlr/2.7.7/antlr-2.7.7.jar (445 kB at 3.0 MB/s)
[INFO] Downloaded from central: https://repo.maven.apache.org/maven2/commons-beanutils/commons-beanutils-core/1.8.3/commons-beanutils-core-1.8.3.jar (207 kB at 1.3 MB/s)
[INFO] Downloaded from central: https://repo.maven.apache.org/maven2/com/puppycrawl/tools/checkstyle/6.1.1/checkstyle-6.1.1.jar (1.0 MB at 6.1 MB/s)
[INFO] Downloaded from central: https://repo.maven.apache.org/maven2/com/google/guava/guava/18.0/guava-18.0.jar (2.3 MB at 9.2 MB/s)
[INFO] ------------------------------------------------------------------------
[INFO] BUILD SUCCESS
[INFO] ------------------------------------------------------------------------
[INFO] Total time:  01:38 min
[INFO] Finished at: 2020-03-17T20:12:54-07:00
[INFO] ------------------------------------------------------------------------
[WARNING] The requested profile "run-its" could not be activated because it does not exist.
[INFO] [jenkins-event-spy] Generated F:\jenkins\jenkins-slave\workspace\4_Detect_Java_8_type_annotations@2@tmp\withMaven7e8dab79\maven-spy-20200317-201115-504578216636158017289.log
Picked up JAVA_TOOL_OPTIONS: -Dmaven.ext.class.path="f:\jenkins\jenkins-slave\workspace\4_Detect_Java_8_type_annotations@2@tmp\withMaven7e8dab79\pipeline-maven-spy.jar" -Dorg.jenkinsci.plugins.pipeline.maven.reportsFolder="f:\jenkins\jenkins-slave\workspace\4_Detect_Java_8_type_annotations@2@tmp\withMaven7e8dab79"
[Pipeline] }
[Pipeline] // dir
[Pipeline] }
[withMaven] junitPublisher - Archive test results for Maven artifact org.apache.maven.shared:maven-dependency-analyzer:jar:1.8-SNAPSHOT generated by maven-surefire-plugin:test (default-test): m\target\surefire-reports\*.xml
Recording test results
[withMaven] Publishers: Pipeline Graph Publisher: 1 ms, Junit Publisher: 279 ms
[withMaven] junitPublisher - Archive test results for Maven artifact org.apache.maven.shared.dependency-analyzer.tests:jarWithXercesDependencies:jar:1.0 generated by maven-surefire-plugin:test (default-test): m\target\test-classes\jarWithXmlTransitiveDependency\target\surefire-reports\*.xml
Recording test results
None of the test reports contained any result
[withMaven] Publishers: Junit Publisher: 33 ms
[withMaven] junitPublisher - Archive test results for Maven artifact org.apache.maven.shared.dependency-analyzer.tests:jarWithNoDependencies:jar:1.0 generated by maven-surefire-plugin:test (default-test): m\target\test-classes\jarWithNoDependencies\target\surefire-reports\*.xml
Recording test results
None of the test reports contained any result
[withMaven] Publishers: Junit Publisher: 30 ms
[withMaven] Publishers:
[withMaven] junitPublisher - Archive test results for Maven artifact org.apache.maven.shared.dependency-analyzer.tests:jarWithTestDependency1:jar:1.0 generated by maven-surefire-plugin:test (default-test): m\target\test-classes\jarWithTestDependency\project1\target\surefire-reports\*.xml
[withMaven] junitPublisher - Archive test results for Maven artifact org.apache.maven.shared.dependency-analyzer.tests:jarWithTestDependency2:jar:1.0 generated by maven-surefire-plugin:test (default-test): m\target\test-classes\jarWithTestDependency\project2\target\surefire-reports\*.xml
Recording test results
None of the test reports contained any result
[withMaven] Publishers: Pipeline Graph Publisher: 1 ms, Junit Publisher: 33 ms
[withMaven] junitPublisher - Archive test results for Maven artifact org.apache.maven.shared.dependency-analyzer.tests:jarWithTestDependency1:jar:1.0 generated by maven-surefire-plugin:test (default-test): m\target\test-classes\jarWithTestDependency\project1\target\surefire-reports\*.xml
[withMaven] junitPublisher - Archive test results for Maven artifact org.apache.maven.shared.dependency-analyzer.tests:jarWithTestDependency2:jar:1.0 generated by maven-surefire-plugin:test (default-test): m\target\test-classes\jarWithTestDependency\project2\target\surefire-reports\*.xml
Recording test results
None of the test reports contained any result
[withMaven] Publishers: Pipeline Graph Publisher: 1 ms, Junit Publisher: 41 ms
[withMaven] junitPublisher - Archive test results for Maven artifact org.apache.maven.shared.dependency-analyzer.tests:jarWithCompileDependency1:jar:1.0 generated by maven-surefire-plugin:test (default-test): m\target\test-classes\jarWithCompileDependency\project1\target\surefire-reports\*.xml
[withMaven] junitPublisher - Archive test results for Maven artifact org.apache.maven.shared.dependency-analyzer.tests:jarWithCompileDependency2:jar:1.0 generated by maven-surefire-plugin:test (default-test): m\target\test-classes\jarWithCompileDependency\project2\target\surefire-reports\*.xml
Recording test results
None of the test reports contained any result
[withMaven] Publishers: Pipeline Graph Publisher: 1 ms, Junit Publisher: 26 ms
[withMaven] junitPublisher - Archive test results for Maven artifact org.apache.maven.shared.dependency-analyzer.tests:java8methodreferences:jar:1.0 generated by maven-surefire-plugin:test (default-test): m\target\test-classes\java8methodRefs\target\surefire-reports\*.xml
Recording test results
None of the test reports contained any result
[withMaven] Publishers: Junit Publisher: 37 ms
[withMaven] junitPublisher - Archive test results for Maven artifact org.apache.maven.shared.dependency-analyzer.tests:inlinedStaticReference:jar:1.0 generated by maven-surefire-plugin:test (default-test): m\target\test-classes\inlinedStaticReference\target\surefire-reports\*.xml
Recording test results
None of the test reports contained any result
[withMaven] Publishers: Junit Publisher: 39 ms
[withMaven] junitPublisher - Archive test results for Maven artifact org.apache.maven.shared.dependency-analyzer.tests:typeUseAnnotationDependencyAnnotation:jar:1.0 generated by maven-surefire-plugin:test (default-test): m\target\test-classes\typeUseAnnotationDependency\annotation\target\surefire-reports\*.xml
[withMaven] junitPublisher - Archive test results for Maven artifact org.apache.maven.shared.dependency-analyzer.tests:typeUseAnnotationDependencyUsage:jar:1.0 generated by maven-surefire-plugin:test (default-test): m\target\test-classes\typeUseAnnotationDependency\usage\target\surefire-reports\*.xml
Recording test results
None of the test reports contained any result
[withMaven] Publishers: Pipeline Graph Publisher: 1 ms, Junit Publisher: 34 ms
[withMaven] junitPublisher - Archive test results for Maven artifact org.apache.maven.its.dependency:test-module1:jar:1.0 generated by maven-surefire-plugin:test (default-test): m\target\test-classes\multimoduleProject\module1\target\surefire-reports\*.xml
[withMaven] junitPublisher - Archive test results for Maven artifact org.apache.maven.its.dependency:test-module2:jar:1.0 generated by maven-surefire-plugin:test (default-test): m\target\test-classes\multimoduleProject\module2\target\surefire-reports\*.xml
Recording test results
None of the test reports contained any result
[withMaven] Publishers: Pipeline Graph Publisher: 1 ms, Junit Publisher: 36 ms
[Pipeline] // withMaven
[Pipeline] cleanWs
[WS-CLEANUP] Deleting project workspace...
[WS-CLEANUP] Deferred wipeout is used...
[WS-CLEANUP] done
[Pipeline] }
[Pipeline] // stage
[Pipeline] }
[Pipeline] // node
[Pipeline] }
[Pipeline] // parallel
[Pipeline] echo
[FAILURE-003] AbortException hudson.AbortException: script returned exit code 1
[Pipeline] stage
[Pipeline] { (Notifications)
[Pipeline] echo
Build result: FAILURE
[Pipeline] jiraIssueSelector
[Pipeline] echo
The authors of changes [rfscholte].
[Pipeline] echo
Sending email ...
[Pipeline] emailext
Reply | Threaded
Open this post in threaded view
|

Build failed in Jenkins: Maven TLP » maven-dependency-analyzer » MSHARED-674_Detect_Java_8_type_annotations #26

Apache Jenkins Server-2
See https://builds.apache.org/job/maven-box/job/maven-dependency-analyzer/job/MSHARED-674_Detect_Java_8_type_annotations/26/

Changes:

* Java 14 released, so Java 13 EOL. Include Java 15-ea

34 tests failed.
FAILED:  org.apache.maven.shared.dependency.analyzer.DefaultProjectDependencyAnalyzerTest.windows-jdk11 / Build windows-jdk11 / testJarWithXmlTransitiveDependency

Error Message:
null

Stack Trace:
java.lang.NullPointerException: null
        at org.apache.commons.lang3.SystemUtils.isJavaVersionAtLeast(SystemUtils.java:1626)
        at org.apache.maven.shared.dependency.analyzer.DefaultProjectDependencyAnalyzerTest.compileProject(DefaultProjectDependencyAnalyzerTest.java:342)
        at org.apache.maven.shared.dependency.analyzer.DefaultProjectDependencyAnalyzerTest.compileProject(DefaultProjectDependencyAnalyzerTest.java:337)
        at org.apache.maven.shared.dependency.analyzer.DefaultProjectDependencyAnalyzerTest.testJarWithXmlTransitiveDependency(DefaultProjectDependencyAnalyzerTest.java:262)


FAILED:  org.apache.maven.shared.dependency.analyzer.DefaultProjectDependencyAnalyzerTest.windows-jdk11 / Build windows-jdk11 / testJarWithNoDependencies

Error Message:
null

Stack Trace:
java.lang.NullPointerException: null
        at org.apache.commons.lang3.SystemUtils.isJavaVersionAtLeast(SystemUtils.java:1626)
        at org.apache.maven.shared.dependency.analyzer.DefaultProjectDependencyAnalyzerTest.compileProject(DefaultProjectDependencyAnalyzerTest.java:342)
        at org.apache.maven.shared.dependency.analyzer.DefaultProjectDependencyAnalyzerTest.compileProject(DefaultProjectDependencyAnalyzerTest.java:337)
        at org.apache.maven.shared.dependency.analyzer.DefaultProjectDependencyAnalyzerTest.testJarWithNoDependencies(DefaultProjectDependencyAnalyzerTest.java:111)


FAILED:  org.apache.maven.shared.dependency.analyzer.DefaultProjectDependencyAnalyzerTest.windows-jdk11 / Build windows-jdk11 / testPom

Error Message:
null

Stack Trace:
java.lang.NullPointerException: null
        at org.apache.commons.lang3.SystemUtils.isJavaVersionAtLeast(SystemUtils.java:1626)
        at org.apache.maven.shared.dependency.analyzer.DefaultProjectDependencyAnalyzerTest.compileProject(DefaultProjectDependencyAnalyzerTest.java:342)
        at org.apache.maven.shared.dependency.analyzer.DefaultProjectDependencyAnalyzerTest.compileProject(DefaultProjectDependencyAnalyzerTest.java:337)
        at org.apache.maven.shared.dependency.analyzer.DefaultProjectDependencyAnalyzerTest.testPom(DefaultProjectDependencyAnalyzerTest.java:97)


FAILED:  org.apache.maven.shared.dependency.analyzer.DefaultProjectDependencyAnalyzerTest.windows-jdk11 / Build windows-jdk11 / testForceDeclaredDependenciesUsage

Error Message:
null

Stack Trace:
java.lang.NullPointerException: null
        at org.apache.commons.lang3.SystemUtils.isJavaVersionAtLeast(SystemUtils.java:1626)
        at org.apache.maven.shared.dependency.analyzer.DefaultProjectDependencyAnalyzerTest.compileProject(DefaultProjectDependencyAnalyzerTest.java:342)
        at org.apache.maven.shared.dependency.analyzer.DefaultProjectDependencyAnalyzerTest.compileProject(DefaultProjectDependencyAnalyzerTest.java:337)
        at org.apache.maven.shared.dependency.analyzer.DefaultProjectDependencyAnalyzerTest.testForceDeclaredDependenciesUsage(DefaultProjectDependencyAnalyzerTest.java:198)


FAILED:  org.apache.maven.shared.dependency.analyzer.DefaultProjectDependencyAnalyzerTest.windows-jdk11 / Build windows-jdk11 / testJarWithTestDependency

Error Message:
null

Stack Trace:
java.lang.NullPointerException: null
        at org.apache.commons.lang3.SystemUtils.isJavaVersionAtLeast(SystemUtils.java:1626)
        at org.apache.maven.shared.dependency.analyzer.DefaultProjectDependencyAnalyzerTest.compileProject(DefaultProjectDependencyAnalyzerTest.java:342)
        at org.apache.maven.shared.dependency.analyzer.DefaultProjectDependencyAnalyzerTest.compileProject(DefaultProjectDependencyAnalyzerTest.java:337)
        at org.apache.maven.shared.dependency.analyzer.DefaultProjectDependencyAnalyzerTest.testJarWithTestDependency(DefaultProjectDependencyAnalyzerTest.java:232)


FAILED:  org.apache.maven.shared.dependency.analyzer.DefaultProjectDependencyAnalyzerTest.windows-jdk11 / Build windows-jdk11 / testJarWithCompileDependency

Error Message:
null

Stack Trace:
java.lang.NullPointerException: null
        at org.apache.commons.lang3.SystemUtils.isJavaVersionAtLeast(SystemUtils.java:1626)
        at org.apache.maven.shared.dependency.analyzer.DefaultProjectDependencyAnalyzerTest.compileProject(DefaultProjectDependencyAnalyzerTest.java:342)
        at org.apache.maven.shared.dependency.analyzer.DefaultProjectDependencyAnalyzerTest.compileProject(DefaultProjectDependencyAnalyzerTest.java:337)
        at org.apache.maven.shared.dependency.analyzer.DefaultProjectDependencyAnalyzerTest.testJarWithCompileDependency(DefaultProjectDependencyAnalyzerTest.java:174)


FAILED:  org.apache.maven.shared.dependency.analyzer.DefaultProjectDependencyAnalyzerTest.windows-jdk11 / Build windows-jdk11 / testJava8methodRefs

Error Message:
null

Stack Trace:
java.lang.NullPointerException: null
        at org.apache.commons.lang3.SystemUtils.isJavaVersionAtLeast(SystemUtils.java:1626)
        at org.apache.maven.shared.dependency.analyzer.DefaultProjectDependencyAnalyzerTest.testJava8methodRefs(DefaultProjectDependencyAnalyzerTest.java:125)


FAILED:  org.apache.maven.shared.dependency.analyzer.DefaultProjectDependencyAnalyzerTest.windows-jdk11 / Build windows-jdk11 / testInlinedStaticReference

Error Message:
null

Stack Trace:
java.lang.NullPointerException: null
        at org.apache.commons.lang3.SystemUtils.isJavaVersionAtLeast(SystemUtils.java:1626)
        at org.apache.maven.shared.dependency.analyzer.DefaultProjectDependencyAnalyzerTest.testInlinedStaticReference(DefaultProjectDependencyAnalyzerTest.java:150)


FAILED:  org.apache.maven.shared.dependency.analyzer.DefaultProjectDependencyAnalyzerTest.windows-jdk11 / Build windows-jdk11 / testTypeUseAnnotationDependency

Error Message:
null

Stack Trace:
java.lang.NullPointerException: null
        at org.apache.commons.lang3.SystemUtils.isJavaVersionAtLeast(SystemUtils.java:1626)
        at org.apache.maven.shared.dependency.analyzer.DefaultProjectDependencyAnalyzerTest.testTypeUseAnnotationDependency(DefaultProjectDependencyAnalyzerTest.java:310)


FAILED:  org.apache.maven.shared.dependency.analyzer.DefaultProjectDependencyAnalyzerTest.windows-jdk11 / Build windows-jdk11 / testMultimoduleProject

Error Message:
null

Stack Trace:
java.lang.NullPointerException: null
        at org.apache.commons.lang3.SystemUtils.isJavaVersionAtLeast(SystemUtils.java:1626)
        at org.apache.maven.shared.dependency.analyzer.DefaultProjectDependencyAnalyzerTest.compileProject(DefaultProjectDependencyAnalyzerTest.java:342)
        at org.apache.maven.shared.dependency.analyzer.DefaultProjectDependencyAnalyzerTest.compileProject(DefaultProjectDependencyAnalyzerTest.java:337)
        at org.apache.maven.shared.dependency.analyzer.DefaultProjectDependencyAnalyzerTest.testMultimoduleProject(DefaultProjectDependencyAnalyzerTest.java:280)


FAILED:  org.apache.maven.shared.dependency.analyzer.DefaultProjectDependencyAnalyzerTest.windows-jdk7 / Build windows-jdk7 / testJarWithXmlTransitiveDependency

Error Message:
Error compiling test project expected:<0> but was:<1>

Stack Trace:
junit.framework.AssertionFailedError: Error compiling test project expected:<0> but was:<1>
        at junit.framework.Assert.fail(Assert.java:57)
        at junit.framework.Assert.failNotEquals(Assert.java:329)
        at junit.framework.Assert.assertEquals(Assert.java:78)
        at junit.framework.Assert.assertEquals(Assert.java:234)
        at junit.framework.TestCase.assertEquals(TestCase.java:401)
        at org.apache.maven.shared.dependency.analyzer.DefaultProjectDependencyAnalyzerTest.compileProject(DefaultProjectDependencyAnalyzerTest.java:358)
        at org.apache.maven.shared.dependency.analyzer.DefaultProjectDependencyAnalyzerTest.compileProject(DefaultProjectDependencyAnalyzerTest.java:337)
        at org.apache.maven.shared.dependency.analyzer.DefaultProjectDependencyAnalyzerTest.testJarWithXmlTransitiveDependency(DefaultProjectDependencyAnalyzerTest.java:262)


FAILED:  org.apache.maven.shared.dependency.analyzer.DefaultProjectDependencyAnalyzerTest.windows-jdk7 / Build windows-jdk7 / testJarWithNoDependencies

Error Message:
Error compiling test project expected:<0> but was:<1>

Stack Trace:
junit.framework.AssertionFailedError: Error compiling test project expected:<0> but was:<1>
        at junit.framework.Assert.fail(Assert.java:57)
        at junit.framework.Assert.failNotEquals(Assert.java:329)
        at junit.framework.Assert.assertEquals(Assert.java:78)
        at junit.framework.Assert.assertEquals(Assert.java:234)
        at junit.framework.TestCase.assertEquals(TestCase.java:401)
        at org.apache.maven.shared.dependency.analyzer.DefaultProjectDependencyAnalyzerTest.compileProject(DefaultProjectDependencyAnalyzerTest.java:358)
        at org.apache.maven.shared.dependency.analyzer.DefaultProjectDependencyAnalyzerTest.compileProject(DefaultProjectDependencyAnalyzerTest.java:337)
        at org.apache.maven.shared.dependency.analyzer.DefaultProjectDependencyAnalyzerTest.testJarWithNoDependencies(DefaultProjectDependencyAnalyzerTest.java:111)


FAILED:  org.apache.maven.shared.dependency.analyzer.DefaultProjectDependencyAnalyzerTest.windows-jdk7 / Build windows-jdk7 / testPom

Error Message:
Error compiling test project expected:<0> but was:<1>

Stack Trace:
junit.framework.AssertionFailedError: Error compiling test project expected:<0> but was:<1>
        at junit.framework.Assert.fail(Assert.java:57)
        at junit.framework.Assert.failNotEquals(Assert.java:329)
        at junit.framework.Assert.assertEquals(Assert.java:78)
        at junit.framework.Assert.assertEquals(Assert.java:234)
        at junit.framework.TestCase.assertEquals(TestCase.java:401)
        at org.apache.maven.shared.dependency.analyzer.DefaultProjectDependencyAnalyzerTest.compileProject(DefaultProjectDependencyAnalyzerTest.java:358)
        at org.apache.maven.shared.dependency.analyzer.DefaultProjectDependencyAnalyzerTest.compileProject(DefaultProjectDependencyAnalyzerTest.java:337)
        at org.apache.maven.shared.dependency.analyzer.DefaultProjectDependencyAnalyzerTest.testPom(DefaultProjectDependencyAnalyzerTest.java:97)


FAILED:  org.apache.maven.shared.dependency.analyzer.DefaultProjectDependencyAnalyzerTest.windows-jdk7 / Build windows-jdk7 / testForceDeclaredDependenciesUsage

Error Message:
Error compiling test project expected:<0> but was:<1>

Stack Trace:
junit.framework.AssertionFailedError: Error compiling test project expected:<0> but was:<1>
        at junit.framework.Assert.fail(Assert.java:57)
        at junit.framework.Assert.failNotEquals(Assert.java:329)
        at junit.framework.Assert.assertEquals(Assert.java:78)
        at junit.framework.Assert.assertEquals(Assert.java:234)
        at junit.framework.TestCase.assertEquals(TestCase.java:401)
        at org.apache.maven.shared.dependency.analyzer.DefaultProjectDependencyAnalyzerTest.compileProject(DefaultProjectDependencyAnalyzerTest.java:358)
        at org.apache.maven.shared.dependency.analyzer.DefaultProjectDependencyAnalyzerTest.compileProject(DefaultProjectDependencyAnalyzerTest.java:337)
        at org.apache.maven.shared.dependency.analyzer.DefaultProjectDependencyAnalyzerTest.testForceDeclaredDependenciesUsage(DefaultProjectDependencyAnalyzerTest.java:198)


FAILED:  org.apache.maven.shared.dependency.analyzer.DefaultProjectDependencyAnalyzerTest.windows-jdk7 / Build windows-jdk7 / testJarWithTestDependency

Error Message:
Error compiling test project expected:<0> but was:<1>

Stack Trace:
junit.framework.AssertionFailedError: Error compiling test project expected:<0> but was:<1>
        at junit.framework.Assert.fail(Assert.java:57)
        at junit.framework.Assert.failNotEquals(Assert.java:329)
        at junit.framework.Assert.assertEquals(Assert.java:78)
        at junit.framework.Assert.assertEquals(Assert.java:234)
        at junit.framework.TestCase.assertEquals(TestCase.java:401)
        at org.apache.maven.shared.dependency.analyzer.DefaultProjectDependencyAnalyzerTest.compileProject(DefaultProjectDependencyAnalyzerTest.java:358)
        at org.apache.maven.shared.dependency.analyzer.DefaultProjectDependencyAnalyzerTest.compileProject(DefaultProjectDependencyAnalyzerTest.java:337)
        at org.apache.maven.shared.dependency.analyzer.DefaultProjectDependencyAnalyzerTest.testJarWithTestDependency(DefaultProjectDependencyAnalyzerTest.java:232)


FAILED:  org.apache.maven.shared.dependency.analyzer.DefaultProjectDependencyAnalyzerTest.windows-jdk7 / Build windows-jdk7 / testJarWithCompileDependency

Error Message:
Error compiling test project expected:<0> but was:<1>

Stack Trace:
junit.framework.AssertionFailedError: Error compiling test project expected:<0> but was:<1>
        at junit.framework.Assert.fail(Assert.java:57)
        at junit.framework.Assert.failNotEquals(Assert.java:329)
        at junit.framework.Assert.assertEquals(Assert.java:78)
        at junit.framework.Assert.assertEquals(Assert.java:234)
        at junit.framework.TestCase.assertEquals(TestCase.java:401)
        at org.apache.maven.shared.dependency.analyzer.DefaultProjectDependencyAnalyzerTest.compileProject(DefaultProjectDependencyAnalyzerTest.java:358)
        at org.apache.maven.shared.dependency.analyzer.DefaultProjectDependencyAnalyzerTest.compileProject(DefaultProjectDependencyAnalyzerTest.java:337)
        at org.apache.maven.shared.dependency.analyzer.DefaultProjectDependencyAnalyzerTest.testJarWithCompileDependency(DefaultProjectDependencyAnalyzerTest.java:174)


FAILED:  org.apache.maven.shared.dependency.analyzer.DefaultProjectDependencyAnalyzerTest.windows-jdk7 / Build windows-jdk7 / testMultimoduleProject

Error Message:
Error compiling test project expected:<0> but was:<1>

Stack Trace:
junit.framework.AssertionFailedError: Error compiling test project expected:<0> but was:<1>
        at junit.framework.Assert.fail(Assert.java:57)
        at junit.framework.Assert.failNotEquals(Assert.java:329)
        at junit.framework.Assert.assertEquals(Assert.java:78)
        at junit.framework.Assert.assertEquals(Assert.java:234)
        at junit.framework.TestCase.assertEquals(TestCase.java:401)
        at org.apache.maven.shared.dependency.analyzer.DefaultProjectDependencyAnalyzerTest.compileProject(DefaultProjectDependencyAnalyzerTest.java:358)
        at org.apache.maven.shared.dependency.analyzer.DefaultProjectDependencyAnalyzerTest.compileProject(DefaultProjectDependencyAnalyzerTest.java:337)
        at org.apache.maven.shared.dependency.analyzer.DefaultProjectDependencyAnalyzerTest.testMultimoduleProject(DefaultProjectDependencyAnalyzerTest.java:280)


FAILED:  org.apache.maven.shared.dependency.analyzer.DefaultProjectDependencyAnalyzerTest.linux-jdk7 / Build linux-jdk7 / testJarWithXmlTransitiveDependency

Error Message:
Error compiling test project expected:<0> but was:<1>

Stack Trace:
junit.framework.AssertionFailedError: Error compiling test project expected:<0> but was:<1>
        at junit.framework.Assert.fail(Assert.java:57)
        at junit.framework.Assert.failNotEquals(Assert.java:329)
        at junit.framework.Assert.assertEquals(Assert.java:78)
        at junit.framework.Assert.assertEquals(Assert.java:234)
        at junit.framework.TestCase.assertEquals(TestCase.java:401)
        at org.apache.maven.shared.dependency.analyzer.DefaultProjectDependencyAnalyzerTest.compileProject(DefaultProjectDependencyAnalyzerTest.java:358)
        at org.apache.maven.shared.dependency.analyzer.DefaultProjectDependencyAnalyzerTest.compileProject(DefaultProjectDependencyAnalyzerTest.java:337)
        at org.apache.maven.shared.dependency.analyzer.DefaultProjectDependencyAnalyzerTest.testJarWithXmlTransitiveDependency(DefaultProjectDependencyAnalyzerTest.java:262)


FAILED:  org.apache.maven.shared.dependency.analyzer.DefaultProjectDependencyAnalyzerTest.linux-jdk7 / Build linux-jdk7 / testJarWithNoDependencies

Error Message:
Error compiling test project expected:<0> but was:<1>

Stack Trace:
junit.framework.AssertionFailedError: Error compiling test project expected:<0> but was:<1>
        at junit.framework.Assert.fail(Assert.java:57)
        at junit.framework.Assert.failNotEquals(Assert.java:329)
        at junit.framework.Assert.assertEquals(Assert.java:78)
        at junit.framework.Assert.assertEquals(Assert.java:234)
        at junit.framework.TestCase.assertEquals(TestCase.java:401)
        at org.apache.maven.shared.dependency.analyzer.DefaultProjectDependencyAnalyzerTest.compileProject(DefaultProjectDependencyAnalyzerTest.java:358)
        at org.apache.maven.shared.dependency.analyzer.DefaultProjectDependencyAnalyzerTest.compileProject(DefaultProjectDependencyAnalyzerTest.java:337)
        at org.apache.maven.shared.dependency.analyzer.DefaultProjectDependencyAnalyzerTest.testJarWithNoDependencies(DefaultProjectDependencyAnalyzerTest.java:111)


FAILED:  org.apache.maven.shared.dependency.analyzer.DefaultProjectDependencyAnalyzerTest.linux-jdk7 / Build linux-jdk7 / testPom

Error Message:
Error compiling test project expected:<0> but was:<1>

Stack Trace:
junit.framework.AssertionFailedError: Error compiling test project expected:<0> but was:<1>
        at junit.framework.Assert.fail(Assert.java:57)
        at junit.framework.Assert.failNotEquals(Assert.java:329)
        at junit.framework.Assert.assertEquals(Assert.java:78)
        at junit.framework.Assert.assertEquals(Assert.java:234)
        at junit.framework.TestCase.assertEquals(TestCase.java:401)
        at org.apache.maven.shared.dependency.analyzer.DefaultProjectDependencyAnalyzerTest.compileProject(DefaultProjectDependencyAnalyzerTest.java:358)
        at org.apache.maven.shared.dependency.analyzer.DefaultProjectDependencyAnalyzerTest.compileProject(DefaultProjectDependencyAnalyzerTest.java:337)
        at org.apache.maven.shared.dependency.analyzer.DefaultProjectDependencyAnalyzerTest.testPom(DefaultProjectDependencyAnalyzerTest.java:97)


FAILED:  org.apache.maven.shared.dependency.analyzer.DefaultProjectDependencyAnalyzerTest.linux-jdk7 / Build linux-jdk7 / testForceDeclaredDependenciesUsage

Error Message:
Error compiling test project expected:<0> but was:<1>

Stack Trace:
junit.framework.AssertionFailedError: Error compiling test project expected:<0> but was:<1>
        at junit.framework.Assert.fail(Assert.java:57)
        at junit.framework.Assert.failNotEquals(Assert.java:329)
        at junit.framework.Assert.assertEquals(Assert.java:78)
        at junit.framework.Assert.assertEquals(Assert.java:234)
        at junit.framework.TestCase.assertEquals(TestCase.java:401)
        at org.apache.maven.shared.dependency.analyzer.DefaultProjectDependencyAnalyzerTest.compileProject(DefaultProjectDependencyAnalyzerTest.java:358)
        at org.apache.maven.shared.dependency.analyzer.DefaultProjectDependencyAnalyzerTest.compileProject(DefaultProjectDependencyAnalyzerTest.java:337)
        at org.apache.maven.shared.dependency.analyzer.DefaultProjectDependencyAnalyzerTest.testForceDeclaredDependenciesUsage(DefaultProjectDependencyAnalyzerTest.java:198)


FAILED:  org.apache.maven.shared.dependency.analyzer.DefaultProjectDependencyAnalyzerTest.linux-jdk7 / Build linux-jdk7 / testJarWithTestDependency

Error Message:
Error compiling test project expected:<0> but was:<1>

Stack Trace:
junit.framework.AssertionFailedError: Error compiling test project expected:<0> but was:<1>
        at junit.framework.Assert.fail(Assert.java:57)
        at junit.framework.Assert.failNotEquals(Assert.java:329)
        at junit.framework.Assert.assertEquals(Assert.java:78)
        at junit.framework.Assert.assertEquals(Assert.java:234)
        at junit.framework.TestCase.assertEquals(TestCase.java:401)
        at org.apache.maven.shared.dependency.analyzer.DefaultProjectDependencyAnalyzerTest.compileProject(DefaultProjectDependencyAnalyzerTest.java:358)
        at org.apache.maven.shared.dependency.analyzer.DefaultProjectDependencyAnalyzerTest.compileProject(DefaultProjectDependencyAnalyzerTest.java:337)
        at org.apache.maven.shared.dependency.analyzer.DefaultProjectDependencyAnalyzerTest.testJarWithTestDependency(DefaultProjectDependencyAnalyzerTest.java:232)


FAILED:  org.apache.maven.shared.dependency.analyzer.DefaultProjectDependencyAnalyzerTest.linux-jdk7 / Build linux-jdk7 / testJarWithCompileDependency

Error Message:
Error compiling test project expected:<0> but was:<1>

Stack Trace:
junit.framework.AssertionFailedError: Error compiling test project expected:<0> but was:<1>
        at junit.framework.Assert.fail(Assert.java:57)
        at junit.framework.Assert.failNotEquals(Assert.java:329)
        at junit.framework.Assert.assertEquals(Assert.java:78)
        at junit.framework.Assert.assertEquals(Assert.java:234)
        at junit.framework.TestCase.assertEquals(TestCase.java:401)
        at org.apache.maven.shared.dependency.analyzer.DefaultProjectDependencyAnalyzerTest.compileProject(DefaultProjectDependencyAnalyzerTest.java:358)
        at org.apache.maven.shared.dependency.analyzer.DefaultProjectDependencyAnalyzerTest.compileProject(DefaultProjectDependencyAnalyzerTest.java:337)
        at org.apache.maven.shared.dependency.analyzer.DefaultProjectDependencyAnalyzerTest.testJarWithCompileDependency(DefaultProjectDependencyAnalyzerTest.java:174)


FAILED:  org.apache.maven.shared.dependency.analyzer.DefaultProjectDependencyAnalyzerTest.linux-jdk7 / Build linux-jdk7 / testMultimoduleProject

Error Message:
Error compiling test project expected:<0> but was:<1>

Stack Trace:
junit.framework.AssertionFailedError: Error compiling test project expected:<0> but was:<1>
        at junit.framework.Assert.fail(Assert.java:57)
        at junit.framework.Assert.failNotEquals(Assert.java:329)
        at junit.framework.Assert.assertEquals(Assert.java:78)
        at junit.framework.Assert.assertEquals(Assert.java:234)
        at junit.framework.TestCase.assertEquals(TestCase.java:401)
        at org.apache.maven.shared.dependency.analyzer.DefaultProjectDependencyAnalyzerTest.compileProject(DefaultProjectDependencyAnalyzerTest.java:358)
        at org.apache.maven.shared.dependency.analyzer.DefaultProjectDependencyAnalyzerTest.compileProject(DefaultProjectDependencyAnalyzerTest.java:337)
        at org.apache.maven.shared.dependency.analyzer.DefaultProjectDependencyAnalyzerTest.testMultimoduleProject(DefaultProjectDependencyAnalyzerTest.java:280)


FAILED:  org.apache.maven.shared.dependency.analyzer.DefaultProjectDependencyAnalyzerTest.linux-jdk11 / Build linux-jdk11 / testJarWithXmlTransitiveDependency

Error Message:
null

Stack Trace:
java.lang.NullPointerException: null
        at org.apache.commons.lang3.SystemUtils.isJavaVersionAtLeast(SystemUtils.java:1626)
        at org.apache.maven.shared.dependency.analyzer.DefaultProjectDependencyAnalyzerTest.compileProject(DefaultProjectDependencyAnalyzerTest.java:342)
        at org.apache.maven.shared.dependency.analyzer.DefaultProjectDependencyAnalyzerTest.compileProject(DefaultProjectDependencyAnalyzerTest.java:337)
        at org.apache.maven.shared.dependency.analyzer.DefaultProjectDependencyAnalyzerTest.testJarWithXmlTransitiveDependency(DefaultProjectDependencyAnalyzerTest.java:262)


FAILED:  org.apache.maven.shared.dependency.analyzer.DefaultProjectDependencyAnalyzerTest.linux-jdk11 / Build linux-jdk11 / testJarWithNoDependencies

Error Message:
null

Stack Trace:
java.lang.NullPointerException: null
        at org.apache.commons.lang3.SystemUtils.isJavaVersionAtLeast(SystemUtils.java:1626)
        at org.apache.maven.shared.dependency.analyzer.DefaultProjectDependencyAnalyzerTest.compileProject(DefaultProjectDependencyAnalyzerTest.java:342)
        at org.apache.maven.shared.dependency.analyzer.DefaultProjectDependencyAnalyzerTest.compileProject(DefaultProjectDependencyAnalyzerTest.java:337)
        at org.apache.maven.shared.dependency.analyzer.DefaultProjectDependencyAnalyzerTest.testJarWithNoDependencies(DefaultProjectDependencyAnalyzerTest.java:111)


FAILED:  org.apache.maven.shared.dependency.analyzer.DefaultProjectDependencyAnalyzerTest.linux-jdk11 / Build linux-jdk11 / testPom

Error Message:
null

Stack Trace:
java.lang.NullPointerException: null
        at org.apache.commons.lang3.SystemUtils.isJavaVersionAtLeast(SystemUtils.java:1626)
        at org.apache.maven.shared.dependency.analyzer.DefaultProjectDependencyAnalyzerTest.compileProject(DefaultProjectDependencyAnalyzerTest.java:342)
        at org.apache.maven.shared.dependency.analyzer.DefaultProjectDependencyAnalyzerTest.compileProject(DefaultProjectDependencyAnalyzerTest.java:337)
        at org.apache.maven.shared.dependency.analyzer.DefaultProjectDependencyAnalyzerTest.testPom(DefaultProjectDependencyAnalyzerTest.java:97)


FAILED:  org.apache.maven.shared.dependency.analyzer.DefaultProjectDependencyAnalyzerTest.linux-jdk11 / Build linux-jdk11 / testForceDeclaredDependenciesUsage

Error Message:
null

Stack Trace:
java.lang.NullPointerException: null
        at org.apache.commons.lang3.SystemUtils.isJavaVersionAtLeast(SystemUtils.java:1626)
        at org.apache.maven.shared.dependency.analyzer.DefaultProjectDependencyAnalyzerTest.compileProject(DefaultProjectDependencyAnalyzerTest.java:342)
        at org.apache.maven.shared.dependency.analyzer.DefaultProjectDependencyAnalyzerTest.compileProject(DefaultProjectDependencyAnalyzerTest.java:337)
        at org.apache.maven.shared.dependency.analyzer.DefaultProjectDependencyAnalyzerTest.testForceDeclaredDependenciesUsage(DefaultProjectDependencyAnalyzerTest.java:198)


FAILED:  org.apache.maven.shared.dependency.analyzer.DefaultProjectDependencyAnalyzerTest.linux-jdk11 / Build linux-jdk11 / testJarWithTestDependency

Error Message:
null

Stack Trace:
java.lang.NullPointerException: null
        at org.apache.commons.lang3.SystemUtils.isJavaVersionAtLeast(SystemUtils.java:1626)
        at org.apache.maven.shared.dependency.analyzer.DefaultProjectDependencyAnalyzerTest.compileProject(DefaultProjectDependencyAnalyzerTest.java:342)
        at org.apache.maven.shared.dependency.analyzer.DefaultProjectDependencyAnalyzerTest.compileProject(DefaultProjectDependencyAnalyzerTest.java:337)
        at org.apache.maven.shared.dependency.analyzer.DefaultProjectDependencyAnalyzerTest.testJarWithTestDependency(DefaultProjectDependencyAnalyzerTest.java:232)


FAILED:  org.apache.maven.shared.dependency.analyzer.DefaultProjectDependencyAnalyzerTest.linux-jdk11 / Build linux-jdk11 / testJarWithCompileDependency

Error Message:
null

Stack Trace:
java.lang.NullPointerException: null
        at org.apache.commons.lang3.SystemUtils.isJavaVersionAtLeast(SystemUtils.java:1626)
        at org.apache.maven.shared.dependency.analyzer.DefaultProjectDependencyAnalyzerTest.compileProject(DefaultProjectDependencyAnalyzerTest.java:342)
        at org.apache.maven.shared.dependency.analyzer.DefaultProjectDependencyAnalyzerTest.compileProject(DefaultProjectDependencyAnalyzerTest.java:337)
        at org.apache.maven.shared.dependency.analyzer.DefaultProjectDependencyAnalyzerTest.testJarWithCompileDependency(DefaultProjectDependencyAnalyzerTest.java:174)


FAILED:  org.apache.maven.shared.dependency.analyzer.DefaultProjectDependencyAnalyzerTest.linux-jdk11 / Build linux-jdk11 / testJava8methodRefs

Error Message:
null

Stack Trace:
java.lang.NullPointerException: null
        at org.apache.commons.lang3.SystemUtils.isJavaVersionAtLeast(SystemUtils.java:1626)
        at org.apache.maven.shared.dependency.analyzer.DefaultProjectDependencyAnalyzerTest.testJava8methodRefs(DefaultProjectDependencyAnalyzerTest.java:125)


FAILED:  org.apache.maven.shared.dependency.analyzer.DefaultProjectDependencyAnalyzerTest.linux-jdk11 / Build linux-jdk11 / testInlinedStaticReference

Error Message:
null

Stack Trace:
java.lang.NullPointerException: null
        at org.apache.commons.lang3.SystemUtils.isJavaVersionAtLeast(SystemUtils.java:1626)
        at org.apache.maven.shared.dependency.analyzer.DefaultProjectDependencyAnalyzerTest.testInlinedStaticReference(DefaultProjectDependencyAnalyzerTest.java:150)


FAILED:  org.apache.maven.shared.dependency.analyzer.DefaultProjectDependencyAnalyzerTest.linux-jdk11 / Build linux-jdk11 / testTypeUseAnnotationDependency

Error Message:
null

Stack Trace:
java.lang.NullPointerException: null
        at org.apache.commons.lang3.SystemUtils.isJavaVersionAtLeast(SystemUtils.java:1626)
        at org.apache.maven.shared.dependency.analyzer.DefaultProjectDependencyAnalyzerTest.testTypeUseAnnotationDependency(DefaultProjectDependencyAnalyzerTest.java:310)


FAILED:  org.apache.maven.shared.dependency.analyzer.DefaultProjectDependencyAnalyzerTest.linux-jdk11 / Build linux-jdk11 / testMultimoduleProject

Error Message:
null

Stack Trace:
java.lang.NullPointerException: null
        at org.apache.commons.lang3.SystemUtils.isJavaVersionAtLeast(SystemUtils.java:1626)
        at org.apache.maven.shared.dependency.analyzer.DefaultProjectDependencyAnalyzerTest.compileProject(DefaultProjectDependencyAnalyzerTest.java:342)
        at org.apache.maven.shared.dependency.analyzer.DefaultProjectDependencyAnalyzerTest.compileProject(DefaultProjectDependencyAnalyzerTest.java:337)
        at org.apache.maven.shared.dependency.analyzer.DefaultProjectDependencyAnalyzerTest.testMultimoduleProject(DefaultProjectDependencyAnalyzerTest.java:280)




Build log:
[...truncated 14832 lines...]
[INFO] Downloading from central: https://repo.maven.apache.org/maven2/org/apache/maven/reporting/maven-reporting/2.0.6/maven-reporting-2.0.6.pom
[INFO] Downloaded from central: https://repo.maven.apache.org/maven2/org/apache/maven/reporting/maven-reporting/2.0.6/maven-reporting-2.0.6.pom (1.4 kB at 120 kB/s)
[INFO] Downloading from central: https://repo.maven.apache.org/maven2/org/apache/maven/doxia/doxia-sink-api/1.0-alpha-7/doxia-sink-api-1.0-alpha-7.pom
[INFO] Downloaded from central: https://repo.maven.apache.org/maven2/org/apache/maven/doxia/doxia-sink-api/1.0-alpha-7/doxia-sink-api-1.0-alpha-7.pom (424 B at 33 kB/s)
[INFO] Downloading from central: https://repo.maven.apache.org/maven2/org/apache/maven/doxia/doxia/1.0-alpha-7/doxia-1.0-alpha-7.pom
[INFO] Downloaded from central: https://repo.maven.apache.org/maven2/org/apache/maven/doxia/doxia/1.0-alpha-7/doxia-1.0-alpha-7.pom (3.9 kB at 326 kB/s)
[INFO] Downloading from central: https://repo.maven.apache.org/maven2/org/apache/maven/maven-error-diagnostics/2.0.6/maven-error-diagnostics-2.0.6.pom
[INFO] Downloaded from central: https://repo.maven.apache.org/maven2/org/apache/maven/maven-error-diagnostics/2.0.6/maven-error-diagnostics-2.0.6.pom (1.7 kB at 142 kB/s)
[INFO] Downloading from central: https://repo.maven.apache.org/maven2/commons-cli/commons-cli/1.0/commons-cli-1.0.pom
[INFO] Downloaded from central: https://repo.maven.apache.org/maven2/commons-cli/commons-cli/1.0/commons-cli-1.0.pom (2.1 kB at 191 kB/s)
[INFO] Downloading from central: https://repo.maven.apache.org/maven2/org/apache/maven/maven-plugin-api/2.0.6/maven-plugin-api-2.0.6.pom
[INFO] Downloaded from central: https://repo.maven.apache.org/maven2/org/apache/maven/maven-plugin-api/2.0.6/maven-plugin-api-2.0.6.pom (1.5 kB at 121 kB/s)
[INFO] Downloading from central: https://repo.maven.apache.org/maven2/org/apache/maven/maven-plugin-descriptor/2.0.6/maven-plugin-descriptor-2.0.6.pom
[INFO] Downloaded from central: https://repo.maven.apache.org/maven2/org/apache/maven/maven-plugin-descriptor/2.0.6/maven-plugin-descriptor-2.0.6.pom (2.0 kB at 168 kB/s)
[INFO] Downloading from central: https://repo.maven.apache.org/maven2/org/apache/maven/maven-monitor/2.0.6/maven-monitor-2.0.6.pom
[INFO] Downloaded from central: https://repo.maven.apache.org/maven2/org/apache/maven/maven-monitor/2.0.6/maven-monitor-2.0.6.pom (1.3 kB at 104 kB/s)
[INFO] Downloading from central: https://repo.maven.apache.org/maven2/org/codehaus/plexus/plexus-interpolation/1.12/plexus-interpolation-1.12.pom
[INFO] Downloaded from central: https://repo.maven.apache.org/maven2/org/codehaus/plexus/plexus-interpolation/1.12/plexus-interpolation-1.12.pom (889 B at 74 kB/s)
[INFO] Downloading from central: https://repo.maven.apache.org/maven2/org/sonatype/plexus/plexus-build-api/0.0.4/plexus-build-api-0.0.4.pom
[INFO] Downloaded from central: https://repo.maven.apache.org/maven2/org/sonatype/plexus/plexus-build-api/0.0.4/plexus-build-api-0.0.4.pom (2.9 kB at 239 kB/s)
[INFO] Downloading from central: https://repo.maven.apache.org/maven2/org/sonatype/spice/spice-parent/10/spice-parent-10.pom
[INFO] Downloaded from central: https://repo.maven.apache.org/maven2/org/sonatype/spice/spice-parent/10/spice-parent-10.pom (3.0 kB at 251 kB/s)
[INFO] Downloading from central: https://repo.maven.apache.org/maven2/org/sonatype/forge/forge-parent/3/forge-parent-3.pom
[INFO] Downloaded from central: https://repo.maven.apache.org/maven2/org/sonatype/forge/forge-parent/3/forge-parent-3.pom (5.0 kB at 419 kB/s)
[INFO] Downloading from central: https://repo.maven.apache.org/maven2/org/codehaus/plexus/plexus-utils/1.5.8/plexus-utils-1.5.8.pom
[INFO] Downloaded from central: https://repo.maven.apache.org/maven2/org/codehaus/plexus/plexus-utils/1.5.8/plexus-utils-1.5.8.pom (8.1 kB at 620 kB/s)
[INFO] Downloading from central: https://repo.maven.apache.org/maven2/org/codehaus/plexus/plexus-resources/1.0-alpha-7/plexus-resources-1.0-alpha-7.pom
[INFO] Downloaded from central: https://repo.maven.apache.org/maven2/org/codehaus/plexus/plexus-resources/1.0-alpha-7/plexus-resources-1.0-alpha-7.pom (1.4 kB at 113 kB/s)
[INFO] Downloading from central: https://repo.maven.apache.org/maven2/org/codehaus/plexus/plexus-components/1.1.17/plexus-components-1.1.17.pom
[INFO] Downloaded from central: https://repo.maven.apache.org/maven2/org/codehaus/plexus/plexus-components/1.1.17/plexus-components-1.1.17.pom (5.2 kB at 401 kB/s)
[INFO] Downloading from central: https://repo.maven.apache.org/maven2/org/codehaus/plexus/plexus/2.0.5/plexus-2.0.5.pom
[INFO] Downloaded from central: https://repo.maven.apache.org/maven2/org/codehaus/plexus/plexus/2.0.5/plexus-2.0.5.pom (17 kB at 1.2 MB/s)
[INFO] Downloading from central: https://repo.maven.apache.org/maven2/org/apache/velocity/velocity/1.7/velocity-1.7.pom
[INFO] Downloaded from central: https://repo.maven.apache.org/maven2/org/apache/velocity/velocity/1.7/velocity-1.7.pom (11 kB at 776 kB/s)
[INFO] Downloading from central: https://repo.maven.apache.org/maven2/commons-lang/commons-lang/2.4/commons-lang-2.4.pom
[INFO] Downloaded from central: https://repo.maven.apache.org/maven2/commons-lang/commons-lang/2.4/commons-lang-2.4.pom (14 kB at 998 kB/s)
[INFO] Downloading from central: https://repo.maven.apache.org/maven2/org/apache/maven/shared/maven-artifact-resolver/1.0/maven-artifact-resolver-1.0.jar
[INFO] Downloading from central: https://repo.maven.apache.org/maven2/org/sonatype/plexus/plexus-build-api/0.0.4/plexus-build-api-0.0.4.jar
[INFO] Downloading from central: https://repo.maven.apache.org/maven2/org/apache/maven/shared/maven-filtering/1.1/maven-filtering-1.1.jar
[INFO] Downloading from central: https://repo.maven.apache.org/maven2/org/codehaus/plexus/plexus-interpolation/1.12/plexus-interpolation-1.12.jar
[INFO] Downloading from central: https://repo.maven.apache.org/maven2/org/codehaus/plexus/plexus-resources/1.0-alpha-7/plexus-resources-1.0-alpha-7.jar
[INFO] Downloaded from central: https://repo.maven.apache.org/maven2/org/sonatype/plexus/plexus-build-api/0.0.4/plexus-build-api-0.0.4.jar (6.8 kB at 486 kB/s)
[INFO] Downloading from central: https://repo.maven.apache.org/maven2/org/codehaus/plexus/plexus-utils/1.5.15/plexus-utils-1.5.15.jar
[INFO] Downloaded from central: https://repo.maven.apache.org/maven2/org/apache/maven/shared/maven-artifact-resolver/1.0/maven-artifact-resolver-1.0.jar (14 kB at 848 kB/s)
[INFO] Downloading from central: https://repo.maven.apache.org/maven2/org/apache/velocity/velocity/1.7/velocity-1.7.jar
[INFO] Downloaded from central: https://repo.maven.apache.org/maven2/org/apache/maven/shared/maven-filtering/1.1/maven-filtering-1.1.jar (43 kB at 2.5 MB/s)
[INFO] Downloading from central: https://repo.maven.apache.org/maven2/commons-lang/commons-lang/2.4/commons-lang-2.4.jar
[INFO] Downloaded from central: https://repo.maven.apache.org/maven2/org/codehaus/plexus/plexus-resources/1.0-alpha-7/plexus-resources-1.0-alpha-7.jar (23 kB at 1.3 MB/s)
[INFO] Downloaded from central: https://repo.maven.apache.org/maven2/org/codehaus/plexus/plexus-interpolation/1.12/plexus-interpolation-1.12.jar (61 kB at 3.2 MB/s)
[withMaven] Publishers: Pipeline Graph Publisher: 1 ms, Junit Publisher: 198 ms
[INFO] Downloaded from central: https://repo.maven.apache.org/maven2/org/codehaus/plexus/plexus-utils/1.5.15/plexus-utils-1.5.15.jar (228 kB at 5.8 MB/s)
[INFO] Downloaded from central: https://repo.maven.apache.org/maven2/commons-lang/commons-lang/2.4/commons-lang-2.4.jar (262 kB at 6.4 MB/s)
[INFO] Downloaded from central: https://repo.maven.apache.org/maven2/org/apache/velocity/velocity/1.7/velocity-1.7.jar (450 kB at 10 MB/s)
[INFO] Downloading from central: https://repo.maven.apache.org/maven2/org/apache/apache-jar-resource-bundle/1.4/apache-jar-resource-bundle-1.4.jar
[INFO] Downloaded from central: https://repo.maven.apache.org/maven2/org/apache/apache-jar-resource-bundle/1.4/apache-jar-resource-bundle-1.4.jar (12 kB at 280 kB/s)
[INFO]
[INFO] --- maven-resources-plugin:2.7:resources (default-resources) @ maven-dependency-analyzer ---
[INFO] Downloading from central: https://repo.maven.apache.org/maven2/org/codehaus/plexus/plexus-utils/3.0.15/plexus-utils-3.0.15.pom
[INFO] Downloaded from central: https://repo.maven.apache.org/maven2/org/codehaus/plexus/plexus-utils/3.0.15/plexus-utils-3.0.15.pom (3.1 kB at 262 kB/s)
[INFO] Downloading from central: https://repo.maven.apache.org/maven2/org/apache/maven/shared/maven-filtering/1.2/maven-filtering-1.2.pom
[INFO] Downloaded from central: https://repo.maven.apache.org/maven2/org/apache/maven/shared/maven-filtering/1.2/maven-filtering-1.2.pom (6.5 kB at 501 kB/s)
[INFO] Downloading from central: https://repo.maven.apache.org/maven2/org/apache/maven/shared/maven-shared-components/19/maven-shared-components-19.pom
[INFO] Downloaded from central: https://repo.maven.apache.org/maven2/org/apache/maven/shared/maven-shared-components/19/maven-shared-components-19.pom (6.4 kB at 489 kB/s)
[INFO] Downloading from central: https://repo.maven.apache.org/maven2/org/apache/maven/shared/maven-shared-utils/0.3/maven-shared-utils-0.3.pom
[INFO] Downloaded from central: https://repo.maven.apache.org/maven2/org/apache/maven/shared/maven-shared-utils/0.3/maven-shared-utils-0.3.pom (4.0 kB at 311 kB/s)
[INFO] Downloading from central: https://repo.maven.apache.org/maven2/org/apache/maven/shared/maven-shared-components/18/maven-shared-components-18.pom
[INFO] Downloaded from central: https://repo.maven.apache.org/maven2/org/apache/maven/shared/maven-shared-components/18/maven-shared-components-18.pom (4.9 kB at 411 kB/s)
[INFO] Downloading from central: https://repo.maven.apache.org/maven2/org/apache/maven/maven-parent/22/maven-parent-22.pom
[INFO] Downloaded from central: https://repo.maven.apache.org/maven2/org/apache/maven/maven-parent/22/maven-parent-22.pom (30 kB at 2.3 MB/s)
[INFO] Downloading from central: https://repo.maven.apache.org/maven2/org/apache/apache/11/apache-11.pom
[INFO] Downloaded from central: https://repo.maven.apache.org/maven2/org/apache/apache/11/apache-11.pom (15 kB at 1.1 MB/s)
[INFO] Downloading from central: https://repo.maven.apache.org/maven2/org/codehaus/plexus/plexus-interpolation/1.19/plexus-interpolation-1.19.pom
[INFO] Downloaded from central: https://repo.maven.apache.org/maven2/org/codehaus/plexus/plexus-interpolation/1.19/plexus-interpolation-1.19.pom (1.0 kB at 86 kB/s)
[INFO] Downloading from central: https://repo.maven.apache.org/maven2/org/codehaus/plexus/plexus-components/1.3.1/plexus-components-1.3.1.pom
[INFO] Downloaded from central: https://repo.maven.apache.org/maven2/org/codehaus/plexus/plexus-components/1.3.1/plexus-components-1.3.1.pom (3.1 kB at 236 kB/s)
[INFO] Downloading from central: https://repo.maven.apache.org/maven2/org/codehaus/plexus/plexus-utils/3.0.15/plexus-utils-3.0.15.jar
[INFO] Downloading from central: https://repo.maven.apache.org/maven2/org/codehaus/plexus/plexus-interpolation/1.19/plexus-interpolation-1.19.jar
[INFO] Downloading from central: https://repo.maven.apache.org/maven2/org/apache/maven/shared/maven-shared-utils/0.3/maven-shared-utils-0.3.jar
[INFO] Downloading from central: https://repo.maven.apache.org/maven2/org/apache/maven/shared/maven-filtering/1.2/maven-filtering-1.2.jar
[INFO] Downloaded from central: https://repo.maven.apache.org/maven2/org/codehaus/plexus/plexus-interpolation/1.19/plexus-interpolation-1.19.jar (62 kB at 3.1 MB/s)
[INFO] Downloaded from central: https://repo.maven.apache.org/maven2/org/apache/maven/shared/maven-filtering/1.2/maven-filtering-1.2.jar (44 kB at 2.1 MB/s)
[INFO] Downloaded from central: https://repo.maven.apache.org/maven2/org/codehaus/plexus/plexus-utils/3.0.15/plexus-utils-3.0.15.jar (239 kB at 10.0 MB/s)
[INFO] Downloaded from central: https://repo.maven.apache.org/maven2/org/apache/maven/shared/maven-shared-utils/0.3/maven-shared-utils-0.3.jar (155 kB at 6.5 MB/s)
[INFO] Using 'UTF-8' encoding to copy filtered resources.
[INFO] skip non existing resourceDirectory /home/jenkins/jenkins-slave/workspace/4_Detect_Java_8_type_annotations/m/src/main/resources
[INFO] Copying 3 resources
[INFO]
[INFO] --- maven-compiler-plugin:3.5.1:compile (default-compile) @ maven-dependency-analyzer ---
[INFO] Downloading from central: https://repo.maven.apache.org/maven2/org/apache/maven/maven-core/3.0/maven-core-3.0.pom
[INFO] Downloaded from central: https://repo.maven.apache.org/maven2/org/apache/maven/maven-core/3.0/maven-core-3.0.pom (6.6 kB at 552 kB/s)
[INFO] Downloading from central: https://repo.maven.apache.org/maven2/org/apache/maven/maven-settings/3.0/maven-settings-3.0.pom
[INFO] Downloaded from central: https://repo.maven.apache.org/maven2/org/apache/maven/maven-settings/3.0/maven-settings-3.0.pom (1.9 kB at 157 kB/s)
[INFO] Downloading from central: https://repo.maven.apache.org/maven2/org/apache/maven/maven-settings-builder/3.0/maven-settings-builder-3.0.pom
[withMaven] junitPublisher - Archive test results for Maven artifact org.apache.maven.shared.dependency-analyzer.tests:inlinedStaticReference:jar:1.0 generated by maven-surefire-plugin:test (default-test): m/target/test-classes/inlinedStaticReference/target/surefire-reports/*.xml
Recording test results
None of the test reports contained any result
[INFO] Downloaded from central: https://repo.maven.apache.org/maven2/org/apache/maven/maven-settings-builder/3.0/maven-settings-builder-3.0.pom (2.2 kB at 185 kB/s)
[INFO] Downloading from central: https://repo.maven.apache.org/maven2/org/codehaus/plexus/plexus-interpolation/1.14/plexus-interpolation-1.14.pom
[INFO] Downloaded from central: https://repo.maven.apache.org/maven2/org/codehaus/plexus/plexus-interpolation/1.14/plexus-interpolation-1.14.pom (910 B at 76 kB/s)
[INFO] Downloading from central: https://repo.maven.apache.org/maven2/org/codehaus/plexus/plexus-components/1.1.18/plexus-components-1.1.18.pom
[INFO] Downloaded from central: https://repo.maven.apache.org/maven2/org/codehaus/plexus/plexus-components/1.1.18/plexus-components-1.1.18.pom (5.4 kB at 412 kB/s)
[INFO] Downloading from central: https://repo.maven.apache.org/maven2/org/apache/maven/maven-repository-metadata/3.0/maven-repository-metadata-3.0.pom
[INFO] Downloaded from central: https://repo.maven.apache.org/maven2/org/apache/maven/maven-repository-metadata/3.0/maven-repository-metadata-3.0.pom (1.9 kB at 161 kB/s)
[INFO] Downloading from central: https://repo.maven.apache.org/maven2/org/apache/maven/maven-model-builder/3.0/maven-model-builder-3.0.pom
[INFO] Downloaded from central: https://repo.maven.apache.org/maven2/org/apache/maven/maven-model-builder/3.0/maven-model-builder-3.0.pom (2.2 kB at 173 kB/s)
[INFO] Downloading from central: https://repo.maven.apache.org/maven2/org/apache/maven/maven-aether-provider/3.0/maven-aether-provider-3.0.pom
[INFO] Downloaded from central: https://repo.maven.apache.org/maven2/org/apache/maven/maven-aether-provider/3.0/maven-aether-provider-3.0.pom (2.5 kB at 145 kB/s)
[INFO] Downloading from central: https://repo.maven.apache.org/maven2/org/sonatype/aether/aether-api/1.7/aether-api-1.7.pom
[INFO] Downloaded from central: https://repo.maven.apache.org/maven2/org/sonatype/aether/aether-api/1.7/aether-api-1.7.pom (1.7 kB at 129 kB/s)
[INFO] Downloading from central: https://repo.maven.apache.org/maven2/org/sonatype/aether/aether-parent/1.7/aether-parent-1.7.pom
[INFO] Downloaded from central: https://repo.maven.apache.org/maven2/org/sonatype/aether/aether-parent/1.7/aether-parent-1.7.pom (7.7 kB at 552 kB/s)
[INFO] Downloading from central: https://repo.maven.apache.org/maven2/org/sonatype/aether/aether-util/1.7/aether-util-1.7.pom
[INFO] Downloaded from central: https://repo.maven.apache.org/maven2/org/sonatype/aether/aether-util/1.7/aether-util-1.7.pom (2.1 kB at 159 kB/s)
[INFO] Downloading from central: https://repo.maven.apache.org/maven2/org/sonatype/aether/aether-impl/1.7/aether-impl-1.7.pom
[INFO] Downloaded from central: https://repo.maven.apache.org/maven2/org/sonatype/aether/aether-impl/1.7/aether-impl-1.7.pom (3.7 kB at 284 kB/s)
[INFO] Downloading from central: https://repo.maven.apache.org/maven2/org/sonatype/aether/aether-spi/1.7/aether-spi-1.7.pom
[INFO] Downloaded from central: https://repo.maven.apache.org/maven2/org/sonatype/aether/aether-spi/1.7/aether-spi-1.7.pom (1.7 kB at 134 kB/s)
[INFO] Downloading from central: https://repo.maven.apache.org/maven2/org/apache/maven/maven-toolchain/2.2.1/maven-toolchain-2.2.1.pom
[INFO] Downloaded from central: https://repo.maven.apache.org/maven2/org/apache/maven/maven-toolchain/2.2.1/maven-toolchain-2.2.1.pom (3.3 kB at 239 kB/s)
[INFO] Downloading from central: https://repo.maven.apache.org/maven2/org/apache/maven/shared/maven-shared-incremental/1.1/maven-shared-incremental-1.1.pom
[INFO] Downloaded from central: https://repo.maven.apache.org/maven2/org/apache/maven/shared/maven-shared-incremental/1.1/maven-shared-incremental-1.1.pom (4.7 kB at 339 kB/s)
[INFO] Downloading from central: https://repo.maven.apache.org/maven2/org/apache/maven/shared/maven-shared-utils/0.1/maven-shared-utils-0.1.pom
[INFO] Downloaded from central: https://repo.maven.apache.org/maven2/org/apache/maven/shared/maven-shared-utils/0.1/maven-shared-utils-0.1.pom (4.0 kB at 311 kB/s)
[INFO] Downloading from central: https://repo.maven.apache.org/maven2/org/codehaus/plexus/plexus-compiler-api/2.7/plexus-compiler-api-2.7.pom
[INFO] Downloaded from central: https://repo.maven.apache.org/maven2/org/codehaus/plexus/plexus-compiler-api/2.7/plexus-compiler-api-2.7.pom (891 B at 64 kB/s)
[INFO] Downloading from central: https://repo.maven.apache.org/maven2/org/codehaus/plexus/plexus-compiler/2.7/plexus-compiler-2.7.pom
[INFO] Downloaded from central: https://repo.maven.apache.org/maven2/org/codehaus/plexus/plexus-compiler/2.7/plexus-compiler-2.7.pom (4.9 kB at 352 kB/s)
[INFO] Downloading from central: https://repo.maven.apache.org/maven2/org/codehaus/plexus/plexus-components/4.0/plexus-components-4.0.pom
[INFO] Downloaded from central: https://repo.maven.apache.org/maven2/org/codehaus/plexus/plexus-components/4.0/plexus-components-4.0.pom (2.7 kB at 204 kB/s)
[INFO] Downloading from central: https://repo.maven.apache.org/maven2/org/codehaus/plexus/plexus-compiler-manager/2.7/plexus-compiler-manager-2.7.pom
[INFO] Downloaded from central: https://repo.maven.apache.org/maven2/org/codehaus/plexus/plexus-compiler-manager/2.7/plexus-compiler-manager-2.7.pom (711 B at 51 kB/s)
[INFO] Downloading from central: https://repo.maven.apache.org/maven2/org/codehaus/plexus/plexus-compiler-javac/2.7/plexus-compiler-javac-2.7.pom
[INFO] Downloaded from central: https://repo.maven.apache.org/maven2/org/codehaus/plexus/plexus-compiler-javac/2.7/plexus-compiler-javac-2.7.pom (792 B at 50 kB/s)
[INFO] Downloading from central: https://repo.maven.apache.org/maven2/org/codehaus/plexus/plexus-compilers/2.7/plexus-compilers-2.7.pom
[INFO] Downloaded from central: https://repo.maven.apache.org/maven2/org/codehaus/plexus/plexus-compilers/2.7/plexus-compilers-2.7.pom (1.4 kB at 106 kB/s)
[INFO] Downloading from central: https://repo.maven.apache.org/maven2/org/apache/maven/maven-core/3.0/maven-core-3.0.jar
[INFO] Downloading from central: https://repo.maven.apache.org/maven2/org/apache/maven/maven-settings-builder/3.0/maven-settings-builder-3.0.jar
[INFO] Downloading from central: https://repo.maven.apache.org/maven2/org/apache/maven/maven-settings/3.0/maven-settings-3.0.jar
[INFO] Downloading from central: https://repo.maven.apache.org/maven2/org/apache/maven/maven-model-builder/3.0/maven-model-builder-3.0.jar
[INFO] Downloading from central: https://repo.maven.apache.org/maven2/org/apache/maven/maven-repository-metadata/3.0/maven-repository-metadata-3.0.jar
[INFO] Downloaded from central: https://repo.maven.apache.org/maven2/org/apache/maven/maven-settings-builder/3.0/maven-settings-builder-3.0.jar (38 kB at 2.5 MB/s)
[INFO] Downloaded from central: https://repo.maven.apache.org/maven2/org/apache/maven/maven-repository-metadata/3.0/maven-repository-metadata-3.0.jar (30 kB at 2.0 MB/s)
[INFO] Downloaded from central: https://repo.maven.apache.org/maven2/org/apache/maven/maven-settings/3.0/maven-settings-3.0.jar (47 kB at 2.6 MB/s)
[INFO] Downloading from central: https://repo.maven.apache.org/maven2/org/apache/maven/maven-aether-provider/3.0/maven-aether-provider-3.0.jar
[INFO] Downloading from central: https://repo.maven.apache.org/maven2/org/sonatype/aether/aether-spi/1.7/aether-spi-1.7.jar
[INFO] Downloading from central: https://repo.maven.apache.org/maven2/org/sonatype/aether/aether-impl/1.7/aether-impl-1.7.jar
[INFO] Downloaded from central: https://repo.maven.apache.org/maven2/org/apache/maven/maven-model-builder/3.0/maven-model-builder-3.0.jar (148 kB at 7.0 MB/s)
[INFO] Downloading from central: https://repo.maven.apache.org/maven2/org/sonatype/aether/aether-api/1.7/aether-api-1.7.jar
[INFO] Downloaded from central: https://repo.maven.apache.org/maven2/org/apache/maven/maven-aether-provider/3.0/maven-aether-provider-3.0.jar (51 kB at 1.7 MB/s)
[INFO] Downloaded from central: https://repo.maven.apache.org/maven2/org/sonatype/aether/aether-spi/1.7/aether-spi-1.7.jar (14 kB at 437 kB/s)
[INFO] Downloading from central: https://repo.maven.apache.org/maven2/org/sonatype/aether/aether-util/1.7/aether-util-1.7.jar
[INFO] Downloading from central: https://repo.maven.apache.org/maven2/org/codehaus/plexus/plexus-interpolation/1.14/plexus-interpolation-1.14.jar
[INFO] Downloaded from central: https://repo.maven.apache.org/maven2/org/sonatype/aether/aether-impl/1.7/aether-impl-1.7.jar (106 kB at 3.0 MB/s)
[INFO] Downloading from central: https://repo.maven.apache.org/maven2/org/apache/maven/maven-toolchain/2.2.1/maven-toolchain-2.2.1.jar
[INFO] Downloaded from central: https://repo.maven.apache.org/maven2/org/sonatype/aether/aether-api/1.7/aether-api-1.7.jar (74 kB at 2.1 MB/s)
[INFO] Downloading from central: https://repo.maven.apache.org/maven2/org/apache/maven/shared/maven-shared-incremental/1.1/maven-shared-incremental-1.1.jar
[INFO] Downloaded from central: https://repo.maven.apache.org/maven2/org/apache/maven/maven-core/3.0/maven-core-3.0.jar (527 kB at 13 MB/s)
[INFO] Downloading from central: https://repo.maven.apache.org/maven2/org/codehaus/plexus/plexus-compiler-api/2.7/plexus-compiler-api-2.7.jar
[INFO] Downloaded from central: https://repo.maven.apache.org/maven2/org/codehaus/plexus/plexus-interpolation/1.14/plexus-interpolation-1.14.jar (61 kB at 1.3 MB/s)
[INFO] Downloading from central: https://repo.maven.apache.org/maven2/org/codehaus/plexus/plexus-compiler-manager/2.7/plexus-compiler-manager-2.7.jar
[INFO] Downloaded from central: https://repo.maven.apache.org/maven2/org/sonatype/aether/aether-util/1.7/aether-util-1.7.jar (108 kB at 2.3 MB/s)
[INFO] Downloaded from central: https://repo.maven.apache.org/maven2/org/apache/maven/maven-toolchain/2.2.1/maven-toolchain-2.2.1.jar (38 kB at 800 kB/s)
[INFO] Downloading from central: https://repo.maven.apache.org/maven2/org/codehaus/plexus/plexus-compiler-javac/2.7/plexus-compiler-javac-2.7.jar
[INFO] Downloaded from central: https://repo.maven.apache.org/maven2/org/apache/maven/shared/maven-shared-incremental/1.1/maven-shared-incremental-1.1.jar (14 kB at 276 kB/s)
[INFO] Downloaded from central: https://repo.maven.apache.org/maven2/org/codehaus/plexus/plexus-compiler-api/2.7/plexus-compiler-api-2.7.jar (26 kB at 485 kB/s)
[INFO] Downloaded from central: https://repo.maven.apache.org/maven2/org/codehaus/plexus/plexus-compiler-manager/2.7/plexus-compiler-manager-2.7.jar (4.7 kB at 79 kB/s)
[INFO] Downloaded from central: https://repo.maven.apache.org/maven2/org/codehaus/plexus/plexus-compiler-javac/2.7/plexus-compiler-javac-2.7.jar (19 kB at 319 kB/s)
[INFO] Changes detected - recompiling the module!
[INFO] Compiling 19 source files to /home/jenkins/jenkins-slave/workspace/4_Detect_Java_8_type_annotations/m/target/classes
[withMaven] Publishers: Pipeline Graph Publisher: 1 ms, Junit Publisher: 199 ms
[INFO] -------------------------------------------------------------
[ERROR] COMPILATION ERROR :
[INFO] -------------------------------------------------------------
[ERROR] Source option 6 is no longer supported. Use 7 or later.
[ERROR] Target option 6 is no longer supported. Use 7 or later.
[INFO] 2 errors
[INFO] -------------------------------------------------------------
[INFO] ------------------------------------------------------------------------
[INFO] BUILD FAILURE
[INFO] ------------------------------------------------------------------------
[INFO] Total time:  11.552 s
[INFO] Finished at: 2020-03-27T03:19:53Z
[INFO] ------------------------------------------------------------------------
[WARNING] The requested profile "run-its" could not be activated because it does not exist.
[INFO] [jenkins-event-spy] Generated /home/jenkins/jenkins-slave/workspace/4_Detect_Java_8_type_annotations@tmp/withMaven15a77421/maven-spy-20200327-031941-5198651762617296529611.log
[ERROR] Failed to execute goal org.apache.maven.plugins:maven-compiler-plugin:3.5.1:compile (default-compile) on project maven-dependency-analyzer: Compilation failure: Compilation failure:
[ERROR] Source option 6 is no longer supported. Use 7 or later.
[ERROR] Target option 6 is no longer supported. Use 7 or later.
[ERROR] -> [Help 1]
[ERROR]
[ERROR] To see the full stack trace of the errors, re-run Maven with the -e switch.
[ERROR] Re-run Maven using the -X switch to enable full debug logging.
[ERROR]
[ERROR] For more information about the errors and possible solutions, please read the following articles:
[ERROR] [Help 1] http://cwiki.apache.org/confluence/display/MAVEN/MojoFailureException
[withMaven] junitPublisher - Archive test results for Maven artifact org.apache.maven.shared.dependency-analyzer.tests:typeUseAnnotationDependencyAnnotation:jar:1.0 generated by maven-surefire-plugin:test (default-test): m/target/test-classes/typeUseAnnotationDependency/annotation/target/surefire-reports/*.xml
[withMaven] junitPublisher - Archive test results for Maven artifact org.apache.maven.shared.dependency-analyzer.tests:typeUseAnnotationDependencyUsage:jar:1.0 generated by maven-surefire-plugin:test (default-test): m/target/test-classes/typeUseAnnotationDependency/usage/target/surefire-reports/*.xml
Recording test results
None of the test reports contained any result
[Pipeline] }
[Pipeline] // dir
[Pipeline] }
[withMaven] Publishers: Pipeline Graph Publisher: 1 ms, Junit Publisher: 195 ms
[withMaven] junitPublisher - Archive test results for Maven artifact org.apache.maven.its.dependency:test-module1:jar:1.0 generated by maven-surefire-plugin:test (default-test): m/target/test-classes/multimoduleProject/module1/target/surefire-reports/*.xml
[withMaven] junitPublisher - Archive test results for Maven artifact org.apache.maven.its.dependency:test-module2:jar:1.0 generated by maven-surefire-plugin:test (default-test): m/target/test-classes/multimoduleProject/module2/target/surefire-reports/*.xml
Recording test results
None of the test reports contained any result
[withMaven] Publishers:
[Pipeline] // withMaven
[Pipeline] echo
[FAILURE-004] hudson.AbortException: script returned exit code 1
[Pipeline] cleanWs
[WS-CLEANUP] Deleting project workspace...
[WS-CLEANUP] Deferred wipeout is used...
[withMaven] Publishers: Pipeline Graph Publisher: 1 ms, Junit Publisher: 193 ms
[WS-CLEANUP] done
[Pipeline] cleanWs
[Pipeline] // withMaven
[Pipeline] cleanWs
[WS-CLEANUP] Deleting project workspace...
[WS-CLEANUP] Deferred wipeout is used...
[WS-CLEANUP] Deleting project workspace...
[WS-CLEANUP] Deferred wipeout is used...
[WS-CLEANUP] done
[Pipeline] }
[Pipeline] // stage
[Pipeline] }
[Pipeline] // node
[Pipeline] }
Failed in branch linux-jdk15
[WS-CLEANUP] done
[Pipeline] }
[Pipeline] // stage
[Pipeline] }
[Pipeline] // node
[Pipeline] }
[Pipeline] // parallel
[Pipeline] echo
[FAILURE-003] AbortException hudson.AbortException: script returned exit code 1
[Pipeline] stage
[Pipeline] { (Notifications)
[Pipeline] echo
Build result: FAILURE
[Pipeline] jiraIssueSelector
[Pipeline] echo
The authors of changes [rfscholte].
[Pipeline] echo
Sending email ...
[Pipeline] emailext