Build failed in Jenkins: Maven TLP » maven-compiler-plugin » MCOMPILER-321 #1

Previous Topic Next Topic
 
classic Classic list List threaded Threaded
4 messages Options
Reply | Threaded
Open this post in threaded view
|

Build failed in Jenkins: Maven TLP » maven-compiler-plugin » MCOMPILER-321 #1

Apache Jenkins Server-2
See https://builds.apache.org/job/maven-box/job/maven-compiler-plugin/job/MCOMPILER-321/1/

No changes.

All tests passed

Build log:
[...truncated 1.53 MB...]
[linux-jdk9]          <executable>${maven.compiler.executable}</executable>
[linux-jdk9]          <failOnError default-value="true">${maven.compiler.failOnError}</failOnError>
[linux-jdk9]          <failOnWarning default-value="false">${maven.compiler.failOnWarning}</failOnWarning>
[linux-jdk9]          <forceJavacCompilerUse default-value="false">${maven.compiler.forceJavacCompilerUse}</forceJavacCompilerUse>
[linux-jdk9]          <fork default-value="false">${maven.compiler.fork}</fork>
[linux-jdk9]          <generatedSourcesDirectory default-value="${project.build.directory}/generated-sources/annotations"/>
[linux-jdk9]          <maxmem>${maven.compiler.maxmem}</maxmem>
[linux-jdk9]          <meminitial>${maven.compiler.meminitial}</meminitial>
[linux-jdk9]          <mojoExecution default-value="${mojoExecution}"/>
[linux-jdk9]          <optimize default-value="false">${maven.compiler.optimize}</optimize>
[linux-jdk9]          <outputDirectory default-value="${project.build.outputDirectory}"/>
[linux-jdk9]          <parameters default-value="false">${maven.compiler.parameters}</parameters>
[linux-jdk9]          <project default-value="${project}"/>
[linux-jdk9]          <projectArtifact default-value="${project.artifact}"/>
[linux-jdk9]          <release>${maven.compiler.release}</release>
[linux-jdk9]          <session default-value="${session}"/>
[linux-jdk9]          <showDeprecation default-value="false">${maven.compiler.showDeprecation}</showDeprecation>
[linux-jdk9]          <showWarnings default-value="false">${maven.compiler.showWarnings}</showWarnings>
[linux-jdk9]          <skipMain>${maven.main.skip}</skipMain>
[linux-jdk9]          <skipMultiThreadWarning default-value="false">${maven.compiler.skipMultiThreadWarning}</skipMultiThreadWarning>
[linux-jdk9]          <source default-value="1.5">${maven.compiler.source}</source>
[linux-jdk9]          <staleMillis default-value="0">${lastModGranularityMs}</staleMillis>
[linux-jdk9]          <target default-value="1.5">${maven.compiler.target}</target>
[linux-jdk9]          <useIncrementalCompilation default-value="true">${maven.compiler.useIncrementalCompilation}</useIncrementalCompilation>
[linux-jdk9]          <verbose default-value="false">${maven.compiler.verbose}</verbose>
[linux-jdk9]        </configuration>
[linux-jdk9]        [DEBUG] =======================================================================
[linux-jdk9]        [DEBUG] Dependency collection stats: {ConflictMarker.analyzeTime=57529, ConflictMarker.markTime=431399, ConflictMarker.nodeCount=1, ConflictIdSorter.graphTime=42115, ConflictIdSorter.topsortTime=668471, ConflictIdSorter.conflictIdCount=0, ConflictIdSorter.conflictIdCycleCount=0, ConflictResolver.totalTime=1659094, ConflictResolver.conflictItemCount=0, DefaultDependencyCollector.collectTime=314548, DefaultDependencyCollector.transformTime=5141213}
[linux-jdk9]        [DEBUG] org.apache.maven.plugins.compiler.it:mcompiler-21_class-remove:jar:1.0-SNAPSHOT
[linux-jdk9]        [INFO]
[linux-jdk9]        [INFO] --- maven-resources-plugin:2.6:resources (default-resources) @ mcompiler-21_class-remove ---
[linux-jdk9]        [DEBUG] Dependency collection stats: {ConflictMarker.analyzeTime=1849642, ConflictMarker.markTime=344181, ConflictMarker.nodeCount=77, ConflictIdSorter.graphTime=593035, ConflictIdSorter.topsortTime=90128, ConflictIdSorter.conflictIdCount=26, ConflictIdSorter.conflictIdCycleCount=0, ConflictResolver.totalTime=7011689, ConflictResolver.conflictItemCount=74, DefaultDependencyCollector.collectTime=153672340, DefaultDependencyCollector.transformTime=10040353}
[linux-jdk9]        [DEBUG] org.apache.maven.plugins:maven-resources-plugin:jar:2.6:
[linux-jdk9]        [DEBUG]    org.apache.maven:maven-plugin-api:jar:2.0.6:compile
[linux-jdk9]        [DEBUG]    org.apache.maven:maven-project:jar:2.0.6:compile
[linux-jdk9]        [DEBUG]       org.apache.maven:maven-profile:jar:2.0.6:compile
[linux-jdk9]        [DEBUG]       org.apache.maven:maven-artifact-manager:jar:2.0.6:compile
[linux-jdk9]        [DEBUG]       org.apache.maven:maven-plugin-registry:jar:2.0.6:compile
[linux-jdk9]        [DEBUG]    org.apache.maven:maven-core:jar:2.0.6:compile
[linux-jdk9]        [DEBUG]       org.apache.maven:maven-plugin-parameter-documenter:jar:2.0.6:compile
[linux-jdk9]        [DEBUG]       org.apache.maven.reporting:maven-reporting-api:jar:2.0.6:compile
[linux-jdk9]        [DEBUG]          org.apache.maven.doxia:doxia-sink-api:jar:1.0-alpha-7:compile
[linux-jdk9]        [DEBUG]       org.apache.maven:maven-repository-metadata:jar:2.0.6:compile
[linux-jdk9]        [DEBUG]       org.apache.maven:maven-error-diagnostics:jar:2.0.6:compile
[linux-jdk9]        [DEBUG]       commons-cli:commons-cli:jar:1.0:compile
[linux-jdk9]        [DEBUG]       org.apache.maven:maven-plugin-descriptor:jar:2.0.6:compile
[linux-jdk9]        [DEBUG]       org.codehaus.plexus:plexus-interactivity-api:jar:1.0-alpha-4:compile
[linux-jdk9]        [DEBUG]       classworlds:classworlds:jar:1.1:compile
[linux-jdk9]        [DEBUG]    org.apache.maven:maven-artifact:jar:2.0.6:compile
[linux-jdk9]        [DEBUG]    org.apache.maven:maven-settings:jar:2.0.6:compile
[linux-jdk9]        [DEBUG]    org.apache.maven:maven-model:jar:2.0.6:compile
[linux-jdk9]        [DEBUG]    org.apache.maven:maven-monitor:jar:2.0.6:compile
[linux-jdk9]        [DEBUG]    org.codehaus.plexus:plexus-container-default:jar:1.0-alpha-9-stable-1:compile
[linux-jdk9]        [DEBUG]       junit:junit:jar:3.8.1:compile
[linux-jdk9]        [DEBUG]    org.codehaus.plexus:plexus-utils:jar:2.0.5:compile
[linux-jdk9]        [DEBUG]    org.apache.maven.shared:maven-filtering:jar:1.1:compile
[linux-jdk9]        [DEBUG]       org.sonatype.plexus:plexus-build-api:jar:0.0.4:compile
[linux-jdk9]        [DEBUG]    org.codehaus.plexus:plexus-interpolation:jar:1.13:compile
[linux-jdk9]        [DEBUG] Created new class realm plugin>org.apache.maven.plugins:maven-resources-plugin:2.6
[linux-jdk9]        [DEBUG] Importing foreign packages into class realm plugin>org.apache.maven.plugins:maven-resources-plugin:2.6
[linux-jdk9]        [DEBUG]   Imported:  < maven.api
[linux-jdk9]        [DEBUG] Populating class realm plugin>org.apache.maven.plugins:maven-resources-plugin:2.6
[linux-jdk9]        [DEBUG]   Included: org.apache.maven.plugins:maven-resources-plugin:jar:2.6
[linux-jdk9]        [DEBUG]   Included: org.apache.maven.reporting:maven-reporting-api:jar:2.0.6
[linux-jdk9]        [DEBUG]   Included: org.apache.maven.doxia:doxia-sink-api:jar:1.0-alpha-7
[linux-jdk9]        [DEBUG]   Included: commons-cli:commons-cli:jar:1.0
[linux-jdk9]        [DEBUG]   Included: org.codehaus.plexus:plexus-interactivity-api:jar:1.0-alpha-4
[linux-jdk9]        [DEBUG]   Included: junit:junit:jar:3.8.1
[linux-jdk9]        [DEBUG]   Included: org.codehaus.plexus:plexus-utils:jar:2.0.5
[linux-jdk9]        [DEBUG]   Included: org.apache.maven.shared:maven-filtering:jar:1.1
[linux-jdk9]        [DEBUG]   Included: org.sonatype.plexus:plexus-build-api:jar:0.0.4
[linux-jdk9]        [DEBUG]   Included: org.codehaus.plexus:plexus-interpolation:jar:1.13
[linux-jdk9]        [DEBUG] Configuring mojo org.apache.maven.plugins:maven-resources-plugin:2.6:resources from plugin realm ClassRealm[plugin>org.apache.maven.plugins:maven-resources-plugin:2.6, parent: jdk.internal.loader.ClassLoaders$AppClassLoader@17d10166]
[linux-jdk9]        [DEBUG] Configuring mojo 'org.apache.maven.plugins:maven-resources-plugin:2.6:resources' with basic configurator -->
[linux-jdk9]        [DEBUG]   (f) buildFilters = []
[linux-jdk9]        [DEBUG]   (f) escapeWindowsPaths = true
[linux-jdk9]        [DEBUG]   (s) includeEmptyDirs = false
[linux-jdk9]        [DEBUG]   (s) outputDirectory = /home/jenkins/jenkins-slave/workspace/mpiler-plugin_MCOMPILER-321-M3CCVQFTOYTT5MRUEFTYA2LFPKU6XKW4A5QCKLUYCCRZ7HLEL52Q/m/target/it/mcompiler-21_class-remove/target/classes
[linux-jdk9]        [DEBUG]   (s) overwrite = false
[linux-jdk9]        [DEBUG]   (f) project = MavenProject: org.apache.maven.plugins.compiler.it:mcompiler-21_class-remove:1.0-SNAPSHOT @ /home/jenkins/jenkins-slave/workspace/mpiler-plugin_MCOMPILER-321-M3CCVQFTOYTT5MRUEFTYA2LFPKU6XKW4A5QCKLUYCCRZ7HLEL52Q/m/target/it/mcompiler-21_class-remove/pom.xml
[linux-jdk9]        [DEBUG]   (s) resources = [Resource {targetPath: null, filtering: false, FileSet {directory: /home/jenkins/jenkins-slave/workspace/mpiler-plugin_MCOMPILER-321-M3CCVQFTOYTT5MRUEFTYA2LFPKU6XKW4A5QCKLUYCCRZ7HLEL52Q/m/target/it/mcompiler-21_class-remove/src/main/resources, PatternSet [includes: {}, excludes: {}]}}]
[linux-jdk9]        [DEBUG]   (f) session = org.apache.maven.execution.MavenSession@6fd5717c
[linux-jdk9]        [DEBUG]   (f) supportMultiLineFiltering = false
[linux-jdk9]        [DEBUG]   (f) useBuildFilters = true
[linux-jdk9]        [DEBUG]   (s) useDefaultDelimiters = true
[linux-jdk9]        [DEBUG] -- end configuration --
[linux-jdk9]        [DEBUG] properties used {java.specification.version=9, sun.cpu.isalist=, env.EXECUTOR_NUMBER=1, sun.arch.data.model=64, env.NIX_LABEL=ubuntu, java.vendor.url=http://java.oracle.com/, env.JENKINS_HOME=/x1/jenkins/jenkins-home, env.JOB_DISPLAY_URL=https://builds.apache.org/job/maven-box/job/maven-compiler-plugin/job/MCOMPILER-321/display/redirect, sun.boot.library.path=/usr/local/asfpackages/java/jdk-9.0.1/lib, sun.java.command=org.codehaus.plexus.classworlds.launcher.Launcher -B -X -D maven.repo.local=/home/jenkins/jenkins-slave/workspace/mpiler-plugin_MCOMPILER-321-M3CCVQFTOYTT5MRUEFTYA2LFPKU6XKW4A5QCKLUYCCRZ7HLEL52Q/m/target/local-repo -s /home/jenkins/jenkins-slave/workspace/mpiler-plugin_MCOMPILER-321-M3CCVQFTOYTT5MRUEFTYA2LFPKU6XKW4A5QCKLUYCCRZ7HLEL52Q/m/target/it/interpolated-settings.xml -D maven.compiler.target=1.7 -D maven.compiler.source=1.7 compile, jdk.debug=release, maven.version=3.5.2, java.specification.vendor=Oracle Corporation, java.home=/usr/local/asfpackages/java/jdk-9.0.1, java.specification.name=Java Platform API Specification, java.vm.specification.vendor=Oracle Corporation, env.JENKINS_SERVER_COOKIE=durable-c8133d8ae3fd312577be131d4bd83a30, sun.management.compiler=HotSpot 64-Bit Tiered Compilers, java.runtime.version=9.0.1+11, env.PATH=/home/jenkins/tools/java/latest1.9/bin:/home/jenkins/jenkins-slave/workspace/mpiler-plugin_MCOMPILER-321-M3CCVQFTOYTT5MRUEFTYA2LFPKU6XKW4A5QCKLUYCCRZ7HLEL52Q@tmp/withMaven9541a6f4:/usr/local/sbin:/usr/local/bin:/usr/sbin:/usr/bin:/sbin:/bin:/usr/games:/usr/local/games, env.MVN_CMD_DIR=/home/jenkins/jenkins-slave/workspace/mpiler-plugin_MCOMPILER-321-M3CCVQFTOYTT5MRUEFTYA2LFPKU6XKW4A5QCKLUYCCRZ7HLEL52Q@tmp/withMaven9541a6f4, file.encoding=ISO-8859-1, env._=/home/jenkins/jenkins-slave/workspace/mpiler-plugin_MCOMPILER-321-M3CCVQFTOYTT5MRUEFTYA2LFPKU6XKW4A5QCKLUYCCRZ7HLEL52Q@tmp/withMaven9541a6f4/mvn, env.SHLVL=2, java.io.tmpdir=/tmp, java.version=9.0.1, env.WORKSPACE=/home/jenkins/jenkins-slave/workspace/mpiler-plugin_MCOMPILER-321-M3CCVQFTOYTT5MRUEFTYA2LFPKU6XKW4A5QCKLUYCCRZ7HLEL52Q, java.vm.specification.name=Java Virtual Machine Specification, java.awt.printerjob=sun.print.PSPrinterJob, env.BUILD_ID=1, env.JOB_NAME=maven-box/maven-compiler-plugin/MCOMPILER-321, org.slf4j.simpleLogger.defaultLogLevel=debug, java.library.path=/usr/java/packages/lib:/usr/lib64:/lib64:/lib:/usr/lib, java.vendor=Oracle Corporation, classworlds.conf=/usr/local/asfpackages/maven/apache-maven-3.5.2/bin/m2.conf, env.HUDSON_HOME=/x1/jenkins/jenkins-home, env.XFILESEARCHPATH=/usr/dt/app-defaults/%L/Dt, sun.io.unicode.encoding=UnicodeLittle, env.LANG=en_US, env.SSH_CLIENT=62.210.60.235 50712 22, user.timezone=Etc/UTC, env.RUN_DISPLAY_URL=https://builds.apache.org/job/maven-box/job/maven-compiler-plugin/job/MCOMPILER-321/1/display/redirect, os.name=Linux, java.vm.specification.version=9, user.home=/home/jenkins, maven.compiler.source=1.7, env.SSH_CONNECTION=62.210.60.235 50712 67.195.81.178 22, env.HUDSON_COOKIE=85e15969-8e6e-49ab-a397-809fc78bb7d8, java.awt.graphicsenv=sun.awt.X11GraphicsEnvironment, env.JENKINS_URL=https://builds.apache.org/, path.separator=:, os.version=4.4.0-98-generic, env.MAIL=/var/mail/jenkins, env.NODE_NAME=H31, java.vm.name=Java HotSpot(TM) 64-Bit Server VM, env.SHELL=/bin/bash, maven.ext.class.path=/home/jenkins/jenkins-slave/workspace/mpiler-plugin_MCOMPILER-321-M3CCVQFTOYTT5MRUEFTYA2LFPKU6XKW4A5QCKLUYCCRZ7HLEL52Q@tmp/withMaven9541a6f4/pipeline-maven-spy.jar, env.M2_HOME=/home/jenkins/tools/maven/apache-maven-3.5.2, env.MAVEN_CONFIG=--batch-mode --show-version -Dmaven.repo.local="/home/jenkins/jenkins-slave/workspace/mpiler-plugin_MCOMPILER-321-M3CCVQFTOYTT5MRUEFTYA2LFPKU6XKW4A5QCKLUYCCRZ7HLEL52Q/.repository" , os.arch=amd64, maven.multiModuleProjectDirectory=/home/jenkins/jenkins-slave/workspace/mpiler-plugin_MCOMPILER-321-M3CCVQFTOYTT5MRUEFTYA2LFPKU6XKW4A5QCKLUYCCRZ7HLEL52Q/m/target/it/mcompiler-21_class-remove, env.MAVEN_PROJECTBASEDIR=/home/jenkins/jenkins-slave/workspace/mpiler-plugin_MCOMPILER-321-M3CCVQFTOYTT5MRUEFTYA2LFPKU6XKW4A5QCKLUYCCRZ7HLEL52Q/m/target/it/mcompiler-21_class-remove, java.vm.info=mixed mode, env.USER=jenkins, java.class.version=53.0, awt.toolkit=sun.awt.X11.XToolkit, env.BUILD_TAG=jenkins-maven-box-maven-compiler-plugin-MCOMPILER-321-1, sun.jnu.encoding=ISO-8859-1, env.HUDSON_URL=https://builds.apache.org/, maven.build.version=Apache Maven 3.5.2 (138edd61fd100ec658bfa2d307c43b76940a5d7d; 2017-10-18T07:58:13Z), maven.home=/usr/local/asfpackages/maven/apache-maven-3.5.2, env.JENKINS_NODE_COOKIE=a7e8f6c3-f4f0-4afa-960b-366152f00011, env.JAVA_HOME=/home/jenkins/tools/java/latest1.9, file.separator=/, java.vm.compressedOopsMode=Zero based, line.separator=
[linux-jdk9]        , env.JAVA_TOOL_OPTIONS=-Dmaven.ext.class.path="/home/jenkins/jenkins-slave/workspace/mpiler-plugin_MCOMPILER-321-M3CCVQFTOYTT5MRUEFTYA2LFPKU6XKW4A5QCKLUYCCRZ7HLEL52Q@tmp/withMaven9541a6f4/pipeline-maven-spy.jar" -Dorg.jenkinsci.plugins.pipeline.maven.reportsFolder="/home/jenkins/jenkins-slave/workspace/mpiler-plugin_MCOMPILER-321-M3CCVQFTOYTT5MRUEFTYA2LFPKU6XKW4A5QCKLUYCCRZ7HLEL52Q@tmp/withMaven9541a6f4" , env.JENKINS_MAVEN_AGENT_DISABLED=true, user.name=jenkins, env.MAVEN_TERMINATE_CMD=on, env.BUILD_URL=https://builds.apache.org/job/maven-box/job/maven-compiler-plugin/job/MCOMPILER-321/1/, env.LOGNAME=jenkins, env.JOB_URL=https://builds.apache.org/job/maven-box/job/maven-compiler-plugin/job/MCOMPILER-321/, env.NODE_LABELS=H31 ubuntu xenial, env.XDG_RUNTIME_DIR=/run/user/910, env.RUN_CHANGES_DISPLAY_URL=https://builds.apache.org/job/maven-box/job/maven-compiler-plugin/job/MCOMPILER-321/1/display/redirect?page=changes, sun.os.patch.level=unknown, maven.compiler.target=1.7, env.WIN_LABEL=Windows, library.jansi.path=/usr/local/asfpackages/maven/apache-maven-3.5.2/lib/jansi-native, maven.repo.local=/home/jenkins/jenkins-slave/workspace/mpiler-plugin_MCOMPILER-321-M3CCVQFTOYTT5MRUEFTYA2LFPKU6XKW4A5QCKLUYCCRZ7HLEL52Q/m/target/local-repo, env.OLDPWD=/home/jenkins/jenkins-slave/workspace/mpiler-plugin_MCOMPILER-321-M3CCVQFTOYTT5MRUEFTYA2LFPKU6XKW4A5QCKLUYCCRZ7HLEL52Q/m/target/it/mcompiler-21_class-remove, env.HUDSON_SERVER_COOKIE=f4ebd1e6b0d976e8, env.BUILD_NUMBER=1, env.PWD=/home/jenkins/jenkins-slave/workspace/mpiler-plugin_MCOMPILER-321-M3CCVQFTOYTT5MRUEFTYA2LFPKU6XKW4A5QCKLUYCCRZ7HLEL52Q/m/target/it/mcompiler-21_class-remove, file.encoding.pkg=sun.io, java.class.path=/usr/local/asfpackages/maven/apache-maven-3.5.2/boot/plexus-classworlds-2.5.2.jar, env.HOME=/home/jenkins, java.vm.vendor=Oracle Corporation, maven.conf=/usr/local/asfpackages/maven/apache-maven-3.5.2/conf, org.jenkinsci.plugins.pipeline.maven.reportsFolder=/home/jenkins/jenkins-slave/workspace/mpiler-plugin_MCOMPILER-321-M3CCVQFTOYTT5MRUEFTYA2LFPKU6XKW4A5QCKLUYCCRZ7HLEL52Q@tmp/withMaven9541a6f4, sun.java.launcher=SUN_STANDARD, user.country=US, env.BRANCH_NAME=MCOMPILER-321, sun.cpu.endian=little, user.language=en, env.NLSPATH=/usr/dt/lib/nls/msg/%L/%N.cat, env.MAVEN_HOME=/usr/local/asfpackages/maven/apache-maven-3.5.2, java.runtime.name=Java(TM) SE Runtime Environment, env.XDG_SESSION_ID=132, env.BUILD_DISPLAY_NAME=#1, env.STAGE_NAME=Build linux-jdk9, env.MVN_CMD=/home/jenkins/jenkins-slave/workspace/mpiler-plugin_MCOMPILER-321-M3CCVQFTOYTT5MRUEFTYA2LFPKU6XKW4A5QCKLUYCCRZ7HLEL52Q@tmp/withMaven9541a6f4/mvn, env.MAVEN_CMD_LINE_ARGS=--batch-mode --show-version -Dmaven.repo.local="/home/jenkins/jenkins-slave/workspace/mpiler-plugin_MCOMPILER-321-M3CCVQFTOYTT5MRUEFTYA2LFPKU6XKW4A5QCKLUYCCRZ7HLEL52Q/.repository"  -B -X -D maven.repo.local=/home/jenkins/jenkins-slave/workspace/mpiler-plugin_MCOMPILER-321-M3CCVQFTOYTT5MRUEFTYA2LFPKU6XKW4A5QCKLUYCCRZ7HLEL52Q/m/target/local-repo -s /home/jenkins/jenkins-slave/workspace/mpiler-plugin_MCOMPILER-321-M3CCVQFTOYTT5MRUEFTYA2LFPKU6XKW4A5QCKLUYCCRZ7HLEL52Q/m/target/it/interpolated-settings.xml -D maven.compiler.target=1.7 -D maven.compiler.source=1.7 compile, java.vendor.url.bug=http://bugreport.java.com/bugreport/, user.dir=/home/jenkins/jenkins-slave/workspace/mpiler-plugin_MCOMPILER-321-M3CCVQFTOYTT5MRUEFTYA2LFPKU6XKW4A5QCKLUYCCRZ7HLEL52Q/m/target/it/mcompiler-21_class-remove, java.vm.version=9.0.1+11, env.JOB_BASE_NAME=MCOMPILER-321}
[linux-jdk9]        [WARNING] Using platform encoding (ISO-8859-1 actually) to copy filtered resources, i.e. build is platform dependent!
[linux-jdk9]        [DEBUG] resource with targetPath null
[linux-jdk9]        directory /home/jenkins/jenkins-slave/workspace/mpiler-plugin_MCOMPILER-321-M3CCVQFTOYTT5MRUEFTYA2LFPKU6XKW4A5QCKLUYCCRZ7HLEL52Q/m/target/it/mcompiler-21_class-remove/src/main/resources
[linux-jdk9]        excludes []
[linux-jdk9]        includes []
[linux-jdk9]        [INFO] skip non existing resourceDirectory /home/jenkins/jenkins-slave/workspace/mpiler-plugin_MCOMPILER-321-M3CCVQFTOYTT5MRUEFTYA2LFPKU6XKW4A5QCKLUYCCRZ7HLEL52Q/m/target/it/mcompiler-21_class-remove/src/main/resources
[linux-jdk9]        [DEBUG] no use filter components
[linux-jdk9]        [INFO]
[linux-jdk9]        [INFO] --- maven-compiler-plugin:3.7.1-SNAPSHOT:compile (default-compile) @ mcompiler-21_class-remove ---
[linux-jdk9]        [DEBUG] Dependency collection stats: {ConflictMarker.analyzeTime=1297925, ConflictMarker.markTime=455499, ConflictMarker.nodeCount=118, ConflictIdSorter.graphTime=402742, ConflictIdSorter.topsortTime=130922, ConflictIdSorter.conflictIdCount=45, ConflictIdSorter.conflictIdCycleCount=0, ConflictResolver.totalTime=3721354, ConflictResolver.conflictItemCount=72, DefaultDependencyCollector.collectTime=326202780, DefaultDependencyCollector.transformTime=6052410}
[linux-jdk9]        [DEBUG] org.apache.maven.plugins:maven-compiler-plugin:jar:3.7.1-SNAPSHOT:
[linux-jdk9]        [DEBUG]    org.apache.maven:maven-plugin-api:jar:3.0:compile
[linux-jdk9]        [DEBUG]       org.apache.maven:maven-model:jar:3.0:compile
[linux-jdk9]        [DEBUG]       org.sonatype.sisu:sisu-inject-plexus:jar:1.4.2:compile
[linux-jdk9]        [DEBUG]          org.sonatype.sisu:sisu-inject-bean:jar:1.4.2:compile
[linux-jdk9]        [DEBUG]             org.sonatype.sisu:sisu-guice:jar:noaop:2.1.7:compile
[linux-jdk9]        [DEBUG]    org.apache.maven:maven-artifact:jar:3.0:compile
[linux-jdk9]        [DEBUG]       org.codehaus.plexus:plexus-utils:jar:2.0.4:compile
[linux-jdk9]        [DEBUG]    org.apache.maven:maven-core:jar:3.0:compile
[linux-jdk9]        [DEBUG]       org.apache.maven:maven-settings:jar:3.0:compile
[linux-jdk9]        [DEBUG]       org.apache.maven:maven-settings-builder:jar:3.0:compile
[linux-jdk9]        [DEBUG]       org.apache.maven:maven-repository-metadata:jar:3.0:compile
[linux-jdk9]        [DEBUG]       org.apache.maven:maven-model-builder:jar:3.0:compile
[linux-jdk9]        [DEBUG]       org.apache.maven:maven-aether-provider:jar:3.0:runtime
[linux-jdk9]        [DEBUG]       org.sonatype.aether:aether-impl:jar:1.7:compile
[linux-jdk9]        [DEBUG]          org.sonatype.aether:aether-spi:jar:1.7:compile
[linux-jdk9]        [DEBUG]       org.sonatype.aether:aether-api:jar:1.7:compile
[linux-jdk9]        [DEBUG]       org.sonatype.aether:aether-util:jar:1.7:compile
[linux-jdk9]        [DEBUG]       org.codehaus.plexus:plexus-interpolation:jar:1.14:compile
[linux-jdk9]        [DEBUG]       org.codehaus.plexus:plexus-classworlds:jar:2.2.3:compile
[linux-jdk9]        [DEBUG]       org.codehaus.plexus:plexus-component-annotations:jar:1.7.1:compile
[linux-jdk9]        [DEBUG]       org.sonatype.plexus:plexus-sec-dispatcher:jar:1.3:compile
[linux-jdk9]        [DEBUG]          org.sonatype.plexus:plexus-cipher:jar:1.4:compile
[linux-jdk9]        [DEBUG]    org.apache.maven.shared:maven-shared-utils:jar:3.1.0:compile
[linux-jdk9]        [DEBUG]       commons-io:commons-io:jar:2.5:compile
[linux-jdk9]        [DEBUG]    org.apache.maven.shared:maven-shared-incremental:jar:1.1:compile
[linux-jdk9]        [DEBUG]    org.codehaus.plexus:plexus-java:jar:0.9.6:compile
[linux-jdk9]        [DEBUG]       org.ow2.asm:asm:jar:6.0:compile
[linux-jdk9]        [DEBUG]       com.thoughtworks.qdox:qdox:jar:2.0-M7:compile
[linux-jdk9]        [DEBUG]    org.codehaus.plexus:plexus-compiler-api:jar:2.8.3:compile
[linux-jdk9]        [DEBUG]    org.codehaus.plexus:plexus-compiler-manager:jar:2.8.3:compile
[linux-jdk9]        [DEBUG]    org.codehaus.plexus:plexus-compiler-javac:jar:2.8.3:runtime
[linux-jdk9]        [DEBUG] Created new class realm plugin>org.apache.maven.plugins:maven-compiler-plugin:3.7.1-SNAPSHOT
[linux-jdk9]        [DEBUG] Importing foreign packages into class realm plugin>org.apache.maven.plugins:maven-compiler-plugin:3.7.1-SNAPSHOT
[linux-jdk9]        [DEBUG]   Imported:  < maven.api
[linux-jdk9]        [DEBUG] Populating class realm plugin>org.apache.maven.plugins:maven-compiler-plugin:3.7.1-SNAPSHOT
[linux-jdk9]        [DEBUG]   Included: org.apache.maven.plugins:maven-compiler-plugin:jar:3.7.1-SNAPSHOT
[linux-jdk9]        [DEBUG]   Included: org.sonatype.sisu:sisu-inject-bean:jar:1.4.2
[linux-jdk9]        [DEBUG]   Included: org.sonatype.sisu:sisu-guice:jar:noaop:2.1.7
[linux-jdk9]        [DEBUG]   Included: org.codehaus.plexus:plexus-utils:jar:2.0.4
[linux-jdk9]        [DEBUG]   Included: org.sonatype.aether:aether-util:jar:1.7
[linux-jdk9]        [DEBUG]   Included: org.codehaus.plexus:plexus-interpolation:jar:1.14
[linux-jdk9]        [DEBUG]   Included: org.codehaus.plexus:plexus-component-annotations:jar:1.7.1
[linux-jdk9]        [DEBUG]   Included: org.sonatype.plexus:plexus-sec-dispatcher:jar:1.3
[linux-jdk9]        [DEBUG]   Included: org.sonatype.plexus:plexus-cipher:jar:1.4
[linux-jdk9]        [DEBUG]   Included: org.apache.maven.shared:maven-shared-utils:jar:3.1.0
[linux-jdk9]        [DEBUG]   Included: commons-io:commons-io:jar:2.5
[linux-jdk9]        [DEBUG]   Included: org.apache.maven.shared:maven-shared-incremental:jar:1.1
[linux-jdk9]        [DEBUG]   Included: org.codehaus.plexus:plexus-java:jar:0.9.6
[linux-jdk9]        [DEBUG]   Included: org.ow2.asm:asm:jar:6.0
[linux-jdk9]        [DEBUG]   Included: com.thoughtworks.qdox:qdox:jar:2.0-M7
[linux-jdk9]        [DEBUG]   Included: org.codehaus.plexus:plexus-compiler-api:jar:2.8.3
[linux-jdk9]        [DEBUG]   Included: org.codehaus.plexus:plexus-compiler-manager:jar:2.8.3
[linux-jdk9]        [DEBUG]   Included: org.codehaus.plexus:plexus-compiler-javac:jar:2.8.3
[linux-jdk9]        [DEBUG] Configuring mojo org.apache.maven.plugins:maven-compiler-plugin:3.7.1-SNAPSHOT:compile from plugin realm ClassRealm[plugin>org.apache.maven.plugins:maven-compiler-plugin:3.7.1-SNAPSHOT, parent: jdk.internal.loader.ClassLoaders$AppClassLoader@17d10166]
[linux-jdk9]        [DEBUG] Configuring mojo 'org.apache.maven.plugins:maven-compiler-plugin:3.7.1-SNAPSHOT:compile' with basic configurator -->
[linux-jdk9]        [DEBUG]   (f) basedir = /home/jenkins/jenkins-slave/workspace/mpiler-plugin_MCOMPILER-321-M3CCVQFTOYTT5MRUEFTYA2LFPKU6XKW4A5QCKLUYCCRZ7HLEL52Q/m/target/it/mcompiler-21_class-remove
[linux-jdk9]        [DEBUG]   (f) buildDirectory = /home/jenkins/jenkins-slave/workspace/mpiler-plugin_MCOMPILER-321-M3CCVQFTOYTT5MRUEFTYA2LFPKU6XKW4A5QCKLUYCCRZ7HLEL52Q/m/target/it/mcompiler-21_class-remove/target
[linux-jdk9]        [DEBUG]   (f) compilePath = [/home/jenkins/jenkins-slave/workspace/mpiler-plugin_MCOMPILER-321-M3CCVQFTOYTT5MRUEFTYA2LFPKU6XKW4A5QCKLUYCCRZ7HLEL52Q/m/target/it/mcompiler-21_class-remove/target/classes]
[linux-jdk9]        [DEBUG]   (f) compileSourceRoots = [/home/jenkins/jenkins-slave/workspace/mpiler-plugin_MCOMPILER-321-M3CCVQFTOYTT5MRUEFTYA2LFPKU6XKW4A5QCKLUYCCRZ7HLEL52Q/m/target/it/mcompiler-21_class-remove/src/main/java]
[linux-jdk9]        [DEBUG]   (f) compilerId = javac
[linux-jdk9]        [DEBUG]   (f) debug = true
[linux-jdk9]        [DEBUG]   (f) failOnError = true
[linux-jdk9]        [DEBUG]   (f) failOnWarning = false
[linux-jdk9]        [DEBUG]   (f) forceJavacCompilerUse = false
[linux-jdk9]        [DEBUG]   (f) fork = false
[linux-jdk9]        [DEBUG]   (f) generatedSourcesDirectory = /home/jenkins/jenkins-slave/workspace/mpiler-plugin_MCOMPILER-321-M3CCVQFTOYTT5MRUEFTYA2LFPKU6XKW4A5QCKLUYCCRZ7HLEL52Q/m/target/it/mcompiler-21_class-remove/target/generated-sources/annotations
[linux-jdk9]        [DEBUG]   (f) mojoExecution = org.apache.maven.plugins:maven-compiler-plugin:3.7.1-SNAPSHOT:compile {execution: default-compile}
[linux-jdk9]        [DEBUG]   (f) optimize = false
[linux-jdk9]        [DEBUG]   (f) outputDirectory = /home/jenkins/jenkins-slave/workspace/mpiler-plugin_MCOMPILER-321-M3CCVQFTOYTT5MRUEFTYA2LFPKU6XKW4A5QCKLUYCCRZ7HLEL52Q/m/target/it/mcompiler-21_class-remove/target/classes
[linux-jdk9]        [DEBUG]   (f) parameters = false
[linux-jdk9]        [DEBUG]   (f) project = MavenProject: org.apache.maven.plugins.compiler.it:mcompiler-21_class-remove:1.0-SNAPSHOT @ /home/jenkins/jenkins-slave/workspace/mpiler-plugin_MCOMPILER-321-M3CCVQFTOYTT5MRUEFTYA2LFPKU6XKW4A5QCKLUYCCRZ7HLEL52Q/m/target/it/mcompiler-21_class-remove/pom.xml
[linux-jdk9]        [DEBUG]   (f) projectArtifact = org.apache.maven.plugins.compiler.it:mcompiler-21_class-remove:jar:1.0-SNAPSHOT
[linux-jdk9]        [DEBUG]   (f) session = org.apache.maven.execution.MavenSession@6fd5717c
[linux-jdk9]        [DEBUG]   (f) showDeprecation = false
[linux-jdk9]        [DEBUG]   (f) showWarnings = false
[linux-jdk9]        [DEBUG]   (f) skipMultiThreadWarning = false
[linux-jdk9]        [DEBUG]   (f) source = 1.7
[linux-jdk9]        [DEBUG]   (f) staleMillis = 0
[linux-jdk9]        [DEBUG]   (f) target = 1.7
[linux-jdk9]        [DEBUG]   (f) useIncrementalCompilation = true
[linux-jdk9]        [DEBUG]   (f) verbose = false
[linux-jdk9]        [DEBUG] -- end configuration --
[linux-jdk9]        [DEBUG] Using compiler 'javac'.
[linux-jdk9]        [DEBUG] Adding /home/jenkins/jenkins-slave/workspace/mpiler-plugin_MCOMPILER-321-M3CCVQFTOYTT5MRUEFTYA2LFPKU6XKW4A5QCKLUYCCRZ7HLEL52Q/m/target/it/mcompiler-21_class-remove/target/generated-sources/annotations to compile source roots:
[linux-jdk9]          /home/jenkins/jenkins-slave/workspace/mpiler-plugin_MCOMPILER-321-M3CCVQFTOYTT5MRUEFTYA2LFPKU6XKW4A5QCKLUYCCRZ7HLEL52Q/m/target/it/mcompiler-21_class-remove/src/main/java
[linux-jdk9]        [DEBUG] New compile source roots:
[linux-jdk9]          /home/jenkins/jenkins-slave/workspace/mpiler-plugin_MCOMPILER-321-M3CCVQFTOYTT5MRUEFTYA2LFPKU6XKW4A5QCKLUYCCRZ7HLEL52Q/m/target/it/mcompiler-21_class-remove/src/main/java
[linux-jdk9]          /home/jenkins/jenkins-slave/workspace/mpiler-plugin_MCOMPILER-321-M3CCVQFTOYTT5MRUEFTYA2LFPKU6XKW4A5QCKLUYCCRZ7HLEL52Q/m/target/it/mcompiler-21_class-remove/target/generated-sources/annotations
[linux-jdk9]        [DEBUG] CompilerReuseStrategy: reuseCreated
[linux-jdk9]        [DEBUG] useIncrementalCompilation enabled
[linux-jdk9]        [INFO] Changes detected - recompiling the module!
[linux-jdk9]        [DEBUG] Classpath:
[linux-jdk9]        [DEBUG]  /home/jenkins/jenkins-slave/workspace/mpiler-plugin_MCOMPILER-321-M3CCVQFTOYTT5MRUEFTYA2LFPKU6XKW4A5QCKLUYCCRZ7HLEL52Q/m/target/it/mcompiler-21_class-remove/target/classes
[linux-jdk9]        [DEBUG] Source roots:
[linux-jdk9]        [DEBUG]  /home/jenkins/jenkins-slave/workspace/mpiler-plugin_MCOMPILER-321-M3CCVQFTOYTT5MRUEFTYA2LFPKU6XKW4A5QCKLUYCCRZ7HLEL52Q/m/target/it/mcompiler-21_class-remove/src/main/java
[linux-jdk9]        [DEBUG]  /home/jenkins/jenkins-slave/workspace/mpiler-plugin_MCOMPILER-321-M3CCVQFTOYTT5MRUEFTYA2LFPKU6XKW4A5QCKLUYCCRZ7HLEL52Q/m/target/it/mcompiler-21_class-remove/target/generated-sources/annotations
[linux-jdk9]        [DEBUG] Command line options:
[linux-jdk9]        [DEBUG] -d /home/jenkins/jenkins-slave/workspace/mpiler-plugin_MCOMPILER-321-M3CCVQFTOYTT5MRUEFTYA2LFPKU6XKW4A5QCKLUYCCRZ7HLEL52Q/m/target/it/mcompiler-21_class-remove/target/classes -classpath /home/jenkins/jenkins-slave/workspace/mpiler-plugin_MCOMPILER-321-M3CCVQFTOYTT5MRUEFTYA2LFPKU6XKW4A5QCKLUYCCRZ7HLEL52Q/m/target/it/mcompiler-21_class-remove/target/classes: -sourcepath /home/jenkins/jenkins-slave/workspace/mpiler-plugin_MCOMPILER-321-M3CCVQFTOYTT5MRUEFTYA2LFPKU6XKW4A5QCKLUYCCRZ7HLEL52Q/m/target/it/mcompiler-21_class-remove/src/main/java:/home/jenkins/jenkins-slave/workspace/mpiler-plugin_MCOMPILER-321-M3CCVQFTOYTT5MRUEFTYA2LFPKU6XKW4A5QCKLUYCCRZ7HLEL52Q/m/target/it/mcompiler-21_class-remove/target/generated-sources/annotations: -s /home/jenkins/jenkins-slave/workspace/mpiler-plugin_MCOMPILER-321-M3CCVQFTOYTT5MRUEFTYA2LFPKU6XKW4A5QCKLUYCCRZ7HLEL52Q/m/target/it/mcompiler-21_class-remove/target/generated-sources/annotations -g -nowarn -target 1.7 -source 1.7
[linux-jdk9]        [WARNING] File encoding has not been set, using platform encoding ISO-8859-1, i.e. build is platform dependent!
[linux-jdk9]        [DEBUG] incrementalBuildHelper#beforeRebuildExecution
[linux-jdk9]        [INFO] Compiling 1 source file to /home/jenkins/jenkins-slave/workspace/mpiler-plugin_MCOMPILER-321-M3CCVQFTOYTT5MRUEFTYA2LFPKU6XKW4A5QCKLUYCCRZ7HLEL52Q/m/target/it/mcompiler-21_class-remove/target/classes
[linux-jdk9]        Running post-build script: /home/jenkins/jenkins-slave/workspace/mpiler-plugin_MCOMPILER-321-M3CCVQFTOYTT5MRUEFTYA2LFPKU6XKW4A5QCKLUYCCRZ7HLEL52Q/m/target/it/mcompiler-21_class-remove/verify.groovy
[linux-jdk9] [INFO] Building: MCOMPILER-275_separate-moduleinfo/pom.xml
[Pipeline] [windows-jdk7] // node
[Pipeline] [windows-jdk8] // node
[Pipeline] [windows-jdk9] // node
[Pipeline] [windows-jdk7] }
[windows-jdk7] Failed in branch windows-jdk7
[Pipeline] [windows-jdk8] }
[windows-jdk8] Failed in branch windows-jdk8
[Pipeline] [windows-jdk9] }
[windows-jdk9] Failed in branch windows-jdk9
[Pipeline] [linux-jdk7] }
[Pipeline] [linux-jdk7] // dir
[linux-jdk9] Terminated
[Pipeline] [linux-jdk7] }
[linux-jdk7] [withMaven] One or multiple Maven executions have been ignored by the Jenkins Pipeline Maven Plugin because they have been interrupted before completion (1). See Pipeline Maven Plugin FAQ for more details.
[Pipeline] [linux-jdk7] // withMaven
[Pipeline] [linux-jdk7] echo
[linux-jdk7] [FAIL FAST] linux-jdk8 had first failure, ignoring script returned exit code 143
[Pipeline] [linux-jdk7] }
[Pipeline] [linux-jdk9] }
[Pipeline] [linux-jdk7] // stage
[Pipeline] [linux-jdk9] // dir
[Pipeline] [linux-jdk7] }
[Pipeline] [linux-jdk9] }
[linux-jdk9] [withMaven] One or multiple Maven executions have been ignored by the Jenkins Pipeline Maven Plugin because they have been interrupted before completion (1). See Pipeline Maven Plugin FAQ for more details.
[Pipeline] [linux-jdk7] // node
[Pipeline] [linux-jdk9] // withMaven
[Pipeline] [linux-jdk7] }
[Pipeline] [linux-jdk9] echo
[linux-jdk9] [FAIL FAST] linux-jdk8 had first failure, ignoring script returned exit code 143
[Pipeline] [linux-jdk9] }
[Pipeline] [linux-jdk9] // stage
[Pipeline] [linux-jdk9] }
[Pipeline] [linux-jdk9] // node
[Pipeline] [linux-jdk9] }
[Pipeline] // parallel
[Pipeline] echo
***** FAST FAILURE *****

Fast failure triggered by linux-jdk8

***** FAST FAILURE *****
[Pipeline] stage
[Pipeline] { (Notifications)
[Pipeline] echo
Build result: FAILURE
[Pipeline] jiraIssueSelector
[Pipeline] emailext
Reply | Threaded
Open this post in threaded view
|

Build failed in Jenkins: Maven TLP » maven-compiler-plugin » MCOMPILER-321 #2

Apache Jenkins Server-2
See https://builds.apache.org/job/maven-box/job/maven-compiler-plugin/job/MCOMPILER-321/2/

Changes:

* Add JDK 10 (latest)
* Change JDK10 on Windows to 'JDK 10 b46 (Windows Only)'
* Add Java 11-ea
* Add JDK 10 to the jdk default
* auto deploy if we are currently on master branch
* revert as it seems to fail on jenkins asf
* revert this one as well
* enable TLS 1.2 for Java 7

No tests ran.

Build log:
[...truncated 1.04 MB...]
[windows-jdk9] [info] No sources to compile
[windows-jdk9] [debug] Using compiler 'javac'.
[windows-jdk9] [info] No sources to compile
[windows-jdk9] [debug] Using compiler 'javac'.
[windows-jdk9] [debug] CompilerReuseStrategy: reuseCreated
[windows-jdk9] [debug] useIncrementalCompilation enabled
[windows-jdk9] [info] Changes detected - recompiling the module!
[windows-jdk9] [debug] Classpath:
[windows-jdk9] [debug] Source roots:
[windows-jdk9] [debug]  f:\jenkins\jenkins-slave\workspace\mpiler-plugin_MCOMPILER-321-M3CCVQFTOYTT5MRUEFTYA2LFPKU6XKW4A5QCKLUYCCRZ7HLEL52Q\m/target/test-classes/unit/compiler-fail-test/src/main/java
[windows-jdk9] [warn] File encoding has not been set, using platform encoding Cp1252, i.e. build is platform dependent!
[windows-jdk9] [debug] incrementalBuildHelper#beforeRebuildExecution
[windows-jdk9] [debug] incrementalBuildHelper#afterRebuildExecution
[windows-jdk9] [info] message 1
[windows-jdk9] [debug] Using compiler 'javac'.
[windows-jdk9] [debug] CompilerReuseStrategy: reuseCreated
[windows-jdk9] [debug] useIncrementalCompilation enabled
[windows-jdk9] [info] Changes detected - recompiling the module!
[windows-jdk9] [debug] Classpath:
[windows-jdk9] [debug] Source roots:
[windows-jdk9] [debug]  f:\jenkins\jenkins-slave\workspace\mpiler-plugin_MCOMPILER-321-M3CCVQFTOYTT5MRUEFTYA2LFPKU6XKW4A5QCKLUYCCRZ7HLEL52Q\m/target/test-classes/unit/compiler-one-output-file-test2/src/main/java
[windows-jdk9] [warn] File encoding has not been set, using platform encoding Cp1252, i.e. build is platform dependent!
[windows-jdk9] [debug] incrementalBuildHelper#beforeRebuildExecution
[windows-jdk9] [debug] incrementalBuildHelper#afterRebuildExecution
[windows-jdk9] [info] message 1
[windows-jdk9] [debug] Using compiler 'javac'.
[windows-jdk9] [debug] CompilerReuseStrategy: reuseCreated
[windows-jdk9] [debug] useIncrementalCompilation enabled
[windows-jdk9] [info] Changes detected - recompiling the module!
[windows-jdk9] [debug] Classpath:
[windows-jdk9] [debug]  f:\jenkins\jenkins-slave\workspace\mpiler-plugin_MCOMPILER-321-M3CCVQFTOYTT5MRUEFTYA2LFPKU6XKW4A5QCKLUYCCRZ7HLEL52Q\.repository\junit\junit\3.8.1\junit-3.8.1.jar
[windows-jdk9] [debug]  f:\jenkins\jenkins-slave\workspace\mpiler-plugin_MCOMPILER-321-M3CCVQFTOYTT5MRUEFTYA2LFPKU6XKW4A5QCKLUYCCRZ7HLEL52Q\m\target\test\unit\compiler-one-output-file-test2\target\classes
[windows-jdk9] [debug] Source roots:
[windows-jdk9] [debug]  f:\jenkins\jenkins-slave\workspace\mpiler-plugin_MCOMPILER-321-M3CCVQFTOYTT5MRUEFTYA2LFPKU6XKW4A5QCKLUYCCRZ7HLEL52Q\m\target\test-classes\unit\compiler-one-output-file-test2/src/test/java
[windows-jdk9] [warn] File encoding has not been set, using platform encoding Cp1252, i.e. build is platform dependent!
[windows-jdk9] [debug] incrementalBuildHelper#beforeRebuildExecution
[windows-jdk9] [debug] incrementalBuildHelper#afterRebuildExecution
[windows-jdk9] [info] message 1
[windows-jdk9] [debug] Using compiler 'javac'.
[windows-jdk9] [debug] CompilerReuseStrategy: reuseCreated
[windows-jdk9] [debug] useIncrementalCompilation enabled
[windows-jdk9] [info] Changes detected - recompiling the module!
[windows-jdk9] [debug] Classpath:
[windows-jdk9] [debug] Source roots:
[windows-jdk9] [debug]  f:\jenkins\jenkins-slave\workspace\mpiler-plugin_MCOMPILER-321-M3CCVQFTOYTT5MRUEFTYA2LFPKU6XKW4A5QCKLUYCCRZ7HLEL52Q\m/target/test-classes/unit/compiler-one-output-file-test/src/main/java
[windows-jdk9] [warn] File encoding has not been set, using platform encoding Cp1252, i.e. build is platform dependent!
[windows-jdk9] [debug] incrementalBuildHelper#beforeRebuildExecution
[windows-jdk9] [debug] incrementalBuildHelper#afterRebuildExecution
[windows-jdk9] [info] message 1
[windows-jdk9] [debug] Using compiler 'javac'.
[windows-jdk9] [debug] CompilerReuseStrategy: reuseCreated
[windows-jdk9] [debug] useIncrementalCompilation enabled
[windows-jdk9] [info] Changes detected - recompiling the module!
[windows-jdk9] [debug] Classpath:
[windows-jdk9] [debug]  f:\jenkins\jenkins-slave\workspace\mpiler-plugin_MCOMPILER-321-M3CCVQFTOYTT5MRUEFTYA2LFPKU6XKW4A5QCKLUYCCRZ7HLEL52Q\.repository\junit\junit\3.8.1\junit-3.8.1.jar
[windows-jdk9] [debug]  f:\jenkins\jenkins-slave\workspace\mpiler-plugin_MCOMPILER-321-M3CCVQFTOYTT5MRUEFTYA2LFPKU6XKW4A5QCKLUYCCRZ7HLEL52Q\m\target\test\unit\compiler-one-output-file-test\target\classes
[windows-jdk9] [debug] Source roots:
[windows-jdk9] [debug]  f:\jenkins\jenkins-slave\workspace\mpiler-plugin_MCOMPILER-321-M3CCVQFTOYTT5MRUEFTYA2LFPKU6XKW4A5QCKLUYCCRZ7HLEL52Q\m\target\test-classes\unit\compiler-one-output-file-test/src/test/java
[windows-jdk9] [warn] File encoding has not been set, using platform encoding Cp1252, i.e. build is platform dependent!
[windows-jdk9] [debug] incrementalBuildHelper#beforeRebuildExecution
[windows-jdk9] [debug] incrementalBuildHelper#afterRebuildExecution
[windows-jdk9] [info] message 1
[windows-jdk9] [debug] Using compiler 'javac'.
[windows-jdk9] [debug] CompilerReuseStrategy: reuseCreated
[windows-jdk9] [debug] useIncrementalCompilation enabled
[windows-jdk9] [info] Changes detected - recompiling the module!
[windows-jdk9] [debug] Classpath:
[windows-jdk9] [debug] Source roots:
[windows-jdk9] [debug]  f:\jenkins\jenkins-slave\workspace\mpiler-plugin_MCOMPILER-321-M3CCVQFTOYTT5MRUEFTYA2LFPKU6XKW4A5QCKLUYCCRZ7HLEL52Q\m/target/test-classes/unit/compiler-fail-test/src/main/java
[windows-jdk9] [warn] File encoding has not been set, using platform encoding Cp1252, i.e. build is platform dependent!
[windows-jdk9] [debug] incrementalBuildHelper#beforeRebuildExecution
[windows-jdk9] [debug] incrementalBuildHelper#afterRebuildExecution
[windows-jdk9] [info] message 1
[windows-jdk9] [debug] Using compiler 'javac'.
[windows-jdk9] [debug] CompilerReuseStrategy: reuseCreated
[windows-jdk9] [debug] useIncrementalCompilation enabled
[windows-jdk9] [info] Changes detected - recompiling the module!
[windows-jdk9] [debug] Classpath:
[windows-jdk9] [debug] Source roots:
[windows-jdk9] [debug]  f:\jenkins\jenkins-slave\workspace\mpiler-plugin_MCOMPILER-321-M3CCVQFTOYTT5MRUEFTYA2LFPKU6XKW4A5QCKLUYCCRZ7HLEL52Q\m/target/test-classes/unit/compiler-args-test/src/main/java
[windows-jdk9] [warn] File encoding has not been set, using platform encoding Cp1252, i.e. build is platform dependent!
[windows-jdk9] [debug] incrementalBuildHelper#beforeRebuildExecution
[windows-jdk9] [debug] incrementalBuildHelper#afterRebuildExecution
[windows-jdk9] [info] message 1
[windows-jdk9] [debug] Using compiler 'javac'.
[windows-jdk9] [debug] CompilerReuseStrategy: reuseCreated
[windows-jdk9] [debug] useIncrementalCompilation enabled
[windows-jdk9] [debug] unable to get start time for the current build: null
[windows-jdk9] [debug] Stale source detected: f:\jenkins\jenkins-slave\workspace\mpiler-plugin_MCOMPILER-321-M3CCVQFTOYTT5MRUEFTYA2LFPKU6XKW4A5QCKLUYCCRZ7HLEL52Q\m\target\test-classes\unit\compiler-fork-test\src\main\java\TestCompile1.java
[windows-jdk9] [info] Changes detected - recompiling the module!
[windows-jdk9] [debug] Classpath:
[windows-jdk9] [debug] Source roots:
[windows-jdk9] [debug]  f:\jenkins\jenkins-slave\workspace\mpiler-plugin_MCOMPILER-321-M3CCVQFTOYTT5MRUEFTYA2LFPKU6XKW4A5QCKLUYCCRZ7HLEL52Q\m/target/test-classes/unit/compiler-fork-test/src/main/java
[windows-jdk9] [debug] Excutable:
[windows-jdk9] [debug]  f:\jenkins\tools\java\latest9\bin\javac
[windows-jdk9] [debug] Command line options:
[windows-jdk9] [debug] -d f:\jenkins\jenkins-slave\workspace\mpiler-plugin_MCOMPILER-321-M3CCVQFTOYTT5MRUEFTYA2LFPKU6XKW4A5QCKLUYCCRZ7HLEL52Q\m\target\test\unit\compiler-fork-test\target\classes -sourcepath f:\jenkins\jenkins-slave\workspace\mpiler-plugin_MCOMPILER-321-M3CCVQFTOYTT5MRUEFTYA2LFPKU6XKW4A5QCKLUYCCRZ7HLEL52Q\m/target/test-classes/unit/compiler-fork-test/src/main/java; f:\jenkins\jenkins-slave\workspace\mpiler-plugin_MCOMPILER-321-M3CCVQFTOYTT5MRUEFTYA2LFPKU6XKW4A5QCKLUYCCRZ7HLEL52Q\m\target\test-classes\unit\compiler-fork-test\src\main\java\TestCompile1.java -g -verbose -target 6 -source 6
[windows-jdk9] [warn] File encoding has not been set, using platform encoding Cp1252, i.e. build is platform dependent!
[windows-jdk9] [debug] incrementalBuildHelper#beforeRebuildExecution
[windows-jdk9] [INFO] Compiling 1 source file to f:\jenkins\jenkins-slave\workspace\mpiler-plugin_MCOMPILER-321-M3CCVQFTOYTT5MRUEFTYA2LFPKU6XKW4A5QCKLUYCCRZ7HLEL52Q\m\target\test\unit\compiler-fork-test\target\classes
[windows-jdk7] [INFO] Downloaded: https://repo.maven.apache.org/maven2/org/apache/maven/doxia/doxia-module-xdoc/1.8/doxia-module-xdoc-1.8.pom (4.7 kB at 316 kB/s)
[windows-jdk7] [INFO] Downloading: https://repo.maven.apache.org/maven2/org/apache/maven/doxia/doxia-module-fml/1.8/doxia-module-fml-1.8.pom
[windows-jdk7] [INFO] Downloaded: https://repo.maven.apache.org/maven2/org/apache/maven/doxia/doxia-module-fml/1.8/doxia-module-fml-1.8.pom (4.6 kB at 202 kB/s)
[windows-jdk7] [INFO] Downloading: https://repo.maven.apache.org/maven2/org/apache/maven/doxia/doxia-module-markdown/1.8/doxia-module-markdown-1.8.pom
[windows-jdk7] [INFO] Downloaded: https://repo.maven.apache.org/maven2/org/apache/maven/doxia/doxia-module-markdown/1.8/doxia-module-markdown-1.8.pom (2.4 kB at 349 kB/s)
[windows-jdk7] [INFO] Downloading: https://repo.maven.apache.org/maven2/com/vladsch/flexmark/flexmark-all/0.18.4/flexmark-all-0.18.4.pom
[windows-jdk7] [INFO] Downloaded: https://repo.maven.apache.org/maven2/com/vladsch/flexmark/flexmark-all/0.18.4/flexmark-all-0.18.4.pom (7.4 kB at 460 kB/s)
[windows-jdk7] [INFO] Downloading: https://repo.maven.apache.org/maven2/com/vladsch/flexmark/flexmark-java/0.18.4/flexmark-java-0.18.4.pom
[windows-jdk7] [INFO] Downloaded: https://repo.maven.apache.org/maven2/com/vladsch/flexmark/flexmark-java/0.18.4/flexmark-java-0.18.4.pom (17 kB at 1.1 MB/s)
[windows-jdk7] [INFO] Downloading: https://repo.maven.apache.org/maven2/com/vladsch/flexmark/flexmark/0.18.4/flexmark-0.18.4.pom
[windows-jdk8] Sending interrupt signal to process
[windows-jdk8] [INFO] Downloaded: https://repo.maven.apache.org/maven2/com/vladsch/flexmark/flexmark-ext-typographic/0.18.4/flexmark-ext-typographic-0.18.4.pom (1.3 kB at 81 kB/s)
[windows-jdk8] [INFO] Downloading: https://repo.maven.apache.org/maven2/com/vladsch/flexmark/flexmark-ext-anchorlink/0.18.4/flexmark-ext-anchorlink-0.18.4.pom
[windows-jdk8] [INFO] Downloaded: https://repo.maven.apache.org/maven2/com/vladsch/flexmark/flexmark-ext-anchorlink/0.18.4/flexmark-ext-anchorlink-0.18.4.pom (1.6 kB at 53 kB/s)
[windows-jdk8] [INFO] Downloading: https://repo.maven.apache.org/maven2/com/vladsch/flexmark/flexmark-ext-aside/0.18.4/flexmark-ext-aside-0.18.4.pom
[windows-jdk8] [INFO] Downloaded: https://repo.maven.apache.org/maven2/com/vladsch/flexmark/flexmark-ext-aside/0.18.4/flexmark-ext-aside-0.18.4.pom (1.5 kB at 123 kB/s)
[windows-jdk8] [INFO] Downloading: https://repo.maven.apache.org/maven2/com/vladsch/flexmark/flexmark-jira-converter/0.18.4/flexmark-jira-converter-0.18.4.pom
[windows-jdk8] [INFO] Downloaded: https://repo.maven.apache.org/maven2/com/vladsch/flexmark/flexmark-jira-converter/0.18.4/flexmark-jira-converter-0.18.4.pom (2.1 kB at 162 kB/s)
[windows-jdk8] [INFO] Downloading: https://repo.maven.apache.org/maven2/com/vladsch/flexmark/flexmark-ext-gfm-strikethrough/0.18.4/flexmark-ext-gfm-strikethrough-0.18.4.pom
[windows-jdk8] [INFO] Downloaded: https://repo.maven.apache.org/maven2/com/vladsch/flexmark/flexmark-ext-gfm-strikethrough/0.18.4/flexmark-ext-gfm-strikethrough-0.18.4.pom (1.3 kB at 103 kB/s)
[windows-jdk8] [INFO] Downloading: https://repo.maven.apache.org/maven2/com/vladsch/flexmark/flexmark-ext-tables/0.18.4/flexmark-ext-tables-0.18.4.pom
[windows-jdk8] [INFO] Downloaded: https://repo.maven.apache.org/maven2/com/vladsch/flexmark/flexmark-ext-tables/0.18.4/flexmark-ext-tables-0.18.4.pom (1.3 kB at 52 kB/s)
[windows-jdk8] [INFO] Downloading: https://repo.maven.apache.org/maven2/com/vladsch/flexmark/flexmark-ext-wikilink/0.18.4/flexmark-ext-wikilink-0.18.4.pom
[windows-jdk8] [INFO] Downloaded: https://repo.maven.apache.org/maven2/com/vladsch/flexmark/flexmark-ext-wikilink/0.18.4/flexmark-ext-wikilink-0.18.4.pom (1.3 kB at 120 kB/s)
[windows-jdk8] [INFO] Downloading: https://repo.maven.apache.org/maven2/com/vladsch/flexmark/flexmark-ext-ins/0.18.4/flexmark-ext-ins-0.18.4.pom
[windows-jdk8] [INFO] Downloaded: https://repo.maven.apache.org/maven2/com/vladsch/flexmark/flexmark-ext-ins/0.18.4/flexmark-ext-ins-0.18.4.pom (1.3 kB at 98 kB/s)
[windows-jdk8] [INFO] Downloading: https://repo.maven.apache.org/maven2/com/vladsch/flexmark/flexmark-ext-superscript/0.18.4/flexmark-ext-superscript-0.18.4.pom
[windows-jdk8] [INFO] Downloaded: https://repo.maven.apache.org/maven2/com/vladsch/flexmark/flexmark-ext-superscript/0.18.4/flexmark-ext-superscript-0.18.4.pom (1.3 kB at 100 kB/s)
[windows-jdk8] [INFO] Downloading: https://repo.maven.apache.org/maven2/com/vladsch/flexmark/flexmark-ext-definition/0.18.4/flexmark-ext-definition-0.18.4.pom
[windows-jdk8] [INFO] Downloaded: https://repo.maven.apache.org/maven2/com/vladsch/flexmark/flexmark-ext-definition/0.18.4/flexmark-ext-definition-0.18.4.pom (1.3 kB at 117 kB/s)
[windows-jdk8] [INFO] Downloading: https://repo.maven.apache.org/maven2/com/vladsch/flexmark/flexmark-ext-emoji/0.18.4/flexmark-ext-emoji-0.18.4.pom
[windows-jdk8] [INFO] Downloaded: https://repo.maven.apache.org/maven2/com/vladsch/flexmark/flexmark-ext-emoji/0.18.4/flexmark-ext-emoji-0.18.4.pom (1.5 kB at 117 kB/s)
[windows-jdk8] [INFO] Downloading: https://repo.maven.apache.org/maven2/com/vladsch/flexmark/flexmark-ext-escaped-character/0.18.4/flexmark-ext-escaped-character-0.18.4.pom
[windows-jdk8] [INFO] Downloaded: https://repo.maven.apache.org/maven2/com/vladsch/flexmark/flexmark-ext-escaped-character/0.18.4/flexmark-ext-escaped-character-0.18.4.pom (1.3 kB at 119 kB/s)
[windows-jdk8] [INFO] Downloading: https://repo.maven.apache.org/maven2/com/vladsch/flexmark/flexmark-ext-footnotes/0.18.4/flexmark-ext-footnotes-0.18.4.pom
[windows-jdk8] [INFO] Downloaded: https://repo.maven.apache.org/maven2/com/vladsch/flexmark/flexmark-ext-footnotes/0.18.4/flexmark-ext-footnotes-0.18.4.pom (1.3 kB at 111 kB/s)
[windows-jdk8] [INFO] Downloading: https://repo.maven.apache.org/maven2/com/vladsch/flexmark/flexmark-ext-gfm-tables/0.18.4/flexmark-ext-gfm-tables-0.18.4.pom
[windows-jdk8] [INFO] Downloaded: https://repo.maven.apache.org/maven2/com/vladsch/flexmark/flexmark-ext-gfm-tables/0.18.4/flexmark-ext-gfm-tables-0.18.4.pom (1.3 kB at 111 kB/s)
[windows-jdk8] [INFO] Downloading: https://repo.maven.apache.org/maven2/com/vladsch/flexmark/flexmark-ext-gfm-tasklist/0.18.4/flexmark-ext-gfm-tasklist-0.18.4.pom
[windows-jdk8] [INFO] Downloaded: https://repo.maven.apache.org/maven2/com/vladsch/flexmark/flexmark-ext-gfm-tasklist/0.18.4/flexmark-ext-gfm-tasklist-0.18.4.pom (1.4 kB at 106 kB/s)
[windows-jdk8] [INFO] Downloading: https://repo.maven.apache.org/maven2/com/vladsch/flexmark/flexmark-ext-jekyll-front-matter/0.18.4/flexmark-ext-jekyll-front-matter-0.18.4.pom
[windows-jdk8] [INFO] Downloaded: https://repo.maven.apache.org/maven2/com/vladsch/flexmark/flexmark-ext-jekyll-front-matter/0.18.4/flexmark-ext-jekyll-front-matter-0.18.4.pom (1.5 kB at 123 kB/s)
[windows-jdk8] [INFO] Downloading: https://repo.maven.apache.org/maven2/com/vladsch/flexmark/flexmark-ext-yaml-front-matter/0.18.4/flexmark-ext-yaml-front-matter-0.18.4.pom
[windows-jdk8] [INFO] Downloaded: https://repo.maven.apache.org/maven2/com/vladsch/flexmark/flexmark-ext-yaml-front-matter/0.18.4/flexmark-ext-yaml-front-matter-0.18.4.pom (1.3 kB at 109 kB/s)
[windows-jdk8] [INFO] Downloading: https://repo.maven.apache.org/maven2/com/vladsch/flexmark/flexmark-ext-jekyll-tag/0.18.4/flexmark-ext-jekyll-tag-0.18.4.pom
[windows-jdk8] [INFO] Downloaded: https://repo.maven.apache.org/maven2/com/vladsch/flexmark/flexmark-ext-jekyll-tag/0.18.4/flexmark-ext-jekyll-tag-0.18.4.pom (1.3 kB at 109 kB/s)
[windows-jdk8] [INFO] Downloading: https://repo.maven.apache.org/maven2/com/vladsch/flexmark/flexmark-ext-xwiki-macros/0.18.4/flexmark-ext-xwiki-macros-0.18.4.pom
[windows-jdk8] [INFO] Downloaded: https://repo.maven.apache.org/maven2/com/vladsch/flexmark/flexmark-ext-xwiki-macros/0.18.4/flexmark-ext-xwiki-macros-0.18.4.pom (1.3 kB at 112 kB/s)
[windows-jdk8] [INFO] Downloading: https://repo.maven.apache.org/maven2/com/vladsch/flexmark/flexmark-ext-spec-example/0.18.4/flexmark-ext-spec-example-0.18.4.pom
[windows-jdk8] [INFO] Downloaded: https://repo.maven.apache.org/maven2/com/vladsch/flexmark/flexmark-ext-spec-example/0.18.4/flexmark-ext-spec-example-0.18.4.pom (1.3 kB at 105 kB/s)
[windows-jdk8] [INFO] Downloading: https://repo.maven.apache.org/maven2/com/vladsch/flexmark/flexmark-test-util/0.18.4/flexmark-test-util-0.18.4.pom
[windows-jdk8] [INFO] Downloaded: https://repo.maven.apache.org/maven2/com/vladsch/flexmark/flexmark-test-util/0.18.4/flexmark-test-util-0.18.4.pom (917 B at 66 kB/s)
[windows-jdk8] [INFO] Downloading: https://repo.maven.apache.org/maven2/com/vladsch/flexmark/flexmark-ext-toc/0.18.4/flexmark-ext-toc-0.18.4.pom
[windows-jdk8] [INFO] Downloaded: https://repo.maven.apache.org/maven2/com/vladsch/flexmark/flexmark-ext-toc/0.18.4/flexmark-ext-toc-0.18.4.pom (1.3 kB at 85 kB/s)
[windows-jdk8] [INFO] Downloading: https://repo.maven.apache.org/maven2/com/vladsch/flexmark/flexmark-html-parser/0.18.4/flexmark-html-parser-0.18.4.pom
[windows-jdk8] [INFO] Downloaded: https://repo.maven.apache.org/maven2/com/vladsch/flexmark/flexmark-html-parser/0.18.4/flexmark-html-parser-0.18.4.pom (1.5 kB at 133 kB/s)
[windows-jdk8] [INFO] Downloading: https://repo.maven.apache.org/maven2/org/jsoup/jsoup/1.10.2/jsoup-1.10.2.pom
[windows-jdk8] [INFO] Downloaded: https://repo.maven.apache.org/maven2/org/jsoup/jsoup/1.10.2/jsoup-1.10.2.pom (7.3 kB at 561 kB/s)
[windows-jdk8] [INFO] Downloading: https://repo.maven.apache.org/maven2/com/vladsch/flexmark/flexmark-pdf-converter/0.18.4/flexmark-pdf-converter-0.18.4.pom
[windows-jdk8] [INFO] Downloaded: https://repo.maven.apache.org/maven2/com/vladsch/flexmark/flexmark-pdf-converter/0.18.4/flexmark-pdf-converter-0.18.4.pom (3.2 kB at 268 kB/s)
[windows-jdk8] [INFO] Downloading: https://repo.maven.apache.org/maven2/com/openhtmltopdf/openhtmltopdf-core/0.0.1-RC9/openhtmltopdf-core-0.0.1-RC9.pom
[windows-jdk8] [INFO] Downloaded: https://repo.maven.apache.org/maven2/com/openhtmltopdf/openhtmltopdf-core/0.0.1-RC9/openhtmltopdf-core-0.0.1-RC9.pom (1.7 kB at 131 kB/s)
[windows-jdk8] [INFO] Downloading: https://repo.maven.apache.org/maven2/com/openhtmltopdf/openhtmltopdf-parent/0.0.1-RC9/openhtmltopdf-parent-0.0.1-RC9.pom
[windows-jdk8] [INFO] Downloaded: https://repo.maven.apache.org/maven2/com/openhtmltopdf/openhtmltopdf-parent/0.0.1-RC9/openhtmltopdf-parent-0.0.1-RC9.pom (4.3 kB at 305 kB/s)
[windows-jdk8] [INFO] Downloading: https://repo.maven.apache.org/maven2/com/openhtmltopdf/openhtmltopdf-pdfbox/0.0.1-RC9/openhtmltopdf-pdfbox-0.0.1-RC9.pom
[windows-jdk8] [INFO] Downloaded: https://repo.maven.apache.org/maven2/com/openhtmltopdf/openhtmltopdf-pdfbox/0.0.1-RC9/openhtmltopdf-pdfbox-0.0.1-RC9.pom (2.0 kB at 127 kB/s)
[windows-jdk9] Sending interrupt signal to process
[windows-jdk9] [debug] incrementalBuildHelper#afterRebuildExecution
[windows-jdk9] [debug] Using compiler 'javac'.
[windows-jdk9] [debug] CompilerReuseStrategy: reuseCreated
[windows-jdk9] [debug] useIncrementalCompilation enabled
[windows-jdk9] [debug] unable to get start time for the current build: null
[windows-jdk9] [debug] Stale source detected: f:\jenkins\jenkins-slave\workspace\mpiler-plugin_MCOMPILER-321-M3CCVQFTOYTT5MRUEFTYA2LFPKU6XKW4A5QCKLUYCCRZ7HLEL52Q\m\target\test-classes\unit\compiler-fork-test\src\test\java\TestCompile1TestCase.java
[windows-jdk9] [info] Changes detected - recompiling the module!
[windows-jdk9] [debug] Classpath:
[windows-jdk9] [debug]  f:\jenkins\jenkins-slave\workspace\mpiler-plugin_MCOMPILER-321-M3CCVQFTOYTT5MRUEFTYA2LFPKU6XKW4A5QCKLUYCCRZ7HLEL52Q\.repository\junit\junit\3.8.1\junit-3.8.1.jar
[windows-jdk9] [debug]  f:\jenkins\jenkins-slave\workspace\mpiler-plugin_MCOMPILER-321-M3CCVQFTOYTT5MRUEFTYA2LFPKU6XKW4A5QCKLUYCCRZ7HLEL52Q\m\target\test\unit\compiler-fork-test\target\classes
[windows-jdk9] [debug] Source roots:
[windows-jdk9] [debug]  f:\jenkins\jenkins-slave\workspace\mpiler-plugin_MCOMPILER-321-M3CCVQFTOYTT5MRUEFTYA2LFPKU6XKW4A5QCKLUYCCRZ7HLEL52Q\m\target\test-classes\unit\compiler-fork-test/src/test/java
[windows-jdk9] [debug] Excutable:
[windows-jdk9] [debug]  f:\jenkins\tools\java\latest9\bin\javac
[windows-jdk9] [debug] Command line options:
[windows-jdk9] [debug] -d f:\jenkins\jenkins-slave\workspace\mpiler-plugin_MCOMPILER-321-M3CCVQFTOYTT5MRUEFTYA2LFPKU6XKW4A5QCKLUYCCRZ7HLEL52Q\m\target\test\unit\compiler-fork-test\target\test-classes -classpath f:\jenkins\jenkins-slave\workspace\mpiler-plugin_MCOMPILER-321-M3CCVQFTOYTT5MRUEFTYA2LFPKU6XKW4A5QCKLUYCCRZ7HLEL52Q\.repository\junit\junit\3.8.1\junit-3.8.1.jar;f:\jenkins\jenkins-slave\workspace\mpiler-plugin_MCOMPILER-321-M3CCVQFTOYTT5MRUEFTYA2LFPKU6XKW4A5QCKLUYCCRZ7HLEL52Q\m\target\test\unit\compiler-fork-test\target\classes; -sourcepath f:\jenkins\jenkins-slave\workspace\mpiler-plugin_MCOMPILER-321-M3CCVQFTOYTT5MRUEFTYA2LFPKU6XKW4A5QCKLUYCCRZ7HLEL52Q\m\target\test-classes\unit\compiler-fork-test/src/test/java; f:\jenkins\jenkins-slave\workspace\mpiler-plugin_MCOMPILER-321-M3CCVQFTOYTT5MRUEFTYA2LFPKU6XKW4A5QCKLUYCCRZ7HLEL52Q\m\target\test-classes\unit\compiler-fork-test\src\test\java\TestCompile1TestCase.java -g -verbose -target 6 -source 6
[windows-jdk9] [warn] File encoding has not been set, using platform encoding Cp1252, i.e. build is platform dependent!
[windows-jdk9] [debug] incrementalBuildHelper#beforeRebuildExecution
[windows-jdk9] [INFO] Compiling 1 source file to f:\jenkins\jenkins-slave\workspace\mpiler-plugin_MCOMPILER-321-M3CCVQFTOYTT5MRUEFTYA2LFPKU6XKW4A5QCKLUYCCRZ7HLEL52Q\m\target\test\unit\compiler-fork-test\target\test-classes
[Pipeline] [linux-jdk7] // node
[Pipeline] [linux-jdk8] // node
[Pipeline] [linux-jdk9] // node
[Pipeline] [linux-jdk10] // node
[Pipeline] [linux-jdk7] }
[linux-jdk7] Failed in branch linux-jdk7
[Pipeline] [linux-jdk8] }
[linux-jdk8] Failed in branch linux-jdk8
[Pipeline] [linux-jdk9] }
[linux-jdk9] Failed in branch linux-jdk9
[Pipeline] [linux-jdk10] }
[linux-jdk10] Failed in branch linux-jdk10
[Pipeline] [windows-jdk9] }
[Pipeline] [windows-jdk9] // dir
[Pipeline] [windows-jdk9] }
[windows-jdk9] [withMaven] One or multiple Maven executions have been ignored by the Jenkins Pipeline Maven Plugin because they have been interrupted before completion (1). See Pipeline Maven Plugin FAQ for more details.
[Pipeline] [windows-jdk9] // withMaven
[Pipeline] [windows-jdk9] echo
[windows-jdk9] [FAIL FAST] windows-jdk10 had first failure, ignoring script returned exit code -1
[Pipeline] [windows-jdk9] }
[Pipeline] [windows-jdk9] // stage
[Pipeline] [windows-jdk9] }
[Pipeline] [windows-jdk9] // node
[Pipeline] [windows-jdk9] }
[windows-jdk7] After 10s process did not stop
[Pipeline] [windows-jdk7] }
[Pipeline] [windows-jdk7] // dir
[Pipeline] [windows-jdk7] }
[windows-jdk7] [withMaven] One or multiple Maven executions have been ignored by the Jenkins Pipeline Maven Plugin because they have been interrupted before completion (1). See Pipeline Maven Plugin FAQ for more details.
[Pipeline] [windows-jdk7] // withMaven
[Pipeline] [windows-jdk7] echo
[windows-jdk7] [FAIL FAST] windows-jdk10 had first failure, ignoring null
[Pipeline] [windows-jdk7] }
[Pipeline] [windows-jdk7] // stage
[windows-jdk8] After 10s process did not stop
[Pipeline] [windows-jdk7] }
[Pipeline] [windows-jdk7] // node
[Pipeline] [windows-jdk7] }
[Pipeline] [windows-jdk8] }
[Pipeline] [windows-jdk8] // dir
[Pipeline] [windows-jdk8] }
[windows-jdk8] [withMaven] One or multiple Maven executions have been ignored by the Jenkins Pipeline Maven Plugin because they have been interrupted before completion (1). See Pipeline Maven Plugin FAQ for more details.
[Pipeline] [windows-jdk8] // withMaven
[Pipeline] [windows-jdk8] echo
[windows-jdk8] [FAIL FAST] windows-jdk10 had first failure, ignoring null
[Pipeline] [windows-jdk8] }
[Pipeline] [windows-jdk8] // stage
[Pipeline] [windows-jdk8] }
[Pipeline] [windows-jdk8] // node
[Pipeline] [windows-jdk8] }
[Pipeline] // parallel
[Pipeline] echo
***** FAST FAILURE *****

Fast failure triggered by windows-jdk10

***** FAST FAILURE *****
[Pipeline] stage
[Pipeline] { (Notifications)
[Pipeline] echo
Build result: FAILURE
[Pipeline] jiraIssueSelector
[Pipeline] emailext
Reply | Threaded
Open this post in threaded view
|

Build failed in Jenkins: Maven TLP » maven-compiler-plugin » MCOMPILER-321 #3

Apache Jenkins Server-2
See https://builds.apache.org/job/maven-box/job/maven-compiler-plugin/job/MCOMPILER-321/3/

Changes:

* add some debug for ASF Jenkins failure
* add some debug for ASF Jenkins failure
* should fix issue using withMaven
* [MCOMPILER-332] Java 10 not supported
* [MCOMPILER-192] Add XOR check for Jenkins
* use batch mode
* [MCOMPILER-338] Build Issue based on MCOMPILER-192 IT  o The build
* [MCOMPILER-338] Build Issue based on MCOMPILER-192 IT  o Followup  o
* Moved two dependendent modules into a single aggregator build to make
* [MNGSITE-332] - Changed download templates of plugins not to reference
* [MCOMPILER-341] Compile module descriptors with TestCompilerMojo
* [MCOMPILER-336] Dependency that should be on modulepath sometime put on
* [MCOMPILER-342] Unsupported class file major version 55 Upgrade
* [MCOMPILER-311] NPE when --patch-module is used
* [MCOMPILER-321] Problematic Java 9 modules are silently ignored
* add some debug for ASF Jenkins failure
* add some debug for ASF Jenkins failure
* should fix issue using withMaven
* [MCOMPILER-332] Java 10 not supported
* [MCOMPILER-192] Add XOR check for Jenkins
* use batch mode
* [MCOMPILER-338] Build Issue based on MCOMPILER-192 IT  o The build
* [MCOMPILER-338] Build Issue based on MCOMPILER-192 IT  o Followup  o
* Moved two dependendent modules into a single aggregator build to make
* [MNGSITE-332] - Changed download templates of plugins not to reference
* [MCOMPILER-341] Compile module descriptors with TestCompilerMojo
* [MCOMPILER-336] Dependency that should be on modulepath sometime put on
* [MCOMPILER-342] Unsupported class file major version 55 Upgrade
* [MCOMPILER-311] NPE when --patch-module is used
* [MCOMPILER-321] Problematic Java 9 modules are silently ignored
* add some debug for ASF Jenkins failure
* add some debug for ASF Jenkins failure
* should fix issue using withMaven
* [MCOMPILER-332] Java 10 not supported
* [MCOMPILER-192] Add XOR check for Jenkins
* use batch mode
* [MCOMPILER-338] Build Issue based on MCOMPILER-192 IT  o The build
* [MCOMPILER-338] Build Issue based on MCOMPILER-192 IT  o Followup  o
* Moved two dependendent modules into a single aggregator build to make
* [MNGSITE-332] - Changed download templates of plugins not to reference
* [MCOMPILER-341] Compile module descriptors with TestCompilerMojo
* [MCOMPILER-336] Dependency that should be on modulepath sometime put on
* [MCOMPILER-342] Unsupported class file major version 55 Upgrade
* [MCOMPILER-311] NPE when --patch-module is used
* [MCOMPILER-321] Problematic Java 9 modules are silently ignored

All tests passed

Build log:
[...truncated 723.63 KB...]
[windows-jdk9] [INFO]           MCOMPILER-275_separate-moduleinfo\pom.xml ........ SUCCESS (7.0 s)
[windows-jdk9] [INFO] Building: MCOMPILER-284\pom.xml
[windows-jdk10] [INFO]           MCOMPILER-336_incremental-modulepath\pom.xml ..... SUCCESS (12.8 s)
[windows-jdk10] [INFO] Building: non-english-warnings\pom.xml
[windows-jdk9] [INFO] run post-build script verify.bsh
[windows-jdk9] [INFO]           MCOMPILER-284\pom.xml ............................ SUCCESS (5.2 s)
[windows-jdk9] [INFO] Building: MCOMPILER-294\pom.xml
[windows-jdk10] [INFO] run post-build script verify.bsh
[windows-jdk10] [INFO]           non-english-warnings\pom.xml ..................... SUCCESS (5.6 s)
[windows-jdk10] [INFO] Building: test1\pom.xml
[windows-jdk9] [INFO]           MCOMPILER-294\pom.xml ............................ SUCCESS (6.5 s)
[windows-jdk9] [INFO] Building: MCOMPILER-298\pom.xml
[windows-jdk10] [INFO]           test1\pom.xml .................................... SUCCESS (5.5 s)
[windows-jdk10] [INFO]
[windows-jdk10] [INFO] --- maven-checkstyle-plugin:3.0.0:check (checkstyle-check) @ maven-compiler-plugin ---
[windows-jdk10] [INFO] Downloading: https://repo.maven.apache.org/maven2/org/apache/maven/shared/maven-shared-resources/2/maven-shared-resources-2.pom
[windows-jdk10] [INFO] Downloaded: https://repo.maven.apache.org/maven2/org/apache/maven/shared/maven-shared-resources/2/maven-shared-resources-2.pom (3.0 kB at 328 kB/s)
[windows-jdk10] [INFO] Downloading: https://repo.maven.apache.org/maven2/org/codehaus/plexus/plexus-utils/3.0.10/plexus-utils-3.0.10.pom
[windows-jdk10] [INFO] Downloaded: https://repo.maven.apache.org/maven2/org/codehaus/plexus/plexus-utils/3.0.10/plexus-utils-3.0.10.pom (3.1 kB at 449 kB/s)
[windows-jdk10] [INFO] Downloading: https://repo.maven.apache.org/maven2/org/codehaus/plexus/plexus/3.3/plexus-3.3.pom
[windows-jdk10] [INFO] Downloaded: https://repo.maven.apache.org/maven2/org/codehaus/plexus/plexus/3.3/plexus-3.3.pom (20 kB at 3.3 MB/s)
[windows-jdk10] [INFO] Downloading: https://repo.maven.apache.org/maven2/org/apache/maven/doxia/doxia-integration-tools/1.6/doxia-integration-tools-1.6.pom
[windows-jdk10] [INFO] Downloaded: https://repo.maven.apache.org/maven2/org/apache/maven/doxia/doxia-integration-tools/1.6/doxia-integration-tools-1.6.pom (7.0 kB at 1.2 MB/s)
[windows-jdk10] [INFO] Downloading: https://repo.maven.apache.org/maven2/org/apache/maven/doxia/doxia-tools/3/doxia-tools-3.pom
[windows-jdk10] [INFO] Downloaded: https://repo.maven.apache.org/maven2/org/apache/maven/doxia/doxia-tools/3/doxia-tools-3.pom (9.9 kB at 1.7 MB/s)
[windows-jdk10] [INFO] Downloading: https://repo.maven.apache.org/maven2/org/codehaus/plexus/plexus-resources/1.1.0/plexus-resources-1.1.0.pom
[windows-jdk10] [INFO] Downloaded: https://repo.maven.apache.org/maven2/org/codehaus/plexus/plexus-resources/1.1.0/plexus-resources-1.1.0.pom (3.2 kB at 397 kB/s)
[windows-jdk10] [INFO] Downloading: https://repo.maven.apache.org/maven2/com/puppycrawl/tools/checkstyle/6.18/checkstyle-6.18.pom
[windows-jdk10] [INFO] Downloaded: https://repo.maven.apache.org/maven2/com/puppycrawl/tools/checkstyle/6.18/checkstyle-6.18.pom (71 kB at 5.9 MB/s)
[windows-jdk10] [INFO] Downloading: https://repo.maven.apache.org/maven2/antlr/antlr/2.7.7/antlr-2.7.7.pom
[windows-jdk10] [INFO] Downloaded: https://repo.maven.apache.org/maven2/antlr/antlr/2.7.7/antlr-2.7.7.pom (632 B at 90 kB/s)
[windows-jdk10] [INFO] Downloading: https://repo.maven.apache.org/maven2/org/antlr/antlr4-runtime/4.5.3/antlr4-runtime-4.5.3.pom
[windows-jdk10] [INFO] Downloaded: https://repo.maven.apache.org/maven2/org/antlr/antlr4-runtime/4.5.3/antlr4-runtime-4.5.3.pom (2.3 kB at 330 kB/s)
[windows-jdk10] [INFO] Downloading: https://repo.maven.apache.org/maven2/org/antlr/antlr4-master/4.5.3/antlr4-master-4.5.3.pom
[windows-jdk10] [INFO] Downloaded: https://repo.maven.apache.org/maven2/org/antlr/antlr4-master/4.5.3/antlr4-master-4.5.3.pom (3.7 kB at 614 kB/s)
[windows-jdk10] [INFO] Downloading: https://repo.maven.apache.org/maven2/commons-beanutils/commons-beanutils/1.9.2/commons-beanutils-1.9.2.pom
[windows-jdk10] [INFO] Downloaded: https://repo.maven.apache.org/maven2/commons-beanutils/commons-beanutils/1.9.2/commons-beanutils-1.9.2.pom (14 kB at 2.0 MB/s)
[windows-jdk10] [INFO] Downloading: https://repo.maven.apache.org/maven2/org/apache/commons/commons-parent/33/commons-parent-33.pom
[windows-jdk10] [INFO] Downloaded: https://repo.maven.apache.org/maven2/org/apache/commons/commons-parent/33/commons-parent-33.pom (53 kB at 7.6 MB/s)
[windows-jdk10] [INFO] Downloading: https://repo.maven.apache.org/maven2/commons-cli/commons-cli/1.3.1/commons-cli-1.3.1.pom
[windows-jdk10] [INFO] Downloaded: https://repo.maven.apache.org/maven2/commons-cli/commons-cli/1.3.1/commons-cli-1.3.1.pom (10 kB at 1.3 MB/s)
[windows-jdk10] [INFO] Downloading: https://repo.maven.apache.org/maven2/com/google/guava/guava/19.0/guava-19.0.pom
[windows-jdk10] [INFO] Downloaded: https://repo.maven.apache.org/maven2/com/google/guava/guava/19.0/guava-19.0.pom (6.8 kB at 849 kB/s)
[windows-jdk10] [INFO] Downloading: https://repo.maven.apache.org/maven2/com/google/guava/guava-parent/19.0/guava-parent-19.0.pom
[windows-jdk10] [INFO] Downloaded: https://repo.maven.apache.org/maven2/com/google/guava/guava-parent/19.0/guava-parent-19.0.pom (9.9 kB at 1.2 MB/s)
[windows-jdk10] [INFO] Downloading: https://repo.maven.apache.org/maven2/org/sonatype/oss/oss-parent/7/oss-parent-7.pom
[windows-jdk10] [INFO] Downloaded: https://repo.maven.apache.org/maven2/org/sonatype/oss/oss-parent/7/oss-parent-7.pom (4.8 kB at 804 kB/s)
[windows-jdk10] [INFO] Downloading: https://repo.maven.apache.org/maven2/javax/xml/bind/jaxb-api/2.3.0/jaxb-api-2.3.0.pom
[windows-jdk10] [INFO] Downloaded: https://repo.maven.apache.org/maven2/javax/xml/bind/jaxb-api/2.3.0/jaxb-api-2.3.0.pom (23 kB at 1.9 MB/s)
[windows-jdk10] [INFO] Downloading: https://repo.maven.apache.org/maven2/javax/xml/bind/jaxb-api-parent/2.3.0/jaxb-api-parent-2.3.0.pom
[windows-jdk10] [INFO] Downloaded: https://repo.maven.apache.org/maven2/javax/xml/bind/jaxb-api-parent/2.3.0/jaxb-api-parent-2.3.0.pom (5.6 kB at 166 kB/s)
[windows-jdk10] [INFO] Downloading: https://repo.maven.apache.org/maven2/net/java/jvnet-parent/5/jvnet-parent-5.pom
[windows-jdk10] [INFO] Downloaded: https://repo.maven.apache.org/maven2/net/java/jvnet-parent/5/jvnet-parent-5.pom (8.9 kB at 985 kB/s)
[windows-jdk10] [INFO] Downloading: https://repo.maven.apache.org/maven2/org/apache/maven/doxia/doxia-integration-tools/1.6/doxia-integration-tools-1.6.jar
[windows-jdk10] [INFO] Downloading: https://repo.maven.apache.org/maven2/org/apache/maven/shared/maven-shared-resources/2/maven-shared-resources-2.jar
[windows-jdk10] [INFO] Downloading: https://repo.maven.apache.org/maven2/commons-logging/commons-logging/1.0.4/commons-logging-1.0.4.jar
[windows-jdk10] [INFO] Downloading: https://repo.maven.apache.org/maven2/commons-digester/commons-digester/1.6/commons-digester-1.6.jar
[windows-jdk10] [INFO] Downloading: https://repo.maven.apache.org/maven2/org/apache/maven/doxia/doxia-core/1.2/doxia-core-1.2.jar
[windows-jdk10] [INFO] Downloaded: https://repo.maven.apache.org/maven2/org/apache/maven/shared/maven-shared-resources/2/maven-shared-resources-2.jar (13 kB at 131 kB/s)
[windows-jdk10] [INFO] Downloading: https://repo.maven.apache.org/maven2/commons-io/commons-io/1.4/commons-io-1.4.jar
[windows-jdk10] [INFO] Downloaded: https://repo.maven.apache.org/maven2/org/apache/maven/doxia/doxia-integration-tools/1.6/doxia-integration-tools-1.6.jar (45 kB at 433 kB/s)
[windows-jdk10] [INFO] Downloading: https://repo.maven.apache.org/maven2/org/codehaus/plexus/plexus-resources/1.1.0/plexus-resources-1.1.0.jar
[windows-jdk10] [INFO] Downloaded: https://repo.maven.apache.org/maven2/commons-logging/commons-logging/1.0.4/commons-logging-1.0.4.jar (38 kB at 366 kB/s)
[windows-jdk10] [INFO] Downloading: https://repo.maven.apache.org/maven2/com/puppycrawl/tools/checkstyle/6.18/checkstyle-6.18.jar
[windows-jdk10] [INFO] Downloaded: https://repo.maven.apache.org/maven2/commons-digester/commons-digester/1.6/commons-digester-1.6.jar (168 kB at 1.5 MB/s)
[windows-jdk10] [INFO] Downloading: https://repo.maven.apache.org/maven2/antlr/antlr/2.7.7/antlr-2.7.7.jar
[windows-jdk10] [INFO] Downloaded: https://repo.maven.apache.org/maven2/commons-io/commons-io/1.4/commons-io-1.4.jar (109 kB at 948 kB/s)
[windows-jdk10] [INFO] Downloading: https://repo.maven.apache.org/maven2/org/antlr/antlr4-runtime/4.5.3/antlr4-runtime-4.5.3.jar
[windows-jdk10] [INFO] Downloaded: https://repo.maven.apache.org/maven2/org/codehaus/plexus/plexus-resources/1.1.0/plexus-resources-1.1.0.jar (23 kB at 195 kB/s)
[windows-jdk10] [INFO] Downloading: https://repo.maven.apache.org/maven2/commons-beanutils/commons-beanutils/1.9.2/commons-beanutils-1.9.2.jar
[windows-jdk10] [INFO] Downloaded: https://repo.maven.apache.org/maven2/org/apache/maven/doxia/doxia-core/1.2/doxia-core-1.2.jar (154 kB at 1.2 MB/s)
[windows-jdk10] [INFO] Downloading: https://repo.maven.apache.org/maven2/commons-cli/commons-cli/1.3.1/commons-cli-1.3.1.jar
[windows-jdk10] [INFO] Downloaded: https://repo.maven.apache.org/maven2/commons-cli/commons-cli/1.3.1/commons-cli-1.3.1.jar (53 kB at 363 kB/s)
[windows-jdk10] [INFO] Downloading: https://repo.maven.apache.org/maven2/com/google/guava/guava/19.0/guava-19.0.jar
[windows-jdk10] [INFO] Downloaded: https://repo.maven.apache.org/maven2/org/antlr/antlr4-runtime/4.5.3/antlr4-runtime-4.5.3.jar (302 kB at 2.0 MB/s)
[windows-jdk10] [INFO] Downloading: https://repo.maven.apache.org/maven2/commons-lang/commons-lang/2.1/commons-lang-2.1.jar
[windows-jdk10] [INFO] Downloaded: https://repo.maven.apache.org/maven2/antlr/antlr/2.7.7/antlr-2.7.7.jar (445 kB at 2.9 MB/s)
[windows-jdk10] [INFO] Downloading: https://repo.maven.apache.org/maven2/javax/xml/bind/jaxb-api/2.3.0/jaxb-api-2.3.0.jar
[windows-jdk10] [INFO] Downloaded: https://repo.maven.apache.org/maven2/commons-beanutils/commons-beanutils/1.9.2/commons-beanutils-1.9.2.jar (234 kB at 1.4 MB/s)
[windows-jdk10] [INFO] Downloaded: https://repo.maven.apache.org/maven2/commons-lang/commons-lang/2.1/commons-lang-2.1.jar (208 kB at 1.2 MB/s)
[windows-jdk10] [INFO] Downloaded: https://repo.maven.apache.org/maven2/com/puppycrawl/tools/checkstyle/6.18/checkstyle-6.18.jar (1.2 MB at 6.6 MB/s)
[windows-jdk10] [INFO] Downloaded: https://repo.maven.apache.org/maven2/javax/xml/bind/jaxb-api/2.3.0/jaxb-api-2.3.0.jar (126 kB at 706 kB/s)
[windows-jdk10] [INFO] Downloaded: https://repo.maven.apache.org/maven2/com/google/guava/guava/19.0/guava-19.0.jar (2.3 MB at 10 MB/s)
[windows-jdk10] [INFO] There are 2 errors reported by Checkstyle 6.18 with config/maven_checks.xml ruleset.
[windows-jdk10] [INFO] Ignored 2 errors, 0 violation remaining.
[windows-jdk10] [INFO]
[windows-jdk10] [INFO] --- maven-invoker-plugin:3.0.1:verify (integration-test) @ maven-compiler-plugin ---
[windows-jdk10] [INFO] -------------------------------------------------
[windows-jdk10] [INFO] Build Summary:
[windows-jdk10] [INFO]   Passed: 45, Failed: 0, Errors: 0, Skipped: 2
[windows-jdk10] [INFO] -------------------------------------------------
[windows-jdk10] [INFO] ------------------------------------------------------------------------
[windows-jdk10] [INFO] BUILD SUCCESS
[windows-jdk10] [INFO] ------------------------------------------------------------------------
[windows-jdk10] [INFO] Total time: 06:23 min
[windows-jdk10] [INFO] Finished at: 2018-06-06T19:21:56Z
[windows-jdk10] [INFO] Final Memory: 48M/164M
[windows-jdk10] [INFO] ------------------------------------------------------------------------
[windows-jdk10] [INFO] [jenkins-event-spy] Generated F:\jenkins\jenkins-slave\workspace\mpiler-plugin_MCOMPILER-321-M3CCVQFTOYTT5MRUEFTYA2LFPKU6XKW4A5QCKLUYCCRZ7HLEL52Q@2@tmp\withMaven78c733e2\maven-spy-20180606-191532-286682578921521001246.log
[Pipeline] [windows-jdk10] }
[Pipeline] [windows-jdk10] // dir
[Pipeline] [windows-jdk10] }
[windows-jdk10] [withMaven] junitPublisher - Archive test results for Maven artifact org.apache.maven.plugins:maven-compiler-plugin:3.7.1-SNAPSHOT generated by maven-surefire-plugin:test (default-test): m\target\surefire-reports\*.xml
[windows-jdk10] Recording test results
[Pipeline] [windows-jdk10] // withMaven
[Pipeline] [windows-jdk10] }
[Pipeline] [windows-jdk10] // stage
[Pipeline] [windows-jdk10] }
[Pipeline] [windows-jdk10] // node
[Pipeline] [windows-jdk10] }
[windows-jdk9] [INFO]           MCOMPILER-298\pom.xml ............................ SUCCESS (9.4 s)
[windows-jdk9] [INFO] Building: MCOMPILER-321_pathexceptions\pom.xml
[windows-jdk9] [INFO] run post-build script verify.groovy
[windows-jdk9] [INFO]           MCOMPILER-321_pathexceptions\pom.xml ............. SUCCESS (6.0 s)
[windows-jdk9] [INFO] Building: MCOMPILER-322_release10\pom.xml
[windows-jdk9] [INFO]           MCOMPILER-322_release10\pom.xml .................. SKIPPED due to JRE version
[windows-jdk9] [INFO] Building: MCOMPILER-336_incremental-modulepath\pom.xml
[windows-jdk9] [INFO]           MCOMPILER-336_incremental-modulepath\pom.xml ..... SUCCESS (11.5 s)
[windows-jdk9] [INFO] Building: non-english-warnings\pom.xml
[windows-jdk9] [INFO] run post-build script verify.bsh
[windows-jdk9] [INFO]           non-english-warnings\pom.xml ..................... SUCCESS (5.2 s)
[windows-jdk9] [INFO] Building: test1\pom.xml
[windows-jdk9] [INFO]           test1\pom.xml .................................... SUCCESS (5.2 s)
[windows-jdk9] [INFO]
[windows-jdk9] [INFO] --- maven-checkstyle-plugin:3.0.0:check (checkstyle-check) @ maven-compiler-plugin ---
[windows-jdk9] [INFO] Downloading: https://repo.maven.apache.org/maven2/org/apache/maven/shared/maven-shared-resources/2/maven-shared-resources-2.pom
[windows-jdk9] [INFO] Downloaded: https://repo.maven.apache.org/maven2/org/apache/maven/shared/maven-shared-resources/2/maven-shared-resources-2.pom (3.0 kB at 227 kB/s)
[windows-jdk9] [INFO] Downloading: https://repo.maven.apache.org/maven2/org/codehaus/plexus/plexus-utils/3.0.10/plexus-utils-3.0.10.pom
[windows-jdk9] [INFO] Downloaded: https://repo.maven.apache.org/maven2/org/codehaus/plexus/plexus-utils/3.0.10/plexus-utils-3.0.10.pom (3.1 kB at 286 kB/s)
[windows-jdk9] [INFO] Downloading: https://repo.maven.apache.org/maven2/org/codehaus/plexus/plexus/3.3/plexus-3.3.pom
[windows-jdk9] [INFO] Downloaded: https://repo.maven.apache.org/maven2/org/codehaus/plexus/plexus/3.3/plexus-3.3.pom (20 kB at 2.2 MB/s)
[windows-jdk9] [INFO] Downloading: https://repo.maven.apache.org/maven2/org/apache/maven/doxia/doxia-integration-tools/1.6/doxia-integration-tools-1.6.pom
[windows-jdk9] [INFO] Downloaded: https://repo.maven.apache.org/maven2/org/apache/maven/doxia/doxia-integration-tools/1.6/doxia-integration-tools-1.6.pom (7.0 kB at 994 kB/s)
[windows-jdk9] [INFO] Downloading: https://repo.maven.apache.org/maven2/org/apache/maven/doxia/doxia-tools/3/doxia-tools-3.pom
[windows-jdk9] [INFO] Downloaded: https://repo.maven.apache.org/maven2/org/apache/maven/doxia/doxia-tools/3/doxia-tools-3.pom (9.9 kB at 993 kB/s)
[windows-jdk9] [INFO] Downloading: https://repo.maven.apache.org/maven2/org/codehaus/plexus/plexus-resources/1.1.0/plexus-resources-1.1.0.pom
[windows-jdk9] [INFO] Downloaded: https://repo.maven.apache.org/maven2/org/codehaus/plexus/plexus-resources/1.1.0/plexus-resources-1.1.0.pom (3.2 kB at 318 kB/s)
[windows-jdk9] [INFO] Downloading: https://repo.maven.apache.org/maven2/com/puppycrawl/tools/checkstyle/6.18/checkstyle-6.18.pom
[windows-jdk9] [INFO] Downloaded: https://repo.maven.apache.org/maven2/com/puppycrawl/tools/checkstyle/6.18/checkstyle-6.18.pom (71 kB at 5.1 MB/s)
[windows-jdk9] [INFO] Downloading: https://repo.maven.apache.org/maven2/antlr/antlr/2.7.7/antlr-2.7.7.pom
[windows-jdk9] [INFO] Downloaded: https://repo.maven.apache.org/maven2/antlr/antlr/2.7.7/antlr-2.7.7.pom (632 B at 79 kB/s)
[windows-jdk9] [INFO] Downloading: https://repo.maven.apache.org/maven2/org/antlr/antlr4-runtime/4.5.3/antlr4-runtime-4.5.3.pom
[windows-jdk9] [INFO] Downloaded: https://repo.maven.apache.org/maven2/org/antlr/antlr4-runtime/4.5.3/antlr4-runtime-4.5.3.pom (2.3 kB at 289 kB/s)
[windows-jdk9] [INFO] Downloading: https://repo.maven.apache.org/maven2/org/antlr/antlr4-master/4.5.3/antlr4-master-4.5.3.pom
[windows-jdk9] [INFO] Downloaded: https://repo.maven.apache.org/maven2/org/antlr/antlr4-master/4.5.3/antlr4-master-4.5.3.pom (3.7 kB at 409 kB/s)
[windows-jdk9] [INFO] Downloading: https://repo.maven.apache.org/maven2/commons-beanutils/commons-beanutils/1.9.2/commons-beanutils-1.9.2.pom
[windows-jdk9] [INFO] Downloaded: https://repo.maven.apache.org/maven2/commons-beanutils/commons-beanutils/1.9.2/commons-beanutils-1.9.2.pom (14 kB at 1.4 MB/s)
[windows-jdk9] [INFO] Downloading: https://repo.maven.apache.org/maven2/org/apache/commons/commons-parent/33/commons-parent-33.pom
[windows-jdk9] [INFO] Downloaded: https://repo.maven.apache.org/maven2/org/apache/commons/commons-parent/33/commons-parent-33.pom (53 kB at 5.9 MB/s)
[windows-jdk9] [INFO] Downloading: https://repo.maven.apache.org/maven2/commons-cli/commons-cli/1.3.1/commons-cli-1.3.1.pom
[windows-jdk9] [INFO] Downloaded: https://repo.maven.apache.org/maven2/commons-cli/commons-cli/1.3.1/commons-cli-1.3.1.pom (10 kB at 1.5 MB/s)
[windows-jdk9] [INFO] Downloading: https://repo.maven.apache.org/maven2/com/google/guava/guava/19.0/guava-19.0.pom
[windows-jdk9] [INFO] Downloaded: https://repo.maven.apache.org/maven2/com/google/guava/guava/19.0/guava-19.0.pom (6.8 kB at 849 kB/s)
[windows-jdk9] [INFO] Downloading: https://repo.maven.apache.org/maven2/com/google/guava/guava-parent/19.0/guava-parent-19.0.pom
[windows-jdk9] [INFO] Downloaded: https://repo.maven.apache.org/maven2/com/google/guava/guava-parent/19.0/guava-parent-19.0.pom (9.9 kB at 1.1 MB/s)
[windows-jdk9] [INFO] Downloading: https://repo.maven.apache.org/maven2/org/sonatype/oss/oss-parent/7/oss-parent-7.pom
[windows-jdk9] [INFO] Downloaded: https://repo.maven.apache.org/maven2/org/sonatype/oss/oss-parent/7/oss-parent-7.pom (4.8 kB at 689 kB/s)
[windows-jdk9] [INFO] Downloading: https://repo.maven.apache.org/maven2/javax/xml/bind/jaxb-api/2.3.0/jaxb-api-2.3.0.pom
[windows-jdk9] [INFO] Downloaded: https://repo.maven.apache.org/maven2/javax/xml/bind/jaxb-api/2.3.0/jaxb-api-2.3.0.pom (23 kB at 2.9 MB/s)
[windows-jdk9] [INFO] Downloading: https://repo.maven.apache.org/maven2/javax/xml/bind/jaxb-api-parent/2.3.0/jaxb-api-parent-2.3.0.pom
[windows-jdk9] [INFO] Downloaded: https://repo.maven.apache.org/maven2/javax/xml/bind/jaxb-api-parent/2.3.0/jaxb-api-parent-2.3.0.pom (5.6 kB at 705 kB/s)
[windows-jdk9] [INFO] Downloading: https://repo.maven.apache.org/maven2/net/java/jvnet-parent/5/jvnet-parent-5.pom
[windows-jdk9] [INFO] Downloaded: https://repo.maven.apache.org/maven2/net/java/jvnet-parent/5/jvnet-parent-5.pom (8.9 kB at 985 kB/s)
[windows-jdk9] [INFO] Downloading: https://repo.maven.apache.org/maven2/org/apache/maven/shared/maven-shared-resources/2/maven-shared-resources-2.jar
[windows-jdk9] [INFO] Downloading: https://repo.maven.apache.org/maven2/commons-digester/commons-digester/1.6/commons-digester-1.6.jar
[windows-jdk9] [INFO] Downloading: https://repo.maven.apache.org/maven2/org/apache/maven/doxia/doxia-core/1.2/doxia-core-1.2.jar
[windows-jdk9] [INFO] Downloading: https://repo.maven.apache.org/maven2/commons-logging/commons-logging/1.0.4/commons-logging-1.0.4.jar
[windows-jdk9] [INFO] Downloading: https://repo.maven.apache.org/maven2/org/apache/maven/doxia/doxia-integration-tools/1.6/doxia-integration-tools-1.6.jar
[windows-jdk9] [INFO] Downloaded: https://repo.maven.apache.org/maven2/commons-logging/commons-logging/1.0.4/commons-logging-1.0.4.jar (38 kB at 1.5 MB/s)
[windows-jdk9] [INFO] Downloading: https://repo.maven.apache.org/maven2/commons-io/commons-io/1.4/commons-io-1.4.jar
[windows-jdk9] [INFO] Downloaded: https://repo.maven.apache.org/maven2/org/apache/maven/doxia/doxia-core/1.2/doxia-core-1.2.jar (154 kB at 5.5 MB/s)
[windows-jdk9] [INFO] Downloading: https://repo.maven.apache.org/maven2/org/codehaus/plexus/plexus-resources/1.1.0/plexus-resources-1.1.0.jar
[windows-jdk9] [INFO] Downloaded: https://repo.maven.apache.org/maven2/commons-digester/commons-digester/1.6/commons-digester-1.6.jar (168 kB at 5.8 MB/s)
[windows-jdk9] [INFO] Downloading: https://repo.maven.apache.org/maven2/com/puppycrawl/tools/checkstyle/6.18/checkstyle-6.18.jar
[windows-jdk9] [INFO] Downloaded: https://repo.maven.apache.org/maven2/org/apache/maven/shared/maven-shared-resources/2/maven-shared-resources-2.jar (13 kB at 435 kB/s)
[windows-jdk9] [INFO] Downloading: https://repo.maven.apache.org/maven2/antlr/antlr/2.7.7/antlr-2.7.7.jar
[windows-jdk9] [INFO] Downloaded: https://repo.maven.apache.org/maven2/org/apache/maven/doxia/doxia-integration-tools/1.6/doxia-integration-tools-1.6.jar (45 kB at 1.5 MB/s)
[windows-jdk9] [INFO] Downloading: https://repo.maven.apache.org/maven2/org/antlr/antlr4-runtime/4.5.3/antlr4-runtime-4.5.3.jar
[windows-jdk9] [INFO] Downloaded: https://repo.maven.apache.org/maven2/org/codehaus/plexus/plexus-resources/1.1.0/plexus-resources-1.1.0.jar (23 kB at 430 kB/s)
[windows-jdk9] [INFO] Downloading: https://repo.maven.apache.org/maven2/commons-beanutils/commons-beanutils/1.9.2/commons-beanutils-1.9.2.jar
[windows-jdk9] [INFO] Downloaded: https://repo.maven.apache.org/maven2/commons-io/commons-io/1.4/commons-io-1.4.jar (109 kB at 2.0 MB/s)
[windows-jdk9] [INFO] Downloading: https://repo.maven.apache.org/maven2/commons-cli/commons-cli/1.3.1/commons-cli-1.3.1.jar
[windows-jdk9] [INFO] Downloaded: https://repo.maven.apache.org/maven2/org/antlr/antlr4-runtime/4.5.3/antlr4-runtime-4.5.3.jar (302 kB at 5.1 MB/s)
[windows-jdk9] [INFO] Downloaded: https://repo.maven.apache.org/maven2/antlr/antlr/2.7.7/antlr-2.7.7.jar (445 kB at 7.5 MB/s)
[windows-jdk9] [INFO] Downloading: https://repo.maven.apache.org/maven2/commons-lang/commons-lang/2.1/commons-lang-2.1.jar
[windows-jdk9] [INFO] Downloading: https://repo.maven.apache.org/maven2/com/google/guava/guava/19.0/guava-19.0.jar
[windows-jdk9] [INFO] Downloaded: https://repo.maven.apache.org/maven2/commons-beanutils/commons-beanutils/1.9.2/commons-beanutils-1.9.2.jar (234 kB at 3.2 MB/s)
[windows-jdk9] [INFO] Downloading: https://repo.maven.apache.org/maven2/javax/xml/bind/jaxb-api/2.3.0/jaxb-api-2.3.0.jar
[windows-jdk9] [INFO] Downloaded: https://repo.maven.apache.org/maven2/commons-cli/commons-cli/1.3.1/commons-cli-1.3.1.jar (53 kB at 707 kB/s)
[windows-jdk9] [INFO] Downloaded: https://repo.maven.apache.org/maven2/commons-lang/commons-lang/2.1/commons-lang-2.1.jar (208 kB at 2.7 MB/s)
[windows-jdk9] [INFO] Downloaded: https://repo.maven.apache.org/maven2/javax/xml/bind/jaxb-api/2.3.0/jaxb-api-2.3.0.jar (126 kB at 1.4 MB/s)
[windows-jdk9] [INFO] Downloaded: https://repo.maven.apache.org/maven2/com/puppycrawl/tools/checkstyle/6.18/checkstyle-6.18.jar (1.2 MB at 12 MB/s)
[windows-jdk9] [INFO] Downloaded: https://repo.maven.apache.org/maven2/com/google/guava/guava/19.0/guava-19.0.jar (2.3 MB at 19 MB/s)
[windows-jdk9] [INFO] There are 2 errors reported by Checkstyle 6.18 with config/maven_checks.xml ruleset.
[windows-jdk9] [INFO] Ignored 2 errors, 0 violation remaining.
[windows-jdk9] [INFO]
[windows-jdk9] [INFO] --- maven-invoker-plugin:3.0.1:verify (integration-test) @ maven-compiler-plugin ---
[windows-jdk9] [INFO] -------------------------------------------------
[windows-jdk9] [INFO] Build Summary:
[windows-jdk9] [INFO]   Passed: 44, Failed: 0, Errors: 0, Skipped: 3
[windows-jdk9] [INFO] -------------------------------------------------
[windows-jdk9] [INFO] ------------------------------------------------------------------------
[windows-jdk9] [INFO] BUILD SUCCESS
[windows-jdk9] [INFO] ------------------------------------------------------------------------
[windows-jdk9] [INFO] Total time: 07:03 min
[windows-jdk9] [INFO] Finished at: 2018-06-06T19:22:29Z
[windows-jdk9] [INFO] Final Memory: 49M/162M
[windows-jdk9] [INFO] ------------------------------------------------------------------------
[windows-jdk9] [INFO] [jenkins-event-spy] Generated F:\jenkins\jenkins-slave\workspace\mpiler-plugin_MCOMPILER-321-M3CCVQFTOYTT5MRUEFTYA2LFPKU6XKW4A5QCKLUYCCRZ7HLEL52Q@tmp\withMaven2607d23a\maven-spy-20180606-191525-99517736418830511935318.log
[Pipeline] [windows-jdk9] }
[Pipeline] [windows-jdk9] // dir
[Pipeline] [windows-jdk9] }
[windows-jdk9] [withMaven] junitPublisher - Archive test results for Maven artifact org.apache.maven.plugins:maven-compiler-plugin:3.7.1-SNAPSHOT generated by maven-surefire-plugin:test (default-test): m\target\surefire-reports\*.xml
[windows-jdk9] Recording test results
[Pipeline] [windows-jdk9] // withMaven
[Pipeline] [windows-jdk9] }
[Pipeline] [windows-jdk9] // stage
[Pipeline] [windows-jdk9] }
[Pipeline] [windows-jdk9] // node
[Pipeline] [windows-jdk9] }
Aborted by rfscholte
[Pipeline] [linux-jdk10] // node
[Pipeline] [linux-jdk9] // node
[Pipeline] [linux-jdk8] // node
[Pipeline] [linux-jdk7] // node
[Pipeline] [linux-jdk7] }
[linux-jdk7] Failed in branch linux-jdk7
[Pipeline] [linux-jdk8] }
[linux-jdk8] Failed in branch linux-jdk8
[Pipeline] [linux-jdk9] }
[linux-jdk9] Failed in branch linux-jdk9
[Pipeline] [linux-jdk10] }
[linux-jdk10] Failed in branch linux-jdk10
[Pipeline] // parallel
[Pipeline] stage
[Pipeline] { (Notifications)
[Pipeline] echo
Build result: FAILURE
[Pipeline] jiraIssueSelector
[Pipeline] jiraComment
[Pipeline] jiraComment
[Pipeline] jiraComment
[Pipeline] jiraComment
[Pipeline] jiraComment
[Pipeline] jiraComment
[Pipeline] jiraComment
[Pipeline] jiraComment
[Pipeline] jiraComment
[Pipeline] emailext
Reply | Threaded
Open this post in threaded view
|

Build succeeded in Jenkins: Maven TLP » maven-compiler-plugin » MCOMPILER-321 #4

Apache Jenkins Server-2
See https://builds.apache.org/job/maven-box/job/maven-compiler-plugin/job/MCOMPILER-321/4/

Changes:

* [MCOMPILER-321] Problematic Java 9 modules are silently ignored Only run
* [MCOMPILER-321] Problematic Java 9 modules are silently ignored Only run
* [MCOMPILER-321] Problematic Java 9 modules are silently ignored Only run

All tests passed