Build failed in Jenkins: Maven TLP » maven-compiler-plugin » MCOMPILER-320 #44

classic Classic list List threaded Threaded
5 messages Options
Reply | Threaded
Open this post in threaded view
|

Build failed in Jenkins: Maven TLP » maven-compiler-plugin » MCOMPILER-320 #44

Apache Jenkins Server-2
See https://builds.apache.org/job/maven-box/job/maven-compiler-plugin/job/MCOMPILER-320/44/

Changes:

* Log unique commits
* Other attempt due to 'Scripts not permitted to use staticMethod
* Revert "Log unique commits"

20 tests failed.
FAILED:  org.apache.maven.plugin.compiler.CompilerMojoTestCase.linux-jdk12-m3.6.x_build / Build linux-jdk12-m3.6.x_build / testCompilerBasic

Error Message:
Compilation failure

Stack Trace:
org.apache.maven.plugin.compiler.CompilationFailureException: Compilation failure
        at org.apache.maven.plugin.compiler.CompilerMojoTestCase.testCompilerBasic(CompilerMojoTestCase.java:82)


FAILED:  org.apache.maven.plugin.compiler.CompilerMojoTestCase.linux-jdk12-m3.6.x_build / Build linux-jdk12-m3.6.x_build / testCompilerIncludesExcludes

Error Message:
Compilation failure

Stack Trace:
org.apache.maven.plugin.compiler.CompilationFailureException: Compilation failure
        at org.apache.maven.plugin.compiler.CompilerMojoTestCase.testCompilerIncludesExcludes(CompilerMojoTestCase.java:149)


FAILED:  org.apache.maven.plugin.compiler.CompilerMojoTestCase.linux-jdk12-m3.6.x_build / Build linux-jdk12-m3.6.x_build / testCompileSkipMain

Error Message:
Compilation failure

Stack Trace:
org.apache.maven.plugin.compiler.CompilationFailureException: Compilation failure
        at org.apache.maven.plugin.compiler.CompilerMojoTestCase.testCompileSkipMain(CompilerMojoTestCase.java:335)


FAILED:  org.apache.maven.plugin.compiler.CompilerMojoTestCase.linux-jdk12-m3.6.x_build / Build linux-jdk12-m3.6.x_build / testCompileSkipTest

Error Message:
Compilation failure

Stack Trace:
org.apache.maven.plugin.compiler.CompilationFailureException: Compilation failure
        at org.apache.maven.plugin.compiler.CompilerMojoTestCase.testCompileSkipTest(CompilerMojoTestCase.java:349)


FAILED:  org.apache.maven.plugin.compiler.CompilerMojoTestCase.linux-jdk12-m3.6.x_build / Build linux-jdk12-m3.6.x_build / testCompilerFork

Error Message:
Compilation failure

Stack Trace:
org.apache.maven.plugin.compiler.CompilationFailureException: Compilation failure
        at org.apache.maven.plugin.compiler.CompilerMojoTestCase.testCompilerFork(CompilerMojoTestCase.java:191)


FAILED:  org.apache.maven.plugin.compiler.CompilerMojoTestCase.windows-jdk11-m3.6.x_build / Build windows-jdk11-m3.6.x_build / testCompilerBasic

Error Message:
Compilation failure

Stack Trace:
org.apache.maven.plugin.compiler.CompilationFailureException: Compilation failure
        at org.apache.maven.plugin.compiler.CompilerMojoTestCase.testCompilerBasic(CompilerMojoTestCase.java:82)


FAILED:  org.apache.maven.plugin.compiler.CompilerMojoTestCase.windows-jdk11-m3.6.x_build / Build windows-jdk11-m3.6.x_build / testCompilerIncludesExcludes

Error Message:
Compilation failure

Stack Trace:
org.apache.maven.plugin.compiler.CompilationFailureException: Compilation failure
        at org.apache.maven.plugin.compiler.CompilerMojoTestCase.testCompilerIncludesExcludes(CompilerMojoTestCase.java:149)


FAILED:  org.apache.maven.plugin.compiler.CompilerMojoTestCase.windows-jdk11-m3.6.x_build / Build windows-jdk11-m3.6.x_build / testCompileSkipMain

Error Message:
Compilation failure

Stack Trace:
org.apache.maven.plugin.compiler.CompilationFailureException: Compilation failure
        at org.apache.maven.plugin.compiler.CompilerMojoTestCase.testCompileSkipMain(CompilerMojoTestCase.java:335)


FAILED:  org.apache.maven.plugin.compiler.CompilerMojoTestCase.windows-jdk11-m3.6.x_build / Build windows-jdk11-m3.6.x_build / testCompileSkipTest

Error Message:
Compilation failure

Stack Trace:
org.apache.maven.plugin.compiler.CompilationFailureException: Compilation failure
        at org.apache.maven.plugin.compiler.CompilerMojoTestCase.testCompileSkipTest(CompilerMojoTestCase.java:349)


FAILED:  org.apache.maven.plugin.compiler.CompilerMojoTestCase.windows-jdk11-m3.6.x_build / Build windows-jdk11-m3.6.x_build / testCompilerFork

Error Message:
Compilation failure

Stack Trace:
org.apache.maven.plugin.compiler.CompilationFailureException: Compilation failure
        at org.apache.maven.plugin.compiler.CompilerMojoTestCase.testCompilerFork(CompilerMojoTestCase.java:191)


FAILED:  org.apache.maven.plugin.compiler.CompilerMojoTestCase.windows-jdk12-m3.6.x_build / Build windows-jdk12-m3.6.x_build / testCompilerBasic

Error Message:
Compilation failure

Stack Trace:
org.apache.maven.plugin.compiler.CompilationFailureException: Compilation failure
        at org.apache.maven.plugin.compiler.CompilerMojoTestCase.testCompilerBasic(CompilerMojoTestCase.java:82)


FAILED:  org.apache.maven.plugin.compiler.CompilerMojoTestCase.windows-jdk12-m3.6.x_build / Build windows-jdk12-m3.6.x_build / testCompilerIncludesExcludes

Error Message:
Compilation failure

Stack Trace:
org.apache.maven.plugin.compiler.CompilationFailureException: Compilation failure
        at org.apache.maven.plugin.compiler.CompilerMojoTestCase.testCompilerIncludesExcludes(CompilerMojoTestCase.java:149)


FAILED:  org.apache.maven.plugin.compiler.CompilerMojoTestCase.windows-jdk12-m3.6.x_build / Build windows-jdk12-m3.6.x_build / testCompileSkipMain

Error Message:
Compilation failure

Stack Trace:
org.apache.maven.plugin.compiler.CompilationFailureException: Compilation failure
        at org.apache.maven.plugin.compiler.CompilerMojoTestCase.testCompileSkipMain(CompilerMojoTestCase.java:335)


FAILED:  org.apache.maven.plugin.compiler.CompilerMojoTestCase.windows-jdk12-m3.6.x_build / Build windows-jdk12-m3.6.x_build / testCompileSkipTest

Error Message:
Compilation failure

Stack Trace:
org.apache.maven.plugin.compiler.CompilationFailureException: Compilation failure
        at org.apache.maven.plugin.compiler.CompilerMojoTestCase.testCompileSkipTest(CompilerMojoTestCase.java:349)


FAILED:  org.apache.maven.plugin.compiler.CompilerMojoTestCase.windows-jdk12-m3.6.x_build / Build windows-jdk12-m3.6.x_build / testCompilerFork

Error Message:
Compilation failure

Stack Trace:
org.apache.maven.plugin.compiler.CompilationFailureException: Compilation failure
        at org.apache.maven.plugin.compiler.CompilerMojoTestCase.testCompilerFork(CompilerMojoTestCase.java:191)


FAILED:  org.apache.maven.plugin.compiler.CompilerMojoTestCase.windows-jdk13-m3.6.x_build / Build windows-jdk13-m3.6.x_build / testCompilerBasic

Error Message:
Compilation failure

Stack Trace:
org.apache.maven.plugin.compiler.CompilationFailureException: Compilation failure
        at org.apache.maven.plugin.compiler.CompilerMojoTestCase.testCompilerBasic(CompilerMojoTestCase.java:82)


FAILED:  org.apache.maven.plugin.compiler.CompilerMojoTestCase.windows-jdk13-m3.6.x_build / Build windows-jdk13-m3.6.x_build / testCompilerIncludesExcludes

Error Message:
Compilation failure

Stack Trace:
org.apache.maven.plugin.compiler.CompilationFailureException: Compilation failure
        at org.apache.maven.plugin.compiler.CompilerMojoTestCase.testCompilerIncludesExcludes(CompilerMojoTestCase.java:149)


FAILED:  org.apache.maven.plugin.compiler.CompilerMojoTestCase.windows-jdk13-m3.6.x_build / Build windows-jdk13-m3.6.x_build / testCompileSkipMain

Error Message:
Compilation failure

Stack Trace:
org.apache.maven.plugin.compiler.CompilationFailureException: Compilation failure
        at org.apache.maven.plugin.compiler.CompilerMojoTestCase.testCompileSkipMain(CompilerMojoTestCase.java:335)


FAILED:  org.apache.maven.plugin.compiler.CompilerMojoTestCase.windows-jdk13-m3.6.x_build / Build windows-jdk13-m3.6.x_build / testCompileSkipTest

Error Message:
Compilation failure

Stack Trace:
org.apache.maven.plugin.compiler.CompilationFailureException: Compilation failure
        at org.apache.maven.plugin.compiler.CompilerMojoTestCase.testCompileSkipTest(CompilerMojoTestCase.java:349)


FAILED:  org.apache.maven.plugin.compiler.CompilerMojoTestCase.windows-jdk13-m3.6.x_build / Build windows-jdk13-m3.6.x_build / testCompilerFork

Error Message:
Compilation failure

Stack Trace:
org.apache.maven.plugin.compiler.CompilationFailureException: Compilation failure
        at org.apache.maven.plugin.compiler.CompilerMojoTestCase.testCompilerFork(CompilerMojoTestCase.java:191)




Build log:
[...truncated 17102 lines...]
[INFO] Building: multirelease-patterns\packaging-plugin\pom.xml
[INFO]           test1\pom.xml .................................... SUCCESS (4.3 s)
[INFO]
[INFO] --- maven-checkstyle-plugin:3.0.0:check (checkstyle-check) @ maven-compiler-plugin ---
[INFO] There are 2 errors reported by Checkstyle 6.18 with config/maven_checks.xml ruleset.
[INFO] Ignored 2 errors, 0 violation remaining.
[INFO]
[INFO] --- maven-invoker-plugin:3.0.1:verify (integration-test) @ maven-compiler-plugin ---
[INFO] -------------------------------------------------
[INFO] Build Summary:
[INFO]   Passed: 41, Failed: 11, Errors: 0, Skipped: 2
[INFO] -------------------------------------------------
[ERROR] The following builds failed:
[ERROR] *  error-prone-compiler\pom.xml
[ERROR] *  jdk16-annotation\pom.xml
[ERROR] *  mcompiler-120\pom.xml
[ERROR] *  mcompiler-135\pom.xml
[ERROR] *  MCOMPILER-157\pom.xml
[ERROR] *  mcompiler-179\pom.xml
[ERROR] *  MCOMPILER-203-processorpath\pom.xml
[ERROR] *  MCOMPILER-224\pom.xml
[ERROR] *  MCOMPILER-260_customArguments\pom.xml
[ERROR] *  MCOMPILER-270_release\pom.xml
[ERROR] *  MCOMPILER-275_separate-moduleinfo\pom.xml
[INFO] -------------------------------------------------
[INFO] ------------------------------------------------------------------------
[INFO] BUILD FAILURE
[INFO] ------------------------------------------------------------------------
[INFO] Total time:  06:52 min
[INFO] Finished at: 2019-09-22T21:55:46-07:00
[INFO] ------------------------------------------------------------------------
[INFO] [jenkins-event-spy] Generated F:\jenkins\jenkins-slave\workspace\en-compiler-plugin_MCOMPILER-320@2@tmp\withMaven2f8a37fc\maven-spy-20190922-214853-65814131033614832695023.log
[ERROR] Failed to execute goal org.apache.maven.plugins:maven-invoker-plugin:3.0.1:verify (integration-test) on project maven-compiler-plugin: 11 builds failed. See console output above for details. -> [Help 1]
org.apache.maven.lifecycle.LifecycleExecutionException: Failed to execute goal org.apache.maven.plugins:maven-invoker-plugin:3.0.1:verify (integration-test) on project maven-compiler-plugin: 11 builds failed. See console output above for details.
    at org.apache.maven.lifecycle.internal.MojoExecutor.execute (MojoExecutor.java:215)
    at org.apache.maven.lifecycle.internal.MojoExecutor.execute (MojoExecutor.java:156)
    at org.apache.maven.lifecycle.internal.MojoExecutor.execute (MojoExecutor.java:148)
    at org.apache.maven.lifecycle.internal.LifecycleModuleBuilder.buildProject (LifecycleModuleBuilder.java:117)
    at org.apache.maven.lifecycle.internal.LifecycleModuleBuilder.buildProject (LifecycleModuleBuilder.java:81)
    at org.apache.maven.lifecycle.internal.builder.singlethreaded.SingleThreadedBuilder.build (SingleThreadedBuilder.java:56)
    at org.apache.maven.lifecycle.internal.LifecycleStarter.execute (LifecycleStarter.java:128)
    at org.apache.maven.DefaultMaven.doExecute (DefaultMaven.java:305)
    at org.apache.maven.DefaultMaven.doExecute (DefaultMaven.java:192)
    at org.apache.maven.DefaultMaven.execute (DefaultMaven.java:105)
    at org.apache.maven.cli.MavenCli.execute (MavenCli.java:956)
    at org.apache.maven.cli.MavenCli.doMain (MavenCli.java:288)
    at org.apache.maven.cli.MavenCli.main (MavenCli.java:192)
    at jdk.internal.reflect.NativeMethodAccessorImpl.invoke0 (Native Method)
    at jdk.internal.reflect.NativeMethodAccessorImpl.invoke (NativeMethodAccessorImpl.java:62)
    at jdk.internal.reflect.DelegatingMethodAccessorImpl.invoke (DelegatingMethodAccessorImpl.java:43)
    at java.lang.reflect.Method.invoke (Method.java:567)
    at org.codehaus.plexus.classworlds.launcher.Launcher.launchEnhanced (Launcher.java:289)
    at org.codehaus.plexus.classworlds.launcher.Launcher.launch (Launcher.java:229)
    at org.codehaus.plexus.classworlds.launcher.Launcher.mainWithExitCode (Launcher.java:415)
    at org.codehaus.plexus.classworlds.launcher.Launcher.main (Launcher.java:356)
Caused by: org.apache.maven.plugin.MojoFailureException: 11 builds failed. See console output above for details.
    at org.apache.maven.plugins.invoker.InvokerSession.handleFailures (InvokerSession.java:260)
    at org.apache.maven.plugins.invoker.VerifyMojo.execute (VerifyMojo.java:137)
    at org.apache.maven.plugin.DefaultBuildPluginManager.executeMojo (DefaultBuildPluginManager.java:137)
    at org.apache.maven.lifecycle.internal.MojoExecutor.execute (MojoExecutor.java:210)
    at org.apache.maven.lifecycle.internal.MojoExecutor.execute (MojoExecutor.java:156)
    at org.apache.maven.lifecycle.internal.MojoExecutor.execute (MojoExecutor.java:148)
    at org.apache.maven.lifecycle.internal.LifecycleModuleBuilder.buildProject (LifecycleModuleBuilder.java:117)
    at org.apache.maven.lifecycle.internal.LifecycleModuleBuilder.buildProject (LifecycleModuleBuilder.java:81)
    at org.apache.maven.lifecycle.internal.builder.singlethreaded.SingleThreadedBuilder.build (SingleThreadedBuilder.java:56)
    at org.apache.maven.lifecycle.internal.LifecycleStarter.execute (LifecycleStarter.java:128)
    at org.apache.maven.DefaultMaven.doExecute (DefaultMaven.java:305)
    at org.apache.maven.DefaultMaven.doExecute (DefaultMaven.java:192)
    at org.apache.maven.DefaultMaven.execute (DefaultMaven.java:105)
    at org.apache.maven.cli.MavenCli.execute (MavenCli.java:956)
    at org.apache.maven.cli.MavenCli.doMain (MavenCli.java:288)
    at org.apache.maven.cli.MavenCli.main (MavenCli.java:192)
    at jdk.internal.reflect.NativeMethodAccessorImpl.invoke0 (Native Method)
    at jdk.internal.reflect.NativeMethodAccessorImpl.invoke (NativeMethodAccessorImpl.java:62)
    at jdk.internal.reflect.DelegatingMethodAccessorImpl.invoke (DelegatingMethodAccessorImpl.java:43)
    at java.lang.reflect.Method.invoke (Method.java:567)
    at org.codehaus.plexus.classworlds.launcher.Launcher.launchEnhanced (Launcher.java:289)
    at org.codehaus.plexus.classworlds.launcher.Launcher.launch (Launcher.java:229)
    at org.codehaus.plexus.classworlds.launcher.Launcher.mainWithExitCode (Launcher.java:415)
    at org.codehaus.plexus.classworlds.launcher.Launcher.main (Launcher.java:356)
[ERROR]
[ERROR] Re-run Maven using the -X switch to enable full debug logging.
[ERROR]
[ERROR] For more information about the errors and possible solutions, please read the following articles:
[ERROR] [Help 1] http://cwiki.apache.org/confluence/display/MAVEN/MojoFailureException
[Pipeline] }
[Pipeline] // dir
[Pipeline] }
[withMaven] junitPublisher - Archive test results for Maven artifact org.apache.maven.plugins:maven-compiler-plugin:maven-plugin:3.7.1-SNAPSHOT generated by maven-surefire-plugin:test (default-test): windows-jdk12-m3.6.x_build\target\surefire-reports\*.xml
Recording test results
[withMaven] openTasksPublisher - Scan Tasks for Maven artifact org.apache.maven.plugins:maven-compiler-plugin:maven-plugin:3.7.1-SNAPSHOT in source directory windows-jdk12-m3.6.x_build\src\main\java
[TASKS] Scanning folder 'f:\jenkins\jenkins-slave\workspace\en-compiler-plugin_MCOMPILER-320@2' for files matching the pattern 'windows-jdk12-m3.6.x_build\src\main\java\**\*' - excludes: null
[TASKS] Found 9 files to scan for tasks
[TASKS] Found 6 open tasks.
Skipping warnings blame since pipelines do not have an SCM link.%n
[TASKS] Computing warning deltas based on reference build #23
[withMaven] invokerPublisher - Archive invoker results for Maven artifact MavenArtifact{org.apache.maven.plugins:maven-compiler-plugin:maven-plugin:3.7.1-SNAPSHOT(version: 3.7.1-SNAPSHOT, snapshot:false) } generated by PluginInvocation{org.apache.maven.plugins:maven-invoker-plugin:3.0.1@integration-test  integration-test}: windows-jdk12-m3.6.x_build\target\invoker-reports\*.xml
[INFO] run post-build script verify.groovy
[INFO]           multirelease-patterns\packaging-plugin\pom.xml ... SUCCESS (14.6 s)
[INFO] Building: multirelease-patterns\singleproject-runtime\pom.xml
[INFO] run post-build script verify.groovy
[INFO]           multirelease-patterns\singleproject-runtime\pom.xml SUCCESS (9.6 s)
[INFO] Building: non-english-warnings\pom.xml
[withMaven] Publishers: Generated Artifacts Publisher: 12 ms, Junit Publisher: 65 ms, Open Task Scanner Publisher: 87 ms, Invoker Publisher: 21325 ms
[Pipeline] // withMaven
[Pipeline] cleanWs
[WS-CLEANUP] Deleting project workspace...
[WS-CLEANUP] Deferred wipeout is used...
[WS-CLEANUP] done
[Pipeline] cleanWs
[WS-CLEANUP] Deleting project workspace...
[WS-CLEANUP] Deferred wipeout is used...
[WS-CLEANUP] done
[Pipeline] }
[Pipeline] // stage
[Pipeline] }
[Pipeline] // ws
[Pipeline] }
[Pipeline] // node
[Pipeline] }
Failed in branch windows-jdk12-m3.6.x_build
[INFO] run post-build script verify.bsh
[INFO]           non-english-warnings\pom.xml ..................... SUCCESS (4.8 s)
[INFO] Building: test1\pom.xml
[INFO]           test1\pom.xml .................................... SUCCESS (4.4 s)
[INFO]
[INFO] --- maven-checkstyle-plugin:3.0.0:check (checkstyle-check) @ maven-compiler-plugin ---
[INFO] There are 2 errors reported by Checkstyle 6.18 with config/maven_checks.xml ruleset.
[INFO] Ignored 2 errors, 0 violation remaining.
[INFO]
[INFO] --- maven-invoker-plugin:3.0.1:verify (integration-test) @ maven-compiler-plugin ---
[INFO] -------------------------------------------------
[INFO] Build Summary:
[INFO]   Passed: 41, Failed: 11, Errors: 0, Skipped: 2
[INFO] -------------------------------------------------
[ERROR] The following builds failed:
[ERROR] *  error-prone-compiler\pom.xml
[ERROR] *  jdk16-annotation\pom.xml
[ERROR] *  mcompiler-120\pom.xml
[ERROR] *  mcompiler-135\pom.xml
[ERROR] *  MCOMPILER-157\pom.xml
[ERROR] *  mcompiler-179\pom.xml
[ERROR] *  MCOMPILER-203-processorpath\pom.xml
[ERROR] *  MCOMPILER-224\pom.xml
[ERROR] *  MCOMPILER-260_customArguments\pom.xml
[ERROR] *  MCOMPILER-270_release\pom.xml
[ERROR] *  MCOMPILER-275_separate-moduleinfo\pom.xml
[INFO] -------------------------------------------------
[INFO] ------------------------------------------------------------------------
[INFO] BUILD FAILURE
[INFO] ------------------------------------------------------------------------
[INFO] Total time:  06:45 min
[INFO] Finished at: 2019-09-22T21:56:18-07:00
[INFO] ------------------------------------------------------------------------
[INFO] [jenkins-event-spy] Generated F:\jenkins\jenkins-slave\workspace\en-compiler-plugin_MCOMPILER-320@3@2@tmp\withMaven1e60addc\maven-spy-20190922-214932-3485696822875555007007.log
[ERROR] Failed to execute goal org.apache.maven.plugins:maven-invoker-plugin:3.0.1:verify (integration-test) on project maven-compiler-plugin: 11 builds failed. See console output above for details. -> [Help 1]
org.apache.maven.lifecycle.LifecycleExecutionException: Failed to execute goal org.apache.maven.plugins:maven-invoker-plugin:3.0.1:verify (integration-test) on project maven-compiler-plugin: 11 builds failed. See console output above for details.
    at org.apache.maven.lifecycle.internal.MojoExecutor.execute (MojoExecutor.java:215)
    at org.apache.maven.lifecycle.internal.MojoExecutor.execute (MojoExecutor.java:156)
    at org.apache.maven.lifecycle.internal.MojoExecutor.execute (MojoExecutor.java:148)
    at org.apache.maven.lifecycle.internal.LifecycleModuleBuilder.buildProject (LifecycleModuleBuilder.java:117)
    at org.apache.maven.lifecycle.internal.LifecycleModuleBuilder.buildProject (LifecycleModuleBuilder.java:81)
    at org.apache.maven.lifecycle.internal.builder.singlethreaded.SingleThreadedBuilder.build (SingleThreadedBuilder.java:56)
    at org.apache.maven.lifecycle.internal.LifecycleStarter.execute (LifecycleStarter.java:128)
    at org.apache.maven.DefaultMaven.doExecute (DefaultMaven.java:305)
    at org.apache.maven.DefaultMaven.doExecute (DefaultMaven.java:192)
    at org.apache.maven.DefaultMaven.execute (DefaultMaven.java:105)
    at org.apache.maven.cli.MavenCli.execute (MavenCli.java:956)
    at org.apache.maven.cli.MavenCli.doMain (MavenCli.java:288)
    at org.apache.maven.cli.MavenCli.main (MavenCli.java:192)
    at jdk.internal.reflect.NativeMethodAccessorImpl.invoke0 (Native Method)
    at jdk.internal.reflect.NativeMethodAccessorImpl.invoke (NativeMethodAccessorImpl.java:62)
    at jdk.internal.reflect.DelegatingMethodAccessorImpl.invoke (DelegatingMethodAccessorImpl.java:43)
    at java.lang.reflect.Method.invoke (Method.java:567)
    at org.codehaus.plexus.classworlds.launcher.Launcher.launchEnhanced (Launcher.java:289)
    at org.codehaus.plexus.classworlds.launcher.Launcher.launch (Launcher.java:229)
    at org.codehaus.plexus.classworlds.launcher.Launcher.mainWithExitCode (Launcher.java:415)
    at org.codehaus.plexus.classworlds.launcher.Launcher.main (Launcher.java:356)
Caused by: org.apache.maven.plugin.MojoFailureException: 11 builds failed. See console output above for details.
    at org.apache.maven.plugins.invoker.InvokerSession.handleFailures (InvokerSession.java:260)
    at org.apache.maven.plugins.invoker.VerifyMojo.execute (VerifyMojo.java:137)
    at org.apache.maven.plugin.DefaultBuildPluginManager.executeMojo (DefaultBuildPluginManager.java:137)
    at org.apache.maven.lifecycle.internal.MojoExecutor.execute (MojoExecutor.java:210)
    at org.apache.maven.lifecycle.internal.MojoExecutor.execute (MojoExecutor.java:156)
    at org.apache.maven.lifecycle.internal.MojoExecutor.execute (MojoExecutor.java:148)
    at org.apache.maven.lifecycle.internal.LifecycleModuleBuilder.buildProject (LifecycleModuleBuilder.java:117)
    at org.apache.maven.lifecycle.internal.LifecycleModuleBuilder.buildProject (LifecycleModuleBuilder.java:81)
    at org.apache.maven.lifecycle.internal.builder.singlethreaded.SingleThreadedBuilder.build (SingleThreadedBuilder.java:56)
    at org.apache.maven.lifecycle.internal.LifecycleStarter.execute (LifecycleStarter.java:128)
    at org.apache.maven.DefaultMaven.doExecute (DefaultMaven.java:305)
    at org.apache.maven.DefaultMaven.doExecute (DefaultMaven.java:192)
    at org.apache.maven.DefaultMaven.execute (DefaultMaven.java:105)
    at org.apache.maven.cli.MavenCli.execute (MavenCli.java:956)
    at org.apache.maven.cli.MavenCli.doMain (MavenCli.java:288)
    at org.apache.maven.cli.MavenCli.main (MavenCli.java:192)
    at jdk.internal.reflect.NativeMethodAccessorImpl.invoke0 (Native Method)
    at jdk.internal.reflect.NativeMethodAccessorImpl.invoke (NativeMethodAccessorImpl.java:62)
    at jdk.internal.reflect.DelegatingMethodAccessorImpl.invoke (DelegatingMethodAccessorImpl.java:43)
    at java.lang.reflect.Method.invoke (Method.java:567)
    at org.codehaus.plexus.classworlds.launcher.Launcher.launchEnhanced (Launcher.java:289)
    at org.codehaus.plexus.classworlds.launcher.Launcher.launch (Launcher.java:229)
    at org.codehaus.plexus.classworlds.launcher.Launcher.mainWithExitCode (Launcher.java:415)
    at org.codehaus.plexus.classworlds.launcher.Launcher.main (Launcher.java:356)
[ERROR]
[ERROR] Re-run Maven using the -X switch to enable full debug logging.
[ERROR]
[ERROR] For more information about the errors and possible solutions, please read the following articles:
[ERROR] [Help 1] http://cwiki.apache.org/confluence/display/MAVEN/MojoFailureException
[Pipeline] }
[Pipeline] // dir
[Pipeline] }
[withMaven] junitPublisher - Archive test results for Maven artifact org.apache.maven.plugins:maven-compiler-plugin:maven-plugin:3.7.1-SNAPSHOT generated by maven-surefire-plugin:test (default-test): windows-jdk13-m3.6.x_build\target\surefire-reports\*.xml
Recording test results
[withMaven] openTasksPublisher - Scan Tasks for Maven artifact org.apache.maven.plugins:maven-compiler-plugin:maven-plugin:3.7.1-SNAPSHOT in source directory windows-jdk13-m3.6.x_build\src\main\java
[TASKS] Scanning folder 'f:\jenkins\jenkins-slave\workspace\en-compiler-plugin_MCOMPILER-320@3@2' for files matching the pattern 'windows-jdk13-m3.6.x_build\src\main\java\**\*' - excludes: null
[TASKS] Found 9 files to scan for tasks
[TASKS] Found 6 open tasks.
Skipping warnings blame since pipelines do not have an SCM link.%n
[TASKS] Computing warning deltas based on reference build #23
[withMaven] invokerPublisher - Archive invoker results for Maven artifact MavenArtifact{org.apache.maven.plugins:maven-compiler-plugin:maven-plugin:3.7.1-SNAPSHOT(version: 3.7.1-SNAPSHOT, snapshot:false) } generated by PluginInvocation{org.apache.maven.plugins:maven-invoker-plugin:3.0.1@integration-test  integration-test}: windows-jdk13-m3.6.x_build\target\invoker-reports\*.xml
[withMaven] Publishers: Generated Artifacts Publisher: 12 ms, Junit Publisher: 55 ms, Open Task Scanner Publisher: 76 ms, Invoker Publisher: 20157 ms
[Pipeline] // withMaven
[Pipeline] cleanWs
[WS-CLEANUP] Deleting project workspace...
[WS-CLEANUP] Deferred wipeout is used...
[WS-CLEANUP] done
[Pipeline] cleanWs
[WS-CLEANUP] Deleting project workspace...
[WS-CLEANUP] Deferred wipeout is used...
[WS-CLEANUP] done
[Pipeline] }
[Pipeline] // stage
[Pipeline] }
[Pipeline] // ws
[Pipeline] }
[Pipeline] // node
[Pipeline] }
Failed in branch windows-jdk13-m3.6.x_build
[Pipeline] // parallel
[Pipeline] stage
[Pipeline] { (Notifications)
[Pipeline] echo
Build result: FAILURE
[Pipeline] jiraIssueSelector
[Pipeline] echo
The authors of changes [rfscholte].
[Pipeline] echo
Sending email ...
[Pipeline] emailext
Reply | Threaded
Open this post in threaded view
|

Build failed in Jenkins: Maven TLP » maven-compiler-plugin » MCOMPILER-320 #45

Apache Jenkins Server-2
See https://builds.apache.org/job/maven-box/job/maven-compiler-plugin/job/MCOMPILER-320/45/

Changes:

* Apply Maven 3.6.2
* H29 has checkout issues...
* Issues with H28 too
* Seems like Maven 3.6.2 is not available on all Linux nodes yet
* Java 13 released: drop 12 + include 14 (-ea)

30 tests failed.
FAILED:  org.apache.maven.plugin.compiler.CompilerMojoTestCase.linux-jdk13-m3.6.x_build / Build linux-jdk13-m3.6.x_build / testCompilerBasic

Error Message:
Compilation failure

Stack Trace:
org.apache.maven.plugin.compiler.CompilationFailureException: Compilation failure
        at org.apache.maven.plugin.compiler.CompilerMojoTestCase.testCompilerBasic(CompilerMojoTestCase.java:82)


FAILED:  org.apache.maven.plugin.compiler.CompilerMojoTestCase.linux-jdk13-m3.6.x_build / Build linux-jdk13-m3.6.x_build / testCompilerIncludesExcludes

Error Message:
Compilation failure

Stack Trace:
org.apache.maven.plugin.compiler.CompilationFailureException: Compilation failure
        at org.apache.maven.plugin.compiler.CompilerMojoTestCase.testCompilerIncludesExcludes(CompilerMojoTestCase.java:149)


FAILED:  org.apache.maven.plugin.compiler.CompilerMojoTestCase.linux-jdk13-m3.6.x_build / Build linux-jdk13-m3.6.x_build / testCompileSkipMain

Error Message:
Compilation failure

Stack Trace:
org.apache.maven.plugin.compiler.CompilationFailureException: Compilation failure
        at org.apache.maven.plugin.compiler.CompilerMojoTestCase.testCompileSkipMain(CompilerMojoTestCase.java:335)


FAILED:  org.apache.maven.plugin.compiler.CompilerMojoTestCase.linux-jdk13-m3.6.x_build / Build linux-jdk13-m3.6.x_build / testCompileSkipTest

Error Message:
Compilation failure

Stack Trace:
org.apache.maven.plugin.compiler.CompilationFailureException: Compilation failure
        at org.apache.maven.plugin.compiler.CompilerMojoTestCase.testCompileSkipTest(CompilerMojoTestCase.java:349)


FAILED:  org.apache.maven.plugin.compiler.CompilerMojoTestCase.linux-jdk13-m3.6.x_build / Build linux-jdk13-m3.6.x_build / testCompilerFork

Error Message:
Compilation failure

Stack Trace:
org.apache.maven.plugin.compiler.CompilationFailureException: Compilation failure
        at org.apache.maven.plugin.compiler.CompilerMojoTestCase.testCompilerFork(CompilerMojoTestCase.java:191)


FAILED:  org.apache.maven.plugin.compiler.CompilerMojoTestCase.linux-jdk14-m3.6.x_build / Build linux-jdk14-m3.6.x_build / testCompilerBasic

Error Message:
Compilation failure

Stack Trace:
org.apache.maven.plugin.compiler.CompilationFailureException: Compilation failure
        at org.apache.maven.plugin.compiler.CompilerMojoTestCase.testCompilerBasic(CompilerMojoTestCase.java:82)


FAILED:  org.apache.maven.plugin.compiler.CompilerMojoTestCase.linux-jdk14-m3.6.x_build / Build linux-jdk14-m3.6.x_build / testCompilerIncludesExcludes

Error Message:
Compilation failure

Stack Trace:
org.apache.maven.plugin.compiler.CompilationFailureException: Compilation failure
        at org.apache.maven.plugin.compiler.CompilerMojoTestCase.testCompilerIncludesExcludes(CompilerMojoTestCase.java:149)


FAILED:  org.apache.maven.plugin.compiler.CompilerMojoTestCase.linux-jdk14-m3.6.x_build / Build linux-jdk14-m3.6.x_build / testCompileSkipMain

Error Message:
Compilation failure

Stack Trace:
org.apache.maven.plugin.compiler.CompilationFailureException: Compilation failure
        at org.apache.maven.plugin.compiler.CompilerMojoTestCase.testCompileSkipMain(CompilerMojoTestCase.java:335)


FAILED:  org.apache.maven.plugin.compiler.CompilerMojoTestCase.linux-jdk14-m3.6.x_build / Build linux-jdk14-m3.6.x_build / testCompileSkipTest

Error Message:
Compilation failure

Stack Trace:
org.apache.maven.plugin.compiler.CompilationFailureException: Compilation failure
        at org.apache.maven.plugin.compiler.CompilerMojoTestCase.testCompileSkipTest(CompilerMojoTestCase.java:349)


FAILED:  org.apache.maven.plugin.compiler.CompilerMojoTestCase.linux-jdk14-m3.6.x_build / Build linux-jdk14-m3.6.x_build / testCompilerFork

Error Message:
Compilation failure

Stack Trace:
org.apache.maven.plugin.compiler.CompilationFailureException: Compilation failure
        at org.apache.maven.plugin.compiler.CompilerMojoTestCase.testCompilerFork(CompilerMojoTestCase.java:191)


FAILED:  org.apache.maven.plugin.compiler.CompilerMojoTestCase.linux-jdk11-m3.6.x_build / Build linux-jdk11-m3.6.x_build / testCompilerBasic

Error Message:
Compilation failure

Stack Trace:
org.apache.maven.plugin.compiler.CompilationFailureException: Compilation failure
        at org.apache.maven.plugin.compiler.CompilerMojoTestCase.testCompilerBasic(CompilerMojoTestCase.java:82)


FAILED:  org.apache.maven.plugin.compiler.CompilerMojoTestCase.linux-jdk11-m3.6.x_build / Build linux-jdk11-m3.6.x_build / testCompilerIncludesExcludes

Error Message:
Compilation failure

Stack Trace:
org.apache.maven.plugin.compiler.CompilationFailureException: Compilation failure
        at org.apache.maven.plugin.compiler.CompilerMojoTestCase.testCompilerIncludesExcludes(CompilerMojoTestCase.java:149)


FAILED:  org.apache.maven.plugin.compiler.CompilerMojoTestCase.linux-jdk11-m3.6.x_build / Build linux-jdk11-m3.6.x_build / testCompileSkipMain

Error Message:
Compilation failure

Stack Trace:
org.apache.maven.plugin.compiler.CompilationFailureException: Compilation failure
        at org.apache.maven.plugin.compiler.CompilerMojoTestCase.testCompileSkipMain(CompilerMojoTestCase.java:335)


FAILED:  org.apache.maven.plugin.compiler.CompilerMojoTestCase.linux-jdk11-m3.6.x_build / Build linux-jdk11-m3.6.x_build / testCompileSkipTest

Error Message:
Compilation failure

Stack Trace:
org.apache.maven.plugin.compiler.CompilationFailureException: Compilation failure
        at org.apache.maven.plugin.compiler.CompilerMojoTestCase.testCompileSkipTest(CompilerMojoTestCase.java:349)


FAILED:  org.apache.maven.plugin.compiler.CompilerMojoTestCase.linux-jdk11-m3.6.x_build / Build linux-jdk11-m3.6.x_build / testCompilerFork

Error Message:
Compilation failure

Stack Trace:
org.apache.maven.plugin.compiler.CompilationFailureException: Compilation failure
        at org.apache.maven.plugin.compiler.CompilerMojoTestCase.testCompilerFork(CompilerMojoTestCase.java:191)


FAILED:  org.apache.maven.plugin.compiler.CompilerMojoTestCase.windows-jdk11-m3.6.x_build / Build windows-jdk11-m3.6.x_build / testCompilerBasic

Error Message:
Compilation failure

Stack Trace:
org.apache.maven.plugin.compiler.CompilationFailureException: Compilation failure
        at org.apache.maven.plugin.compiler.CompilerMojoTestCase.testCompilerBasic(CompilerMojoTestCase.java:82)


FAILED:  org.apache.maven.plugin.compiler.CompilerMojoTestCase.windows-jdk11-m3.6.x_build / Build windows-jdk11-m3.6.x_build / testCompilerIncludesExcludes

Error Message:
Compilation failure

Stack Trace:
org.apache.maven.plugin.compiler.CompilationFailureException: Compilation failure
        at org.apache.maven.plugin.compiler.CompilerMojoTestCase.testCompilerIncludesExcludes(CompilerMojoTestCase.java:149)


FAILED:  org.apache.maven.plugin.compiler.CompilerMojoTestCase.windows-jdk11-m3.6.x_build / Build windows-jdk11-m3.6.x_build / testCompileSkipMain

Error Message:
Compilation failure

Stack Trace:
org.apache.maven.plugin.compiler.CompilationFailureException: Compilation failure
        at org.apache.maven.plugin.compiler.CompilerMojoTestCase.testCompileSkipMain(CompilerMojoTestCase.java:335)


FAILED:  org.apache.maven.plugin.compiler.CompilerMojoTestCase.windows-jdk11-m3.6.x_build / Build windows-jdk11-m3.6.x_build / testCompileSkipTest

Error Message:
Compilation failure

Stack Trace:
org.apache.maven.plugin.compiler.CompilationFailureException: Compilation failure
        at org.apache.maven.plugin.compiler.CompilerMojoTestCase.testCompileSkipTest(CompilerMojoTestCase.java:349)


FAILED:  org.apache.maven.plugin.compiler.CompilerMojoTestCase.windows-jdk11-m3.6.x_build / Build windows-jdk11-m3.6.x_build / testCompilerFork

Error Message:
Compilation failure

Stack Trace:
org.apache.maven.plugin.compiler.CompilationFailureException: Compilation failure
        at org.apache.maven.plugin.compiler.CompilerMojoTestCase.testCompilerFork(CompilerMojoTestCase.java:191)


FAILED:  org.apache.maven.plugin.compiler.CompilerMojoTestCase.windows-jdk13-m3.6.x_build / Build windows-jdk13-m3.6.x_build / testCompilerBasic

Error Message:
Compilation failure

Stack Trace:
org.apache.maven.plugin.compiler.CompilationFailureException: Compilation failure
        at org.apache.maven.plugin.compiler.CompilerMojoTestCase.testCompilerBasic(CompilerMojoTestCase.java:82)


FAILED:  org.apache.maven.plugin.compiler.CompilerMojoTestCase.windows-jdk13-m3.6.x_build / Build windows-jdk13-m3.6.x_build / testCompilerIncludesExcludes

Error Message:
Compilation failure

Stack Trace:
org.apache.maven.plugin.compiler.CompilationFailureException: Compilation failure
        at org.apache.maven.plugin.compiler.CompilerMojoTestCase.testCompilerIncludesExcludes(CompilerMojoTestCase.java:149)


FAILED:  org.apache.maven.plugin.compiler.CompilerMojoTestCase.windows-jdk13-m3.6.x_build / Build windows-jdk13-m3.6.x_build / testCompileSkipMain

Error Message:
Compilation failure

Stack Trace:
org.apache.maven.plugin.compiler.CompilationFailureException: Compilation failure
        at org.apache.maven.plugin.compiler.CompilerMojoTestCase.testCompileSkipMain(CompilerMojoTestCase.java:335)


FAILED:  org.apache.maven.plugin.compiler.CompilerMojoTestCase.windows-jdk13-m3.6.x_build / Build windows-jdk13-m3.6.x_build / testCompileSkipTest

Error Message:
Compilation failure

Stack Trace:
org.apache.maven.plugin.compiler.CompilationFailureException: Compilation failure
        at org.apache.maven.plugin.compiler.CompilerMojoTestCase.testCompileSkipTest(CompilerMojoTestCase.java:349)


FAILED:  org.apache.maven.plugin.compiler.CompilerMojoTestCase.windows-jdk13-m3.6.x_build / Build windows-jdk13-m3.6.x_build / testCompilerFork

Error Message:
Compilation failure

Stack Trace:
org.apache.maven.plugin.compiler.CompilationFailureException: Compilation failure
        at org.apache.maven.plugin.compiler.CompilerMojoTestCase.testCompilerFork(CompilerMojoTestCase.java:191)


FAILED:  org.apache.maven.plugin.compiler.CompilerMojoTestCase.windows-jdk14-m3.6.x_build / Build windows-jdk14-m3.6.x_build / testCompilerBasic

Error Message:
Compilation failure

Stack Trace:
org.apache.maven.plugin.compiler.CompilationFailureException: Compilation failure
        at org.apache.maven.plugin.compiler.CompilerMojoTestCase.testCompilerBasic(CompilerMojoTestCase.java:82)


FAILED:  org.apache.maven.plugin.compiler.CompilerMojoTestCase.windows-jdk14-m3.6.x_build / Build windows-jdk14-m3.6.x_build / testCompilerIncludesExcludes

Error Message:
Compilation failure

Stack Trace:
org.apache.maven.plugin.compiler.CompilationFailureException: Compilation failure
        at org.apache.maven.plugin.compiler.CompilerMojoTestCase.testCompilerIncludesExcludes(CompilerMojoTestCase.java:149)


FAILED:  org.apache.maven.plugin.compiler.CompilerMojoTestCase.windows-jdk14-m3.6.x_build / Build windows-jdk14-m3.6.x_build / testCompileSkipMain

Error Message:
Compilation failure

Stack Trace:
org.apache.maven.plugin.compiler.CompilationFailureException: Compilation failure
        at org.apache.maven.plugin.compiler.CompilerMojoTestCase.testCompileSkipMain(CompilerMojoTestCase.java:335)


FAILED:  org.apache.maven.plugin.compiler.CompilerMojoTestCase.windows-jdk14-m3.6.x_build / Build windows-jdk14-m3.6.x_build / testCompileSkipTest

Error Message:
Compilation failure

Stack Trace:
org.apache.maven.plugin.compiler.CompilationFailureException: Compilation failure
        at org.apache.maven.plugin.compiler.CompilerMojoTestCase.testCompileSkipTest(CompilerMojoTestCase.java:349)


FAILED:  org.apache.maven.plugin.compiler.CompilerMojoTestCase.windows-jdk14-m3.6.x_build / Build windows-jdk14-m3.6.x_build / testCompilerFork

Error Message:
Compilation failure

Stack Trace:
org.apache.maven.plugin.compiler.CompilationFailureException: Compilation failure
        at org.apache.maven.plugin.compiler.CompilerMojoTestCase.testCompilerFork(CompilerMojoTestCase.java:191)




Build log:
[...truncated 24242 lines...]
[INFO] -------------------------------------------------
[INFO] ------------------------------------------------------------------------
[INFO] BUILD FAILURE
[INFO] ------------------------------------------------------------------------
[INFO] Total time:  07:02 min
[INFO] Finished at: 2019-10-01T02:55:34-07:00
[INFO] ------------------------------------------------------------------------
[INFO] [jenkins-event-spy] Generated F:\jenkins\jenkins-slave\workspace\en-compiler-plugin_MCOMPILER-320@3@2@tmp\withMaven227a4431\maven-spy-20191001-024831-9946195162734525595199.log
[ERROR] Failed to execute goal org.apache.maven.plugins:maven-invoker-plugin:3.0.1:verify (integration-test) on project maven-compiler-plugin: 11 builds failed. See console output above for details. -> [Help 1]
org.apache.maven.lifecycle.LifecycleExecutionException: Failed to execute goal org.apache.maven.plugins:maven-invoker-plugin:3.0.1:verify (integration-test) on project maven-compiler-plugin: 11 builds failed. See console output above for details.
    at org.apache.maven.lifecycle.internal.MojoExecutor.execute (MojoExecutor.java:215)
    at org.apache.maven.lifecycle.internal.MojoExecutor.execute (MojoExecutor.java:156)
    at org.apache.maven.lifecycle.internal.MojoExecutor.execute (MojoExecutor.java:148)
    at org.apache.maven.lifecycle.internal.LifecycleModuleBuilder.buildProject (LifecycleModuleBuilder.java:117)
    at org.apache.maven.lifecycle.internal.LifecycleModuleBuilder.buildProject (LifecycleModuleBuilder.java:81)
    at org.apache.maven.lifecycle.internal.builder.singlethreaded.SingleThreadedBuilder.build (SingleThreadedBuilder.java:56)
    at org.apache.maven.lifecycle.internal.LifecycleStarter.execute (LifecycleStarter.java:128)
    at org.apache.maven.DefaultMaven.doExecute (DefaultMaven.java:305)
    at org.apache.maven.DefaultMaven.doExecute (DefaultMaven.java:192)
    at org.apache.maven.DefaultMaven.execute (DefaultMaven.java:105)
    at org.apache.maven.cli.MavenCli.execute (MavenCli.java:956)
    at org.apache.maven.cli.MavenCli.doMain (MavenCli.java:288)
    at org.apache.maven.cli.MavenCli.main (MavenCli.java:192)
    at jdk.internal.reflect.NativeMethodAccessorImpl.invoke0 (Native Method)
    at jdk.internal.reflect.NativeMethodAccessorImpl.invoke (NativeMethodAccessorImpl.java:62)
    at jdk.internal.reflect.DelegatingMethodAccessorImpl.invoke (DelegatingMethodAccessorImpl.java:43)
    at java.lang.reflect.Method.invoke (Method.java:567)
    at org.codehaus.plexus.classworlds.launcher.Launcher.launchEnhanced (Launcher.java:282)
    at org.codehaus.plexus.classworlds.launcher.Launcher.launch (Launcher.java:225)
    at org.codehaus.plexus.classworlds.launcher.Launcher.mainWithExitCode (Launcher.java:406)
    at org.codehaus.plexus.classworlds.launcher.Launcher.main (Launcher.java:347)
Caused by: org.apache.maven.plugin.MojoFailureException: 11 builds failed. See console output above for details.
    at org.apache.maven.plugins.invoker.InvokerSession.handleFailures (InvokerSession.java:260)
    at org.apache.maven.plugins.invoker.VerifyMojo.execute (VerifyMojo.java:137)
    at org.apache.maven.plugin.DefaultBuildPluginManager.executeMojo (DefaultBuildPluginManager.java:137)
    at org.apache.maven.lifecycle.internal.MojoExecutor.execute (MojoExecutor.java:210)
    at org.apache.maven.lifecycle.internal.MojoExecutor.execute (MojoExecutor.java:156)
    at org.apache.maven.lifecycle.internal.MojoExecutor.execute (MojoExecutor.java:148)
    at org.apache.maven.lifecycle.internal.LifecycleModuleBuilder.buildProject (LifecycleModuleBuilder.java:117)
    at org.apache.maven.lifecycle.internal.LifecycleModuleBuilder.buildProject (LifecycleModuleBuilder.java:81)
    at org.apache.maven.lifecycle.internal.builder.singlethreaded.SingleThreadedBuilder.build (SingleThreadedBuilder.java:56)
    at org.apache.maven.lifecycle.internal.LifecycleStarter.execute (LifecycleStarter.java:128)
    at org.apache.maven.DefaultMaven.doExecute (DefaultMaven.java:305)
    at org.apache.maven.DefaultMaven.doExecute (DefaultMaven.java:192)
    at org.apache.maven.DefaultMaven.execute (DefaultMaven.java:105)
    at org.apache.maven.cli.MavenCli.execute (MavenCli.java:956)
    at org.apache.maven.cli.MavenCli.doMain (MavenCli.java:288)
    at org.apache.maven.cli.MavenCli.main (MavenCli.java:192)
    at jdk.internal.reflect.NativeMethodAccessorImpl.invoke0 (Native Method)
    at jdk.internal.reflect.NativeMethodAccessorImpl.invoke (NativeMethodAccessorImpl.java:62)
    at jdk.internal.reflect.DelegatingMethodAccessorImpl.invoke (DelegatingMethodAccessorImpl.java:43)
    at java.lang.reflect.Method.invoke (Method.java:567)
    at org.codehaus.plexus.classworlds.launcher.Launcher.launchEnhanced (Launcher.java:282)
    at org.codehaus.plexus.classworlds.launcher.Launcher.launch (Launcher.java:225)
    at org.codehaus.plexus.classworlds.launcher.Launcher.mainWithExitCode (Launcher.java:406)
    at org.codehaus.plexus.classworlds.launcher.Launcher.main (Launcher.java:347)
[ERROR]
[ERROR] Re-run Maven using the -X switch to enable full debug logging.
[ERROR]
[ERROR] For more information about the errors and possible solutions, please read the following articles:
[ERROR] [Help 1] http://cwiki.apache.org/confluence/display/MAVEN/MojoFailureException
[Pipeline] }
[Pipeline] // dir
[Pipeline] }
[withMaven] junitPublisher - Archive test results for Maven artifact org.apache.maven.plugins:maven-compiler-plugin:maven-plugin:3.7.1-SNAPSHOT generated by maven-surefire-plugin:test (default-test): windows-jdk13-m3.6.x_build\target\surefire-reports\*.xml
Recording test results
[withMaven] openTasksPublisher - Scan Tasks for Maven artifact org.apache.maven.plugins:maven-compiler-plugin:maven-plugin:3.7.1-SNAPSHOT in source directory windows-jdk13-m3.6.x_build\src\main\java
[TASKS] Scanning folder 'f:\jenkins\jenkins-slave\workspace\en-compiler-plugin_MCOMPILER-320@3@2' for files matching the pattern 'windows-jdk13-m3.6.x_build\src\main\java\**\*' - excludes: null
[TASKS] Found 9 files to scan for tasks
[TASKS] Found 6 open tasks.
Skipping warnings blame since pipelines do not have an SCM link.%n
[TASKS] Computing warning deltas based on reference build #23
[withMaven] invokerPublisher - Archive invoker results for Maven artifact MavenArtifact{org.apache.maven.plugins:maven-compiler-plugin:maven-plugin:3.7.1-SNAPSHOT(version: 3.7.1-SNAPSHOT, snapshot:false) } generated by PluginInvocation{org.apache.maven.plugins:maven-invoker-plugin:3.0.1@integration-test  integration-test}: windows-jdk13-m3.6.x_build\target\invoker-reports\*.xml
[INFO] run post-build script verify.groovy
[INFO]           multirelease-patterns\multimodule\pom.xml ........ SUCCESS (15.0 s)
[INFO] Building: multirelease-patterns\multiproject\pom.xml
[withMaven] Publishers: Generated Artifacts Publisher: 13 ms, Junit Publisher: 56 ms, Open Task Scanner Publisher: 89 ms, Invoker Publisher: 26974 ms
[Pipeline] // withMaven
[Pipeline] cleanWs
[WS-CLEANUP] Deleting project workspace...
[WS-CLEANUP] Deferred wipeout is used...
[WS-CLEANUP] done
[Pipeline] cleanWs
[WS-CLEANUP] Deleting project workspace...
[WS-CLEANUP] Deferred wipeout is used...
[WS-CLEANUP] done
[Pipeline] }
[Pipeline] // stage
[Pipeline] }
[Pipeline] // ws
[Pipeline] }
[Pipeline] // node
[Pipeline] }
Failed in branch windows-jdk11-m3.6.x_build
[withMaven] Publishers: Generated Artifacts Publisher: 11 ms, Junit Publisher: 56 ms, Open Task Scanner Publisher: 73 ms, Invoker Publisher: 24726 ms
[Pipeline] // withMaven
[Pipeline] cleanWs
[WS-CLEANUP] Deleting project workspace...
[WS-CLEANUP] Deferred wipeout is used...
[WS-CLEANUP] done
[Pipeline] cleanWs
[WS-CLEANUP] Deleting project workspace...
[WS-CLEANUP] Deferred wipeout is used...
[WS-CLEANUP] done
[Pipeline] }
[Pipeline] // stage
[Pipeline] }
[Pipeline] // ws
[Pipeline] }
[Pipeline] // node
[Pipeline] }
Failed in branch windows-jdk13-m3.6.x_build
[INFO] run post-build script verify.groovy
[INFO]           multirelease-patterns\multiproject\pom.xml ....... SUCCESS (24.6 s)
[INFO] Building: multirelease-patterns\packaging-plugin\pom.xml
[INFO] run post-build script verify.groovy
[INFO]           multirelease-patterns\packaging-plugin\pom.xml ... SUCCESS (12.7 s)
[INFO] Building: multirelease-patterns\singleproject-runtime\pom.xml
[INFO] run post-build script verify.groovy
[INFO]           multirelease-patterns\singleproject-runtime\pom.xml SUCCESS (8.3 s)
[INFO] Building: non-english-warnings\pom.xml
[INFO] run post-build script verify.bsh
[INFO]           non-english-warnings\pom.xml ..................... SUCCESS (4.0 s)
[INFO] Building: test1\pom.xml
[INFO]           test1\pom.xml .................................... SUCCESS (3.9 s)
[INFO]
[INFO] --- maven-checkstyle-plugin:3.0.0:check (checkstyle-check) @ maven-compiler-plugin ---
[INFO] There are 2 errors reported by Checkstyle 6.18 with config/maven_checks.xml ruleset.
[INFO] Ignored 2 errors, 0 violation remaining.
[INFO]
[INFO] --- maven-invoker-plugin:3.0.1:verify (integration-test) @ maven-compiler-plugin ---
[INFO] -------------------------------------------------
[INFO] Build Summary:
[INFO]   Passed: 41, Failed: 11, Errors: 0, Skipped: 2
[INFO] -------------------------------------------------
[ERROR] The following builds failed:
[ERROR] *  error-prone-compiler\pom.xml
[ERROR] *  jdk16-annotation\pom.xml
[ERROR] *  mcompiler-120\pom.xml
[ERROR] *  mcompiler-135\pom.xml
[ERROR] *  MCOMPILER-157\pom.xml
[ERROR] *  mcompiler-179\pom.xml
[ERROR] *  MCOMPILER-203-processorpath\pom.xml
[ERROR] *  MCOMPILER-224\pom.xml
[ERROR] *  MCOMPILER-260_customArguments\pom.xml
[ERROR] *  MCOMPILER-270_release\pom.xml
[ERROR] *  MCOMPILER-275_separate-moduleinfo\pom.xml
[INFO] -------------------------------------------------
[INFO] ------------------------------------------------------------------------
[INFO] BUILD FAILURE
[INFO] ------------------------------------------------------------------------
[INFO] Total time:  05:56 min
[INFO] Finished at: 2019-10-01T02:56:34-07:00
[INFO] ------------------------------------------------------------------------
[INFO] [jenkins-event-spy] Generated F:\jenkins\jenkins-slave\workspace\en-compiler-plugin_MCOMPILER-320@3@2@tmp\withMavenf7624a26\maven-spy-20191001-025037-40810103821611417955232.log
[ERROR] Failed to execute goal org.apache.maven.plugins:maven-invoker-plugin:3.0.1:verify (integration-test) on project maven-compiler-plugin: 11 builds failed. See console output above for details. -> [Help 1]
org.apache.maven.lifecycle.LifecycleExecutionException: Failed to execute goal org.apache.maven.plugins:maven-invoker-plugin:3.0.1:verify (integration-test) on project maven-compiler-plugin: 11 builds failed. See console output above for details.
    at org.apache.maven.lifecycle.internal.MojoExecutor.execute (MojoExecutor.java:215)
    at org.apache.maven.lifecycle.internal.MojoExecutor.execute (MojoExecutor.java:156)
    at org.apache.maven.lifecycle.internal.MojoExecutor.execute (MojoExecutor.java:148)
    at org.apache.maven.lifecycle.internal.LifecycleModuleBuilder.buildProject (LifecycleModuleBuilder.java:117)
    at org.apache.maven.lifecycle.internal.LifecycleModuleBuilder.buildProject (LifecycleModuleBuilder.java:81)
    at org.apache.maven.lifecycle.internal.builder.singlethreaded.SingleThreadedBuilder.build (SingleThreadedBuilder.java:56)
    at org.apache.maven.lifecycle.internal.LifecycleStarter.execute (LifecycleStarter.java:128)
    at org.apache.maven.DefaultMaven.doExecute (DefaultMaven.java:305)
    at org.apache.maven.DefaultMaven.doExecute (DefaultMaven.java:192)
    at org.apache.maven.DefaultMaven.execute (DefaultMaven.java:105)
    at org.apache.maven.cli.MavenCli.execute (MavenCli.java:956)
    at org.apache.maven.cli.MavenCli.doMain (MavenCli.java:288)
    at org.apache.maven.cli.MavenCli.main (MavenCli.java:192)
    at jdk.internal.reflect.NativeMethodAccessorImpl.invoke0 (Native Method)
    at jdk.internal.reflect.NativeMethodAccessorImpl.invoke (NativeMethodAccessorImpl.java:62)
    at jdk.internal.reflect.DelegatingMethodAccessorImpl.invoke (DelegatingMethodAccessorImpl.java:43)
    at java.lang.reflect.Method.invoke (Method.java:567)
    at org.codehaus.plexus.classworlds.launcher.Launcher.launchEnhanced (Launcher.java:282)
    at org.codehaus.plexus.classworlds.launcher.Launcher.launch (Launcher.java:225)
    at org.codehaus.plexus.classworlds.launcher.Launcher.mainWithExitCode (Launcher.java:406)
    at org.codehaus.plexus.classworlds.launcher.Launcher.main (Launcher.java:347)
Caused by: org.apache.maven.plugin.MojoFailureException: 11 builds failed. See console output above for details.
    at org.apache.maven.plugins.invoker.InvokerSession.handleFailures (InvokerSession.java:260)
    at org.apache.maven.plugins.invoker.VerifyMojo.execute (VerifyMojo.java:137)
    at org.apache.maven.plugin.DefaultBuildPluginManager.executeMojo (DefaultBuildPluginManager.java:137)
    at org.apache.maven.lifecycle.internal.MojoExecutor.execute (MojoExecutor.java:210)
    at org.apache.maven.lifecycle.internal.MojoExecutor.execute (MojoExecutor.java:156)
    at org.apache.maven.lifecycle.internal.MojoExecutor.execute (MojoExecutor.java:148)
    at org.apache.maven.lifecycle.internal.LifecycleModuleBuilder.buildProject (LifecycleModuleBuilder.java:117)
    at org.apache.maven.lifecycle.internal.LifecycleModuleBuilder.buildProject (LifecycleModuleBuilder.java:81)
    at org.apache.maven.lifecycle.internal.builder.singlethreaded.SingleThreadedBuilder.build (SingleThreadedBuilder.java:56)
    at org.apache.maven.lifecycle.internal.LifecycleStarter.execute (LifecycleStarter.java:128)
    at org.apache.maven.DefaultMaven.doExecute (DefaultMaven.java:305)
    at org.apache.maven.DefaultMaven.doExecute (DefaultMaven.java:192)
    at org.apache.maven.DefaultMaven.execute (DefaultMaven.java:105)
    at org.apache.maven.cli.MavenCli.execute (MavenCli.java:956)
    at org.apache.maven.cli.MavenCli.doMain (MavenCli.java:288)
    at org.apache.maven.cli.MavenCli.main (MavenCli.java:192)
    at jdk.internal.reflect.NativeMethodAccessorImpl.invoke0 (Native Method)
    at jdk.internal.reflect.NativeMethodAccessorImpl.invoke (NativeMethodAccessorImpl.java:62)
    at jdk.internal.reflect.DelegatingMethodAccessorImpl.invoke (DelegatingMethodAccessorImpl.java:43)
    at java.lang.reflect.Method.invoke (Method.java:567)
    at org.codehaus.plexus.classworlds.launcher.Launcher.launchEnhanced (Launcher.java:282)
    at org.codehaus.plexus.classworlds.launcher.Launcher.launch (Launcher.java:225)
    at org.codehaus.plexus.classworlds.launcher.Launcher.mainWithExitCode (Launcher.java:406)
    at org.codehaus.plexus.classworlds.launcher.Launcher.main (Launcher.java:347)
[ERROR]
[ERROR] Re-run Maven using the -X switch to enable full debug logging.
[ERROR]
[ERROR] For more information about the errors and possible solutions, please read the following articles:
[ERROR] [Help 1] http://cwiki.apache.org/confluence/display/MAVEN/MojoFailureException
[Pipeline] }
[Pipeline] // dir
[Pipeline] }
[withMaven] junitPublisher - Archive test results for Maven artifact org.apache.maven.plugins:maven-compiler-plugin:maven-plugin:3.7.1-SNAPSHOT generated by maven-surefire-plugin:test (default-test): windows-jdk14-m3.6.x_build\target\surefire-reports\*.xml
Recording test results
[withMaven] openTasksPublisher - Scan Tasks for Maven artifact org.apache.maven.plugins:maven-compiler-plugin:maven-plugin:3.7.1-SNAPSHOT in source directory windows-jdk14-m3.6.x_build\src\main\java
[TASKS] Scanning folder 'f:\jenkins\jenkins-slave\workspace\en-compiler-plugin_MCOMPILER-320@3@2' for files matching the pattern 'windows-jdk14-m3.6.x_build\src\main\java\**\*' - excludes: null
[TASKS] Found 9 files to scan for tasks
[TASKS] Found 6 open tasks.
Skipping warnings blame since pipelines do not have an SCM link.%n
[TASKS] Computing warning deltas based on reference build #23
[withMaven] invokerPublisher - Archive invoker results for Maven artifact MavenArtifact{org.apache.maven.plugins:maven-compiler-plugin:maven-plugin:3.7.1-SNAPSHOT(version: 3.7.1-SNAPSHOT, snapshot:false) } generated by PluginInvocation{org.apache.maven.plugins:maven-invoker-plugin:3.0.1@integration-test  integration-test}: windows-jdk14-m3.6.x_build\target\invoker-reports\*.xml
[withMaven] Publishers: Generated Artifacts Publisher: 10 ms, Junit Publisher: 54 ms, Open Task Scanner Publisher: 71 ms, Invoker Publisher: 18378 ms
[Pipeline] // withMaven
[Pipeline] cleanWs
[WS-CLEANUP] Deleting project workspace...
[WS-CLEANUP] Deferred wipeout is used...
[WS-CLEANUP] done
[Pipeline] cleanWs
[WS-CLEANUP] Deleting project workspace...
[WS-CLEANUP] Deferred wipeout is used...
[WS-CLEANUP] done
[Pipeline] }
[Pipeline] // stage
[Pipeline] }
[Pipeline] // ws
[Pipeline] }
[Pipeline] // node
[Pipeline] }
Failed in branch windows-jdk14-m3.6.x_build
[Pipeline] // parallel
[Pipeline] stage
[Pipeline] { (Notifications)
[Pipeline] echo
Build result: FAILURE
[Pipeline] jiraIssueSelector
[Pipeline] echo
The authors of changes [rfscholte].
[Pipeline] echo
Sending email ...
[Pipeline] emailext
Reply | Threaded
Open this post in threaded view
|

Build failed in Jenkins: Maven TLP » maven-compiler-plugin » MCOMPILER-320 #46

Apache Jenkins Server-2
See https://builds.apache.org/job/maven-box/job/maven-compiler-plugin/job/MCOMPILER-320/46/

No changes.

30 tests failed.
FAILED:  org.apache.maven.plugin.compiler.CompilerMojoTestCase.linux-jdk11-m3.6.x_build / Build linux-jdk11-m3.6.x_build / testCompilerBasic

Error Message:
Compilation failure

Stack Trace:
org.apache.maven.plugin.compiler.CompilationFailureException: Compilation failure
        at org.apache.maven.plugin.compiler.CompilerMojoTestCase.testCompilerBasic(CompilerMojoTestCase.java:82)


FAILED:  org.apache.maven.plugin.compiler.CompilerMojoTestCase.linux-jdk11-m3.6.x_build / Build linux-jdk11-m3.6.x_build / testCompilerIncludesExcludes

Error Message:
Compilation failure

Stack Trace:
org.apache.maven.plugin.compiler.CompilationFailureException: Compilation failure
        at org.apache.maven.plugin.compiler.CompilerMojoTestCase.testCompilerIncludesExcludes(CompilerMojoTestCase.java:149)


FAILED:  org.apache.maven.plugin.compiler.CompilerMojoTestCase.linux-jdk11-m3.6.x_build / Build linux-jdk11-m3.6.x_build / testCompileSkipMain

Error Message:
Compilation failure

Stack Trace:
org.apache.maven.plugin.compiler.CompilationFailureException: Compilation failure
        at org.apache.maven.plugin.compiler.CompilerMojoTestCase.testCompileSkipMain(CompilerMojoTestCase.java:335)


FAILED:  org.apache.maven.plugin.compiler.CompilerMojoTestCase.linux-jdk11-m3.6.x_build / Build linux-jdk11-m3.6.x_build / testCompileSkipTest

Error Message:
Compilation failure

Stack Trace:
org.apache.maven.plugin.compiler.CompilationFailureException: Compilation failure
        at org.apache.maven.plugin.compiler.CompilerMojoTestCase.testCompileSkipTest(CompilerMojoTestCase.java:349)


FAILED:  org.apache.maven.plugin.compiler.CompilerMojoTestCase.linux-jdk11-m3.6.x_build / Build linux-jdk11-m3.6.x_build / testCompilerFork

Error Message:
Compilation failure

Stack Trace:
org.apache.maven.plugin.compiler.CompilationFailureException: Compilation failure
        at org.apache.maven.plugin.compiler.CompilerMojoTestCase.testCompilerFork(CompilerMojoTestCase.java:191)


FAILED:  org.apache.maven.plugin.compiler.CompilerMojoTestCase.linux-jdk13-m3.6.x_build / Build linux-jdk13-m3.6.x_build / testCompilerBasic

Error Message:
Compilation failure

Stack Trace:
org.apache.maven.plugin.compiler.CompilationFailureException: Compilation failure
        at org.apache.maven.plugin.compiler.CompilerMojoTestCase.testCompilerBasic(CompilerMojoTestCase.java:82)


FAILED:  org.apache.maven.plugin.compiler.CompilerMojoTestCase.linux-jdk13-m3.6.x_build / Build linux-jdk13-m3.6.x_build / testCompilerIncludesExcludes

Error Message:
Compilation failure

Stack Trace:
org.apache.maven.plugin.compiler.CompilationFailureException: Compilation failure
        at org.apache.maven.plugin.compiler.CompilerMojoTestCase.testCompilerIncludesExcludes(CompilerMojoTestCase.java:149)


FAILED:  org.apache.maven.plugin.compiler.CompilerMojoTestCase.linux-jdk13-m3.6.x_build / Build linux-jdk13-m3.6.x_build / testCompileSkipMain

Error Message:
Compilation failure

Stack Trace:
org.apache.maven.plugin.compiler.CompilationFailureException: Compilation failure
        at org.apache.maven.plugin.compiler.CompilerMojoTestCase.testCompileSkipMain(CompilerMojoTestCase.java:335)


FAILED:  org.apache.maven.plugin.compiler.CompilerMojoTestCase.linux-jdk13-m3.6.x_build / Build linux-jdk13-m3.6.x_build / testCompileSkipTest

Error Message:
Compilation failure

Stack Trace:
org.apache.maven.plugin.compiler.CompilationFailureException: Compilation failure
        at org.apache.maven.plugin.compiler.CompilerMojoTestCase.testCompileSkipTest(CompilerMojoTestCase.java:349)


FAILED:  org.apache.maven.plugin.compiler.CompilerMojoTestCase.linux-jdk13-m3.6.x_build / Build linux-jdk13-m3.6.x_build / testCompilerFork

Error Message:
Compilation failure

Stack Trace:
org.apache.maven.plugin.compiler.CompilationFailureException: Compilation failure
        at org.apache.maven.plugin.compiler.CompilerMojoTestCase.testCompilerFork(CompilerMojoTestCase.java:191)


FAILED:  org.apache.maven.plugin.compiler.CompilerMojoTestCase.linux-jdk14-m3.6.x_build / Build linux-jdk14-m3.6.x_build / testCompilerBasic

Error Message:
Compilation failure

Stack Trace:
org.apache.maven.plugin.compiler.CompilationFailureException: Compilation failure
        at org.apache.maven.plugin.compiler.CompilerMojoTestCase.testCompilerBasic(CompilerMojoTestCase.java:82)


FAILED:  org.apache.maven.plugin.compiler.CompilerMojoTestCase.linux-jdk14-m3.6.x_build / Build linux-jdk14-m3.6.x_build / testCompilerIncludesExcludes

Error Message:
Compilation failure

Stack Trace:
org.apache.maven.plugin.compiler.CompilationFailureException: Compilation failure
        at org.apache.maven.plugin.compiler.CompilerMojoTestCase.testCompilerIncludesExcludes(CompilerMojoTestCase.java:149)


FAILED:  org.apache.maven.plugin.compiler.CompilerMojoTestCase.linux-jdk14-m3.6.x_build / Build linux-jdk14-m3.6.x_build / testCompileSkipMain

Error Message:
Compilation failure

Stack Trace:
org.apache.maven.plugin.compiler.CompilationFailureException: Compilation failure
        at org.apache.maven.plugin.compiler.CompilerMojoTestCase.testCompileSkipMain(CompilerMojoTestCase.java:335)


FAILED:  org.apache.maven.plugin.compiler.CompilerMojoTestCase.linux-jdk14-m3.6.x_build / Build linux-jdk14-m3.6.x_build / testCompileSkipTest

Error Message:
Compilation failure

Stack Trace:
org.apache.maven.plugin.compiler.CompilationFailureException: Compilation failure
        at org.apache.maven.plugin.compiler.CompilerMojoTestCase.testCompileSkipTest(CompilerMojoTestCase.java:349)


FAILED:  org.apache.maven.plugin.compiler.CompilerMojoTestCase.linux-jdk14-m3.6.x_build / Build linux-jdk14-m3.6.x_build / testCompilerFork

Error Message:
Compilation failure

Stack Trace:
org.apache.maven.plugin.compiler.CompilationFailureException: Compilation failure
        at org.apache.maven.plugin.compiler.CompilerMojoTestCase.testCompilerFork(CompilerMojoTestCase.java:191)


FAILED:  org.apache.maven.plugin.compiler.CompilerMojoTestCase.windows-jdk11-m3.6.x_build / Build windows-jdk11-m3.6.x_build / testCompilerBasic

Error Message:
Compilation failure

Stack Trace:
org.apache.maven.plugin.compiler.CompilationFailureException: Compilation failure
        at org.apache.maven.plugin.compiler.CompilerMojoTestCase.testCompilerBasic(CompilerMojoTestCase.java:82)


FAILED:  org.apache.maven.plugin.compiler.CompilerMojoTestCase.windows-jdk11-m3.6.x_build / Build windows-jdk11-m3.6.x_build / testCompilerIncludesExcludes

Error Message:
Compilation failure

Stack Trace:
org.apache.maven.plugin.compiler.CompilationFailureException: Compilation failure
        at org.apache.maven.plugin.compiler.CompilerMojoTestCase.testCompilerIncludesExcludes(CompilerMojoTestCase.java:149)


FAILED:  org.apache.maven.plugin.compiler.CompilerMojoTestCase.windows-jdk11-m3.6.x_build / Build windows-jdk11-m3.6.x_build / testCompileSkipMain

Error Message:
Compilation failure

Stack Trace:
org.apache.maven.plugin.compiler.CompilationFailureException: Compilation failure
        at org.apache.maven.plugin.compiler.CompilerMojoTestCase.testCompileSkipMain(CompilerMojoTestCase.java:335)


FAILED:  org.apache.maven.plugin.compiler.CompilerMojoTestCase.windows-jdk11-m3.6.x_build / Build windows-jdk11-m3.6.x_build / testCompileSkipTest

Error Message:
Compilation failure

Stack Trace:
org.apache.maven.plugin.compiler.CompilationFailureException: Compilation failure
        at org.apache.maven.plugin.compiler.CompilerMojoTestCase.testCompileSkipTest(CompilerMojoTestCase.java:349)


FAILED:  org.apache.maven.plugin.compiler.CompilerMojoTestCase.windows-jdk11-m3.6.x_build / Build windows-jdk11-m3.6.x_build / testCompilerFork

Error Message:
Compilation failure

Stack Trace:
org.apache.maven.plugin.compiler.CompilationFailureException: Compilation failure
        at org.apache.maven.plugin.compiler.CompilerMojoTestCase.testCompilerFork(CompilerMojoTestCase.java:191)


FAILED:  org.apache.maven.plugin.compiler.CompilerMojoTestCase.windows-jdk13-m3.6.x_build / Build windows-jdk13-m3.6.x_build / testCompilerBasic

Error Message:
Compilation failure

Stack Trace:
org.apache.maven.plugin.compiler.CompilationFailureException: Compilation failure
        at org.apache.maven.plugin.compiler.CompilerMojoTestCase.testCompilerBasic(CompilerMojoTestCase.java:82)


FAILED:  org.apache.maven.plugin.compiler.CompilerMojoTestCase.windows-jdk13-m3.6.x_build / Build windows-jdk13-m3.6.x_build / testCompilerIncludesExcludes

Error Message:
Compilation failure

Stack Trace:
org.apache.maven.plugin.compiler.CompilationFailureException: Compilation failure
        at org.apache.maven.plugin.compiler.CompilerMojoTestCase.testCompilerIncludesExcludes(CompilerMojoTestCase.java:149)


FAILED:  org.apache.maven.plugin.compiler.CompilerMojoTestCase.windows-jdk13-m3.6.x_build / Build windows-jdk13-m3.6.x_build / testCompileSkipMain

Error Message:
Compilation failure

Stack Trace:
org.apache.maven.plugin.compiler.CompilationFailureException: Compilation failure
        at org.apache.maven.plugin.compiler.CompilerMojoTestCase.testCompileSkipMain(CompilerMojoTestCase.java:335)


FAILED:  org.apache.maven.plugin.compiler.CompilerMojoTestCase.windows-jdk13-m3.6.x_build / Build windows-jdk13-m3.6.x_build / testCompileSkipTest

Error Message:
Compilation failure

Stack Trace:
org.apache.maven.plugin.compiler.CompilationFailureException: Compilation failure
        at org.apache.maven.plugin.compiler.CompilerMojoTestCase.testCompileSkipTest(CompilerMojoTestCase.java:349)


FAILED:  org.apache.maven.plugin.compiler.CompilerMojoTestCase.windows-jdk13-m3.6.x_build / Build windows-jdk13-m3.6.x_build / testCompilerFork

Error Message:
Compilation failure

Stack Trace:
org.apache.maven.plugin.compiler.CompilationFailureException: Compilation failure
        at org.apache.maven.plugin.compiler.CompilerMojoTestCase.testCompilerFork(CompilerMojoTestCase.java:191)


FAILED:  org.apache.maven.plugin.compiler.CompilerMojoTestCase.windows-jdk14-m3.6.x_build / Build windows-jdk14-m3.6.x_build / testCompilerBasic

Error Message:
Compilation failure

Stack Trace:
org.apache.maven.plugin.compiler.CompilationFailureException: Compilation failure
        at org.apache.maven.plugin.compiler.CompilerMojoTestCase.testCompilerBasic(CompilerMojoTestCase.java:82)


FAILED:  org.apache.maven.plugin.compiler.CompilerMojoTestCase.windows-jdk14-m3.6.x_build / Build windows-jdk14-m3.6.x_build / testCompilerIncludesExcludes

Error Message:
Compilation failure

Stack Trace:
org.apache.maven.plugin.compiler.CompilationFailureException: Compilation failure
        at org.apache.maven.plugin.compiler.CompilerMojoTestCase.testCompilerIncludesExcludes(CompilerMojoTestCase.java:149)


FAILED:  org.apache.maven.plugin.compiler.CompilerMojoTestCase.windows-jdk14-m3.6.x_build / Build windows-jdk14-m3.6.x_build / testCompileSkipMain

Error Message:
Compilation failure

Stack Trace:
org.apache.maven.plugin.compiler.CompilationFailureException: Compilation failure
        at org.apache.maven.plugin.compiler.CompilerMojoTestCase.testCompileSkipMain(CompilerMojoTestCase.java:335)


FAILED:  org.apache.maven.plugin.compiler.CompilerMojoTestCase.windows-jdk14-m3.6.x_build / Build windows-jdk14-m3.6.x_build / testCompileSkipTest

Error Message:
Compilation failure

Stack Trace:
org.apache.maven.plugin.compiler.CompilationFailureException: Compilation failure
        at org.apache.maven.plugin.compiler.CompilerMojoTestCase.testCompileSkipTest(CompilerMojoTestCase.java:349)


FAILED:  org.apache.maven.plugin.compiler.CompilerMojoTestCase.windows-jdk14-m3.6.x_build / Build windows-jdk14-m3.6.x_build / testCompilerFork

Error Message:
Compilation failure

Stack Trace:
org.apache.maven.plugin.compiler.CompilationFailureException: Compilation failure
        at org.apache.maven.plugin.compiler.CompilerMojoTestCase.testCompilerFork(CompilerMojoTestCase.java:191)




Build log:
[...truncated 24162 lines...]
       [INFO] -------------------------------------------------------------
       [ERROR] Source option 6 is no longer supported. Use 7 or later.
       [ERROR] Target option 6 is no longer supported. Use 7 or later.
       [INFO] 2 errors
       [INFO] -------------------------------------------------------------
       [INFO] ------------------------------------------------------------------------
       [INFO] BUILD FAILURE
       [INFO] ------------------------------------------------------------------------
       [INFO] Total time:  2.816 s
       [INFO] Finished at: 2019-10-04T04:32:54-07:00
       [INFO] ------------------------------------------------------------------------
       [ERROR] Failed to execute goal org.apache.maven.plugins:maven-compiler-plugin:3.7.1-SNAPSHOT:compile (base-compile) on project mcompiler270: Compilation failure: Compilation failure:
       [ERROR] Source option 6 is no longer supported. Use 7 or later.
       [ERROR] Target option 6 is no longer supported. Use 7 or later.
       [ERROR] -> [Help 1]
       org.apache.maven.lifecycle.LifecycleExecutionException: Failed to execute goal org.apache.maven.plugins:maven-compiler-plugin:3.7.1-SNAPSHOT:compile (base-compile) on project mcompiler270: Compilation failure
           at org.apache.maven.lifecycle.internal.MojoExecutor.execute (MojoExecutor.java:215)
           at org.apache.maven.lifecycle.internal.MojoExecutor.execute (MojoExecutor.java:156)
           at org.apache.maven.lifecycle.internal.MojoExecutor.execute (MojoExecutor.java:148)
           at org.apache.maven.lifecycle.internal.LifecycleModuleBuilder.buildProject (LifecycleModuleBuilder.java:117)
           at org.apache.maven.lifecycle.internal.LifecycleModuleBuilder.buildProject (LifecycleModuleBuilder.java:81)
           at org.apache.maven.lifecycle.internal.builder.singlethreaded.SingleThreadedBuilder.build (SingleThreadedBuilder.java:56)
           at org.apache.maven.lifecycle.internal.LifecycleStarter.execute (LifecycleStarter.java:128)
           at org.apache.maven.DefaultMaven.doExecute (DefaultMaven.java:305)
           at org.apache.maven.DefaultMaven.doExecute (DefaultMaven.java:192)
           at org.apache.maven.DefaultMaven.execute (DefaultMaven.java:105)
           at org.apache.maven.cli.MavenCli.execute (MavenCli.java:956)
           at org.apache.maven.cli.MavenCli.doMain (MavenCli.java:288)
           at org.apache.maven.cli.MavenCli.main (MavenCli.java:192)
           at jdk.internal.reflect.NativeMethodAccessorImpl.invoke0 (Native Method)
           at jdk.internal.reflect.NativeMethodAccessorImpl.invoke (NativeMethodAccessorImpl.java:62)
           at jdk.internal.reflect.DelegatingMethodAccessorImpl.invoke (DelegatingMethodAccessorImpl.java:43)
           at java.lang.reflect.Method.invoke (Method.java:567)
           at org.codehaus.plexus.classworlds.launcher.Launcher.launchEnhanced (Launcher.java:282)
           at org.codehaus.plexus.classworlds.launcher.Launcher.launch (Launcher.java:225)
           at org.codehaus.plexus.classworlds.launcher.Launcher.mainWithExitCode (Launcher.java:406)
           at org.codehaus.plexus.classworlds.launcher.Launcher.main (Launcher.java:347)
       Caused by: org.apache.maven.plugin.compiler.CompilationFailureException: Compilation failure
           at org.apache.maven.plugin.compiler.AbstractCompilerMojo.execute (AbstractCompilerMojo.java:1192)
           at org.apache.maven.plugin.compiler.CompilerMojo.execute (CompilerMojo.java:188)
           at org.apache.maven.plugin.DefaultBuildPluginManager.executeMojo (DefaultBuildPluginManager.java:137)
           at org.apache.maven.lifecycle.internal.MojoExecutor.execute (MojoExecutor.java:210)
           at org.apache.maven.lifecycle.internal.MojoExecutor.execute (MojoExecutor.java:156)
           at org.apache.maven.lifecycle.internal.MojoExecutor.execute (MojoExecutor.java:148)
           at org.apache.maven.lifecycle.internal.LifecycleModuleBuilder.buildProject (LifecycleModuleBuilder.java:117)
           at org.apache.maven.lifecycle.internal.LifecycleModuleBuilder.buildProject (LifecycleModuleBuilder.java:81)
           at org.apache.maven.lifecycle.internal.builder.singlethreaded.SingleThreadedBuilder.build (SingleThreadedBuilder.java:56)
           at org.apache.maven.lifecycle.internal.LifecycleStarter.execute (LifecycleStarter.java:128)
           at org.apache.maven.DefaultMaven.doExecute (DefaultMaven.java:305)
           at org.apache.maven.DefaultMaven.doExecute (DefaultMaven.java:192)
           at org.apache.maven.DefaultMaven.execute (DefaultMaven.java:105)
           at org.apache.maven.cli.MavenCli.execute (MavenCli.java:956)
           at org.apache.maven.cli.MavenCli.doMain (MavenCli.java:288)
           at org.apache.maven.cli.MavenCli.main (MavenCli.java:192)
           at jdk.internal.reflect.NativeMethodAccessorImpl.invoke0 (Native Method)
           at jdk.internal.reflect.NativeMethodAccessorImpl.invoke (NativeMethodAccessorImpl.java:62)
           at jdk.internal.reflect.DelegatingMethodAccessorImpl.invoke (DelegatingMethodAccessorImpl.java:43)
           at java.lang.reflect.Method.invoke (Method.java:567)
           at org.codehaus.plexus.classworlds.launcher.Launcher.launchEnhanced (Launcher.java:282)
           at org.codehaus.plexus.classworlds.launcher.Launcher.launch (Launcher.java:225)
           at org.codehaus.plexus.classworlds.launcher.Launcher.mainWithExitCode (Launcher.java:406)
           at org.codehaus.plexus.classworlds.launcher.Launcher.main (Launcher.java:347)
       [ERROR]
       [ERROR]
       [ERROR] For more information about the errors and possible solutions, please read the following articles:
       [ERROR] [Help 1] http://cwiki.apache.org/confluence/display/MAVEN/MojoFailureException
       Running post-build script: f:\jenkins\jenkins-slave\workspace\en-compiler-plugin_MCOMPILER-320@2\windows-jdk14-m3.6.x_build\target\it\MCOMPILER-275_separate-moduleinfo\verify.groovy
[INFO] Building: MCOMPILER-284\pom.xml
[INFO] run post-build script verify.bsh
[INFO]           MCOMPILER-284\pom.xml ............................ SUCCESS (3.5 s)
[INFO] Building: MCOMPILER-294\pom.xml
[INFO]           MCOMPILER-294\pom.xml ............................ SUCCESS (4.2 s)
[INFO] Building: MCOMPILER-298\pom.xml
[INFO]           MCOMPILER-298\pom.xml ............................ SUCCESS (6.5 s)
[INFO] Building: MCOMPILER-320_mrjar\pom.xml
[withMaven] Publishers: Generated Artifacts Publisher: 11 ms, Junit Publisher: 78 ms, Open Task Scanner Publisher: 91 ms, Invoker Publisher: 20689 ms
[Pipeline] // withMaven
[Pipeline] cleanWs
[WS-CLEANUP] Deleting project workspace...
[WS-CLEANUP] Deferred wipeout is used...
[WS-CLEANUP] done
[Pipeline] cleanWs
[WS-CLEANUP] Deleting project workspace...
[WS-CLEANUP] Deferred wipeout is used...
[WS-CLEANUP] done
[Pipeline] }
[Pipeline] // stage
[Pipeline] }
[Pipeline] // ws
[Pipeline] }
[Pipeline] // node
[Pipeline] }
Failed in branch windows-jdk13-m3.6.x_build
[INFO] run post-build script verify.groovy
[INFO]           MCOMPILER-320_mrjar\pom.xml ...................... SUCCESS (15.3 s)
[INFO] Building: MCOMPILER-320_sunmisc\pom.xml
[INFO]           MCOMPILER-320_sunmisc\pom.xml .................... SUCCESS (4.5 s)
[INFO] Building: MCOMPILER-321_pathexceptions\pom.xml
[INFO] run post-build script verify.groovy
[INFO]           MCOMPILER-321_pathexceptions\pom.xml ............. SUCCESS (5.1 s)
[INFO] Building: MCOMPILER-322_release10\pom.xml
[INFO] run post-build script verify.groovy
[INFO]           MCOMPILER-322_release10\pom.xml .................. SUCCESS (4.6 s)
[INFO] Building: MCOMPILER-328_multiReleaseOutput\pom.xml
[INFO] run post-build script verify.groovy
[INFO]           MCOMPILER-328_multiReleaseOutput\pom.xml ......... SUCCESS (4.3 s)
[INFO] Building: MCOMPILER-336_incremental-modulepath\pom.xml
[INFO]           MCOMPILER-336_incremental-modulepath\pom.xml ..... SUCCESS (10.5 s)
[INFO] Building: multirelease-patterns\multimodule\pom.xml
[INFO] run post-build script verify.groovy
[INFO]           multirelease-patterns\multimodule\pom.xml ........ SUCCESS (18.4 s)
[INFO] Building: multirelease-patterns\multiproject\pom.xml
[INFO] run post-build script verify.groovy
[INFO]           multirelease-patterns\multiproject\pom.xml ....... SUCCESS (28.5 s)
[INFO] Building: multirelease-patterns\packaging-plugin\pom.xml
[INFO] run post-build script verify.groovy
[INFO]           multirelease-patterns\packaging-plugin\pom.xml ... SUCCESS (16.2 s)
[INFO] Building: multirelease-patterns\singleproject-runtime\pom.xml
[INFO] run post-build script verify.groovy
[INFO]           multirelease-patterns\singleproject-runtime\pom.xml SUCCESS (9.3 s)
[INFO] Building: non-english-warnings\pom.xml
[INFO] run post-build script verify.bsh
[INFO]           non-english-warnings\pom.xml ..................... SUCCESS (4.5 s)
[INFO] Building: test1\pom.xml
[INFO]           test1\pom.xml .................................... SUCCESS (4.8 s)
[INFO]
[INFO] --- maven-checkstyle-plugin:3.0.0:check (checkstyle-check) @ maven-compiler-plugin ---
[INFO] There are 2 errors reported by Checkstyle 6.18 with config/maven_checks.xml ruleset.
[INFO] Ignored 2 errors, 0 violation remaining.
[INFO]
[INFO] --- maven-invoker-plugin:3.0.1:verify (integration-test) @ maven-compiler-plugin ---
[INFO] -------------------------------------------------
[INFO] Build Summary:
[INFO]   Passed: 41, Failed: 11, Errors: 0, Skipped: 2
[INFO] -------------------------------------------------
[ERROR] The following builds failed:
[ERROR] *  error-prone-compiler\pom.xml
[ERROR] *  jdk16-annotation\pom.xml
[ERROR] *  mcompiler-120\pom.xml
[ERROR] *  mcompiler-135\pom.xml
[ERROR] *  MCOMPILER-157\pom.xml
[ERROR] *  mcompiler-179\pom.xml
[ERROR] *  MCOMPILER-203-processorpath\pom.xml
[ERROR] *  MCOMPILER-224\pom.xml
[ERROR] *  MCOMPILER-260_customArguments\pom.xml
[ERROR] *  MCOMPILER-270_release\pom.xml
[ERROR] *  MCOMPILER-275_separate-moduleinfo\pom.xml
[INFO] -------------------------------------------------
[INFO] ------------------------------------------------------------------------
[INFO] BUILD FAILURE
[INFO] ------------------------------------------------------------------------
[INFO] Total time:  06:59 min
[INFO] Finished at: 2019-10-04T04:35:17-07:00
[INFO] ------------------------------------------------------------------------
[INFO] [jenkins-event-spy] Generated F:\jenkins\jenkins-slave\workspace\en-compiler-plugin_MCOMPILER-320@2@tmp\withMavenaa060773\maven-spy-20191004-042817-1548192822527162796026.log
[ERROR] Failed to execute goal org.apache.maven.plugins:maven-invoker-plugin:3.0.1:verify (integration-test) on project maven-compiler-plugin: 11 builds failed. See console output above for details. -> [Help 1]
org.apache.maven.lifecycle.LifecycleExecutionException: Failed to execute goal org.apache.maven.plugins:maven-invoker-plugin:3.0.1:verify (integration-test) on project maven-compiler-plugin: 11 builds failed. See console output above for details.
    at org.apache.maven.lifecycle.internal.MojoExecutor.execute (MojoExecutor.java:215)
    at org.apache.maven.lifecycle.internal.MojoExecutor.execute (MojoExecutor.java:156)
    at org.apache.maven.lifecycle.internal.MojoExecutor.execute (MojoExecutor.java:148)
    at org.apache.maven.lifecycle.internal.LifecycleModuleBuilder.buildProject (LifecycleModuleBuilder.java:117)
    at org.apache.maven.lifecycle.internal.LifecycleModuleBuilder.buildProject (LifecycleModuleBuilder.java:81)
    at org.apache.maven.lifecycle.internal.builder.singlethreaded.SingleThreadedBuilder.build (SingleThreadedBuilder.java:56)
    at org.apache.maven.lifecycle.internal.LifecycleStarter.execute (LifecycleStarter.java:128)
    at org.apache.maven.DefaultMaven.doExecute (DefaultMaven.java:305)
    at org.apache.maven.DefaultMaven.doExecute (DefaultMaven.java:192)
    at org.apache.maven.DefaultMaven.execute (DefaultMaven.java:105)
    at org.apache.maven.cli.MavenCli.execute (MavenCli.java:956)
    at org.apache.maven.cli.MavenCli.doMain (MavenCli.java:288)
    at org.apache.maven.cli.MavenCli.main (MavenCli.java:192)
    at jdk.internal.reflect.NativeMethodAccessorImpl.invoke0 (Native Method)
    at jdk.internal.reflect.NativeMethodAccessorImpl.invoke (NativeMethodAccessorImpl.java:62)
    at jdk.internal.reflect.DelegatingMethodAccessorImpl.invoke (DelegatingMethodAccessorImpl.java:43)
    at java.lang.reflect.Method.invoke (Method.java:567)
    at org.codehaus.plexus.classworlds.launcher.Launcher.launchEnhanced (Launcher.java:282)
    at org.codehaus.plexus.classworlds.launcher.Launcher.launch (Launcher.java:225)
    at org.codehaus.plexus.classworlds.launcher.Launcher.mainWithExitCode (Launcher.java:406)
    at org.codehaus.plexus.classworlds.launcher.Launcher.main (Launcher.java:347)
Caused by: org.apache.maven.plugin.MojoFailureException: 11 builds failed. See console output above for details.
    at org.apache.maven.plugins.invoker.InvokerSession.handleFailures (InvokerSession.java:260)
    at org.apache.maven.plugins.invoker.VerifyMojo.execute (VerifyMojo.java:137)
    at org.apache.maven.plugin.DefaultBuildPluginManager.executeMojo (DefaultBuildPluginManager.java:137)
    at org.apache.maven.lifecycle.internal.MojoExecutor.execute (MojoExecutor.java:210)
    at org.apache.maven.lifecycle.internal.MojoExecutor.execute (MojoExecutor.java:156)
    at org.apache.maven.lifecycle.internal.MojoExecutor.execute (MojoExecutor.java:148)
    at org.apache.maven.lifecycle.internal.LifecycleModuleBuilder.buildProject (LifecycleModuleBuilder.java:117)
    at org.apache.maven.lifecycle.internal.LifecycleModuleBuilder.buildProject (LifecycleModuleBuilder.java:81)
    at org.apache.maven.lifecycle.internal.builder.singlethreaded.SingleThreadedBuilder.build (SingleThreadedBuilder.java:56)
    at org.apache.maven.lifecycle.internal.LifecycleStarter.execute (LifecycleStarter.java:128)
    at org.apache.maven.DefaultMaven.doExecute (DefaultMaven.java:305)
    at org.apache.maven.DefaultMaven.doExecute (DefaultMaven.java:192)
    at org.apache.maven.DefaultMaven.execute (DefaultMaven.java:105)
    at org.apache.maven.cli.MavenCli.execute (MavenCli.java:956)
    at org.apache.maven.cli.MavenCli.doMain (MavenCli.java:288)
    at org.apache.maven.cli.MavenCli.main (MavenCli.java:192)
    at jdk.internal.reflect.NativeMethodAccessorImpl.invoke0 (Native Method)
    at jdk.internal.reflect.NativeMethodAccessorImpl.invoke (NativeMethodAccessorImpl.java:62)
    at jdk.internal.reflect.DelegatingMethodAccessorImpl.invoke (DelegatingMethodAccessorImpl.java:43)
    at java.lang.reflect.Method.invoke (Method.java:567)
    at org.codehaus.plexus.classworlds.launcher.Launcher.launchEnhanced (Launcher.java:282)
    at org.codehaus.plexus.classworlds.launcher.Launcher.launch (Launcher.java:225)
    at org.codehaus.plexus.classworlds.launcher.Launcher.mainWithExitCode (Launcher.java:406)
    at org.codehaus.plexus.classworlds.launcher.Launcher.main (Launcher.java:347)
[ERROR]
[ERROR] Re-run Maven using the -X switch to enable full debug logging.
[ERROR]
[ERROR] For more information about the errors and possible solutions, please read the following articles:
[ERROR] [Help 1] http://cwiki.apache.org/confluence/display/MAVEN/MojoFailureException
[Pipeline] }
[Pipeline] // dir
[Pipeline] }
[withMaven] junitPublisher - Archive test results for Maven artifact org.apache.maven.plugins:maven-compiler-plugin:maven-plugin:3.7.1-SNAPSHOT generated by maven-surefire-plugin:test (default-test): windows-jdk14-m3.6.x_build\target\surefire-reports\*.xml
Recording test results
[withMaven] openTasksPublisher - Scan Tasks for Maven artifact org.apache.maven.plugins:maven-compiler-plugin:maven-plugin:3.7.1-SNAPSHOT in source directory windows-jdk14-m3.6.x_build\src\main\java
[TASKS] Scanning folder 'f:\jenkins\jenkins-slave\workspace\en-compiler-plugin_MCOMPILER-320@2' for files matching the pattern 'windows-jdk14-m3.6.x_build\src\main\java\**\*' - excludes: null
[TASKS] Found 9 files to scan for tasks
[TASKS] Found 6 open tasks.
Skipping warnings blame since pipelines do not have an SCM link.%n
[TASKS] Computing warning deltas based on reference build #23
[withMaven] invokerPublisher - Archive invoker results for Maven artifact MavenArtifact{org.apache.maven.plugins:maven-compiler-plugin:maven-plugin:3.7.1-SNAPSHOT(version: 3.7.1-SNAPSHOT, snapshot:false) } generated by PluginInvocation{org.apache.maven.plugins:maven-invoker-plugin:3.0.1@integration-test  integration-test}: windows-jdk14-m3.6.x_build\target\invoker-reports\*.xml
[withMaven] Publishers: Generated Artifacts Publisher: 11 ms, Junit Publisher: 106 ms, Open Task Scanner Publisher: 309 ms, Invoker Publisher: 26754 ms
[Pipeline] // withMaven
[Pipeline] cleanWs
[WS-CLEANUP] Deleting project workspace...
[WS-CLEANUP] Deferred wipeout is used...
[WS-CLEANUP] done
[Pipeline] cleanWs
[WS-CLEANUP] Deleting project workspace...
[WS-CLEANUP] Deferred wipeout is used...
[WS-CLEANUP] done
[Pipeline] }
[Pipeline] // stage
[Pipeline] }
[Pipeline] // ws
[Pipeline] }
[Pipeline] // node
[Pipeline] }
Failed in branch windows-jdk14-m3.6.x_build
[Pipeline] // parallel
[Pipeline] stage
[Pipeline] { (Notifications)
[Pipeline] echo
Build result: FAILURE
[Pipeline] jiraIssueSelector
[Pipeline] echo
The authors of changes [].
[Pipeline] echo
Sending email ...
[Pipeline] emailext
Reply | Threaded
Open this post in threaded view
|

Build failed in Jenkins: Maven TLP » maven-compiler-plugin » MCOMPILER-320 #47

Apache Jenkins Server-2
See https://builds.apache.org/job/maven-box/job/maven-compiler-plugin/job/MCOMPILER-320/47/

Changes:

* [INFRA-19273] Maven 3.6.0 dropped, update to 3.6.2

30 tests failed.
FAILED:  org.apache.maven.plugin.compiler.CompilerMojoTestCase.linux-jdk13-m3.6.x_build / Build linux-jdk13-m3.6.x_build / testCompilerBasic

Error Message:
Compilation failure

Stack Trace:
org.apache.maven.plugin.compiler.CompilationFailureException: Compilation failure
        at org.apache.maven.plugin.compiler.CompilerMojoTestCase.testCompilerBasic(CompilerMojoTestCase.java:82)


FAILED:  org.apache.maven.plugin.compiler.CompilerMojoTestCase.linux-jdk13-m3.6.x_build / Build linux-jdk13-m3.6.x_build / testCompilerIncludesExcludes

Error Message:
Compilation failure

Stack Trace:
org.apache.maven.plugin.compiler.CompilationFailureException: Compilation failure
        at org.apache.maven.plugin.compiler.CompilerMojoTestCase.testCompilerIncludesExcludes(CompilerMojoTestCase.java:149)


FAILED:  org.apache.maven.plugin.compiler.CompilerMojoTestCase.linux-jdk13-m3.6.x_build / Build linux-jdk13-m3.6.x_build / testCompileSkipMain

Error Message:
Compilation failure

Stack Trace:
org.apache.maven.plugin.compiler.CompilationFailureException: Compilation failure
        at org.apache.maven.plugin.compiler.CompilerMojoTestCase.testCompileSkipMain(CompilerMojoTestCase.java:335)


FAILED:  org.apache.maven.plugin.compiler.CompilerMojoTestCase.linux-jdk13-m3.6.x_build / Build linux-jdk13-m3.6.x_build / testCompileSkipTest

Error Message:
Compilation failure

Stack Trace:
org.apache.maven.plugin.compiler.CompilationFailureException: Compilation failure
        at org.apache.maven.plugin.compiler.CompilerMojoTestCase.testCompileSkipTest(CompilerMojoTestCase.java:349)


FAILED:  org.apache.maven.plugin.compiler.CompilerMojoTestCase.linux-jdk13-m3.6.x_build / Build linux-jdk13-m3.6.x_build / testCompilerFork

Error Message:
Compilation failure

Stack Trace:
org.apache.maven.plugin.compiler.CompilationFailureException: Compilation failure
        at org.apache.maven.plugin.compiler.CompilerMojoTestCase.testCompilerFork(CompilerMojoTestCase.java:191)


FAILED:  org.apache.maven.plugin.compiler.CompilerMojoTestCase.linux-jdk11-m3.6.x_build / Build linux-jdk11-m3.6.x_build / testCompilerBasic

Error Message:
Compilation failure

Stack Trace:
org.apache.maven.plugin.compiler.CompilationFailureException: Compilation failure
        at org.apache.maven.plugin.compiler.CompilerMojoTestCase.testCompilerBasic(CompilerMojoTestCase.java:82)


FAILED:  org.apache.maven.plugin.compiler.CompilerMojoTestCase.linux-jdk11-m3.6.x_build / Build linux-jdk11-m3.6.x_build / testCompilerIncludesExcludes

Error Message:
Compilation failure

Stack Trace:
org.apache.maven.plugin.compiler.CompilationFailureException: Compilation failure
        at org.apache.maven.plugin.compiler.CompilerMojoTestCase.testCompilerIncludesExcludes(CompilerMojoTestCase.java:149)


FAILED:  org.apache.maven.plugin.compiler.CompilerMojoTestCase.linux-jdk11-m3.6.x_build / Build linux-jdk11-m3.6.x_build / testCompileSkipMain

Error Message:
Compilation failure

Stack Trace:
org.apache.maven.plugin.compiler.CompilationFailureException: Compilation failure
        at org.apache.maven.plugin.compiler.CompilerMojoTestCase.testCompileSkipMain(CompilerMojoTestCase.java:335)


FAILED:  org.apache.maven.plugin.compiler.CompilerMojoTestCase.linux-jdk11-m3.6.x_build / Build linux-jdk11-m3.6.x_build / testCompileSkipTest

Error Message:
Compilation failure

Stack Trace:
org.apache.maven.plugin.compiler.CompilationFailureException: Compilation failure
        at org.apache.maven.plugin.compiler.CompilerMojoTestCase.testCompileSkipTest(CompilerMojoTestCase.java:349)


FAILED:  org.apache.maven.plugin.compiler.CompilerMojoTestCase.linux-jdk11-m3.6.x_build / Build linux-jdk11-m3.6.x_build / testCompilerFork

Error Message:
Compilation failure

Stack Trace:
org.apache.maven.plugin.compiler.CompilationFailureException: Compilation failure
        at org.apache.maven.plugin.compiler.CompilerMojoTestCase.testCompilerFork(CompilerMojoTestCase.java:191)


FAILED:  org.apache.maven.plugin.compiler.CompilerMojoTestCase.linux-jdk14-m3.6.x_build / Build linux-jdk14-m3.6.x_build / testCompilerBasic

Error Message:
Compilation failure

Stack Trace:
org.apache.maven.plugin.compiler.CompilationFailureException: Compilation failure
        at org.apache.maven.plugin.compiler.CompilerMojoTestCase.testCompilerBasic(CompilerMojoTestCase.java:82)


FAILED:  org.apache.maven.plugin.compiler.CompilerMojoTestCase.linux-jdk14-m3.6.x_build / Build linux-jdk14-m3.6.x_build / testCompilerIncludesExcludes

Error Message:
Compilation failure

Stack Trace:
org.apache.maven.plugin.compiler.CompilationFailureException: Compilation failure
        at org.apache.maven.plugin.compiler.CompilerMojoTestCase.testCompilerIncludesExcludes(CompilerMojoTestCase.java:149)


FAILED:  org.apache.maven.plugin.compiler.CompilerMojoTestCase.linux-jdk14-m3.6.x_build / Build linux-jdk14-m3.6.x_build / testCompileSkipMain

Error Message:
Compilation failure

Stack Trace:
org.apache.maven.plugin.compiler.CompilationFailureException: Compilation failure
        at org.apache.maven.plugin.compiler.CompilerMojoTestCase.testCompileSkipMain(CompilerMojoTestCase.java:335)


FAILED:  org.apache.maven.plugin.compiler.CompilerMojoTestCase.linux-jdk14-m3.6.x_build / Build linux-jdk14-m3.6.x_build / testCompileSkipTest

Error Message:
Compilation failure

Stack Trace:
org.apache.maven.plugin.compiler.CompilationFailureException: Compilation failure
        at org.apache.maven.plugin.compiler.CompilerMojoTestCase.testCompileSkipTest(CompilerMojoTestCase.java:349)


FAILED:  org.apache.maven.plugin.compiler.CompilerMojoTestCase.linux-jdk14-m3.6.x_build / Build linux-jdk14-m3.6.x_build / testCompilerFork

Error Message:
Compilation failure

Stack Trace:
org.apache.maven.plugin.compiler.CompilationFailureException: Compilation failure
        at org.apache.maven.plugin.compiler.CompilerMojoTestCase.testCompilerFork(CompilerMojoTestCase.java:191)


FAILED:  org.apache.maven.plugin.compiler.CompilerMojoTestCase.windows-jdk11-m3.6.x_build / Build windows-jdk11-m3.6.x_build / testCompilerBasic

Error Message:
Compilation failure

Stack Trace:
org.apache.maven.plugin.compiler.CompilationFailureException: Compilation failure
        at org.apache.maven.plugin.compiler.CompilerMojoTestCase.testCompilerBasic(CompilerMojoTestCase.java:82)


FAILED:  org.apache.maven.plugin.compiler.CompilerMojoTestCase.windows-jdk11-m3.6.x_build / Build windows-jdk11-m3.6.x_build / testCompilerIncludesExcludes

Error Message:
Compilation failure

Stack Trace:
org.apache.maven.plugin.compiler.CompilationFailureException: Compilation failure
        at org.apache.maven.plugin.compiler.CompilerMojoTestCase.testCompilerIncludesExcludes(CompilerMojoTestCase.java:149)


FAILED:  org.apache.maven.plugin.compiler.CompilerMojoTestCase.windows-jdk11-m3.6.x_build / Build windows-jdk11-m3.6.x_build / testCompileSkipMain

Error Message:
Compilation failure

Stack Trace:
org.apache.maven.plugin.compiler.CompilationFailureException: Compilation failure
        at org.apache.maven.plugin.compiler.CompilerMojoTestCase.testCompileSkipMain(CompilerMojoTestCase.java:335)


FAILED:  org.apache.maven.plugin.compiler.CompilerMojoTestCase.windows-jdk11-m3.6.x_build / Build windows-jdk11-m3.6.x_build / testCompileSkipTest

Error Message:
Compilation failure

Stack Trace:
org.apache.maven.plugin.compiler.CompilationFailureException: Compilation failure
        at org.apache.maven.plugin.compiler.CompilerMojoTestCase.testCompileSkipTest(CompilerMojoTestCase.java:349)


FAILED:  org.apache.maven.plugin.compiler.CompilerMojoTestCase.windows-jdk11-m3.6.x_build / Build windows-jdk11-m3.6.x_build / testCompilerFork

Error Message:
Compilation failure

Stack Trace:
org.apache.maven.plugin.compiler.CompilationFailureException: Compilation failure
        at org.apache.maven.plugin.compiler.CompilerMojoTestCase.testCompilerFork(CompilerMojoTestCase.java:191)


FAILED:  org.apache.maven.plugin.compiler.CompilerMojoTestCase.windows-jdk13-m3.6.x_build / Build windows-jdk13-m3.6.x_build / testCompilerBasic

Error Message:
Compilation failure

Stack Trace:
org.apache.maven.plugin.compiler.CompilationFailureException: Compilation failure
        at org.apache.maven.plugin.compiler.CompilerMojoTestCase.testCompilerBasic(CompilerMojoTestCase.java:82)


FAILED:  org.apache.maven.plugin.compiler.CompilerMojoTestCase.windows-jdk13-m3.6.x_build / Build windows-jdk13-m3.6.x_build / testCompilerIncludesExcludes

Error Message:
Compilation failure

Stack Trace:
org.apache.maven.plugin.compiler.CompilationFailureException: Compilation failure
        at org.apache.maven.plugin.compiler.CompilerMojoTestCase.testCompilerIncludesExcludes(CompilerMojoTestCase.java:149)


FAILED:  org.apache.maven.plugin.compiler.CompilerMojoTestCase.windows-jdk13-m3.6.x_build / Build windows-jdk13-m3.6.x_build / testCompileSkipMain

Error Message:
Compilation failure

Stack Trace:
org.apache.maven.plugin.compiler.CompilationFailureException: Compilation failure
        at org.apache.maven.plugin.compiler.CompilerMojoTestCase.testCompileSkipMain(CompilerMojoTestCase.java:335)


FAILED:  org.apache.maven.plugin.compiler.CompilerMojoTestCase.windows-jdk13-m3.6.x_build / Build windows-jdk13-m3.6.x_build / testCompileSkipTest

Error Message:
Compilation failure

Stack Trace:
org.apache.maven.plugin.compiler.CompilationFailureException: Compilation failure
        at org.apache.maven.plugin.compiler.CompilerMojoTestCase.testCompileSkipTest(CompilerMojoTestCase.java:349)


FAILED:  org.apache.maven.plugin.compiler.CompilerMojoTestCase.windows-jdk13-m3.6.x_build / Build windows-jdk13-m3.6.x_build / testCompilerFork

Error Message:
Compilation failure

Stack Trace:
org.apache.maven.plugin.compiler.CompilationFailureException: Compilation failure
        at org.apache.maven.plugin.compiler.CompilerMojoTestCase.testCompilerFork(CompilerMojoTestCase.java:191)


FAILED:  org.apache.maven.plugin.compiler.CompilerMojoTestCase.windows-jdk14-m3.6.x_build / Build windows-jdk14-m3.6.x_build / testCompilerBasic

Error Message:
Compilation failure

Stack Trace:
org.apache.maven.plugin.compiler.CompilationFailureException: Compilation failure
        at org.apache.maven.plugin.compiler.CompilerMojoTestCase.testCompilerBasic(CompilerMojoTestCase.java:82)


FAILED:  org.apache.maven.plugin.compiler.CompilerMojoTestCase.windows-jdk14-m3.6.x_build / Build windows-jdk14-m3.6.x_build / testCompilerIncludesExcludes

Error Message:
Compilation failure

Stack Trace:
org.apache.maven.plugin.compiler.CompilationFailureException: Compilation failure
        at org.apache.maven.plugin.compiler.CompilerMojoTestCase.testCompilerIncludesExcludes(CompilerMojoTestCase.java:149)


FAILED:  org.apache.maven.plugin.compiler.CompilerMojoTestCase.windows-jdk14-m3.6.x_build / Build windows-jdk14-m3.6.x_build / testCompileSkipMain

Error Message:
Compilation failure

Stack Trace:
org.apache.maven.plugin.compiler.CompilationFailureException: Compilation failure
        at org.apache.maven.plugin.compiler.CompilerMojoTestCase.testCompileSkipMain(CompilerMojoTestCase.java:335)


FAILED:  org.apache.maven.plugin.compiler.CompilerMojoTestCase.windows-jdk14-m3.6.x_build / Build windows-jdk14-m3.6.x_build / testCompileSkipTest

Error Message:
Compilation failure

Stack Trace:
org.apache.maven.plugin.compiler.CompilationFailureException: Compilation failure
        at org.apache.maven.plugin.compiler.CompilerMojoTestCase.testCompileSkipTest(CompilerMojoTestCase.java:349)


FAILED:  org.apache.maven.plugin.compiler.CompilerMojoTestCase.windows-jdk14-m3.6.x_build / Build windows-jdk14-m3.6.x_build / testCompilerFork

Error Message:
Compilation failure

Stack Trace:
org.apache.maven.plugin.compiler.CompilationFailureException: Compilation failure
        at org.apache.maven.plugin.compiler.CompilerMojoTestCase.testCompilerFork(CompilerMojoTestCase.java:191)




Build log:
[...truncated 24140 lines...]
[INFO] Building: multirelease-patterns\multiproject\pom.xml
[INFO] There are 2 errors reported by Checkstyle 6.18 with config/maven_checks.xml ruleset.
[INFO] Ignored 2 errors, 0 violation remaining.
[INFO]
[INFO] --- maven-invoker-plugin:3.0.1:verify (integration-test) @ maven-compiler-plugin ---
[INFO] -------------------------------------------------
[INFO] Build Summary:
[INFO]   Passed: 41, Failed: 11, Errors: 0, Skipped: 2
[INFO] -------------------------------------------------
[ERROR] The following builds failed:
[ERROR] *  error-prone-compiler\pom.xml
[ERROR] *  jdk16-annotation\pom.xml
[ERROR] *  mcompiler-120\pom.xml
[ERROR] *  mcompiler-135\pom.xml
[ERROR] *  MCOMPILER-157\pom.xml
[ERROR] *  mcompiler-179\pom.xml
[ERROR] *  MCOMPILER-203-processorpath\pom.xml
[ERROR] *  MCOMPILER-224\pom.xml
[ERROR] *  MCOMPILER-260_customArguments\pom.xml
[ERROR] *  MCOMPILER-270_release\pom.xml
[ERROR] *  MCOMPILER-275_separate-moduleinfo\pom.xml
[INFO] -------------------------------------------------
[INFO] ------------------------------------------------------------------------
[INFO] BUILD FAILURE
[INFO] ------------------------------------------------------------------------
[INFO] Total time:  07:00 min
[INFO] Finished at: 2019-10-26T14:22:20-07:00
[INFO] ------------------------------------------------------------------------
[INFO] [jenkins-event-spy] Generated F:\jenkins\jenkins-slave\workspace\en-compiler-plugin_MCOMPILER-320@2@tmp\withMavenc152f5d5\maven-spy-20191026-141520-4413806505911309439008.log
[ERROR] Failed to execute goal org.apache.maven.plugins:maven-invoker-plugin:3.0.1:verify (integration-test) on project maven-compiler-plugin: 11 builds failed. See console output above for details. -> [Help 1]
org.apache.maven.lifecycle.LifecycleExecutionException: Failed to execute goal org.apache.maven.plugins:maven-invoker-plugin:3.0.1:verify (integration-test) on project maven-compiler-plugin: 11 builds failed. See console output above for details.
    at org.apache.maven.lifecycle.internal.MojoExecutor.execute (MojoExecutor.java:215)
    at org.apache.maven.lifecycle.internal.MojoExecutor.execute (MojoExecutor.java:156)
    at org.apache.maven.lifecycle.internal.MojoExecutor.execute (MojoExecutor.java:148)
    at org.apache.maven.lifecycle.internal.LifecycleModuleBuilder.buildProject (LifecycleModuleBuilder.java:117)
    at org.apache.maven.lifecycle.internal.LifecycleModuleBuilder.buildProject (LifecycleModuleBuilder.java:81)
    at org.apache.maven.lifecycle.internal.builder.singlethreaded.SingleThreadedBuilder.build (SingleThreadedBuilder.java:56)
    at org.apache.maven.lifecycle.internal.LifecycleStarter.execute (LifecycleStarter.java:128)
    at org.apache.maven.DefaultMaven.doExecute (DefaultMaven.java:305)
    at org.apache.maven.DefaultMaven.doExecute (DefaultMaven.java:192)
    at org.apache.maven.DefaultMaven.execute (DefaultMaven.java:105)
    at org.apache.maven.cli.MavenCli.execute (MavenCli.java:956)
    at org.apache.maven.cli.MavenCli.doMain (MavenCli.java:288)
    at org.apache.maven.cli.MavenCli.main (MavenCli.java:192)
    at jdk.internal.reflect.NativeMethodAccessorImpl.invoke0 (Native Method)
    at jdk.internal.reflect.NativeMethodAccessorImpl.invoke (NativeMethodAccessorImpl.java:62)
    at jdk.internal.reflect.DelegatingMethodAccessorImpl.invoke (DelegatingMethodAccessorImpl.java:43)
    at java.lang.reflect.Method.invoke (Method.java:567)
    at org.codehaus.plexus.classworlds.launcher.Launcher.launchEnhanced (Launcher.java:282)
    at org.codehaus.plexus.classworlds.launcher.Launcher.launch (Launcher.java:225)
    at org.codehaus.plexus.classworlds.launcher.Launcher.mainWithExitCode (Launcher.java:406)
    at org.codehaus.plexus.classworlds.launcher.Launcher.main (Launcher.java:347)
Caused by: org.apache.maven.plugin.MojoFailureException: 11 builds failed. See console output above for details.
    at org.apache.maven.plugins.invoker.InvokerSession.handleFailures (InvokerSession.java:260)
    at org.apache.maven.plugins.invoker.VerifyMojo.execute (VerifyMojo.java:137)
    at org.apache.maven.plugin.DefaultBuildPluginManager.executeMojo (DefaultBuildPluginManager.java:137)
    at org.apache.maven.lifecycle.internal.MojoExecutor.execute (MojoExecutor.java:210)
    at org.apache.maven.lifecycle.internal.MojoExecutor.execute (MojoExecutor.java:156)
    at org.apache.maven.lifecycle.internal.MojoExecutor.execute (MojoExecutor.java:148)
    at org.apache.maven.lifecycle.internal.LifecycleModuleBuilder.buildProject (LifecycleModuleBuilder.java:117)
    at org.apache.maven.lifecycle.internal.LifecycleModuleBuilder.buildProject (LifecycleModuleBuilder.java:81)
    at org.apache.maven.lifecycle.internal.builder.singlethreaded.SingleThreadedBuilder.build (SingleThreadedBuilder.java:56)
    at org.apache.maven.lifecycle.internal.LifecycleStarter.execute (LifecycleStarter.java:128)
    at org.apache.maven.DefaultMaven.doExecute (DefaultMaven.java:305)
    at org.apache.maven.DefaultMaven.doExecute (DefaultMaven.java:192)
    at org.apache.maven.DefaultMaven.execute (DefaultMaven.java:105)
    at org.apache.maven.cli.MavenCli.execute (MavenCli.java:956)
    at org.apache.maven.cli.MavenCli.doMain (MavenCli.java:288)
    at org.apache.maven.cli.MavenCli.main (MavenCli.java:192)
    at jdk.internal.reflect.NativeMethodAccessorImpl.invoke0 (Native Method)
    at jdk.internal.reflect.NativeMethodAccessorImpl.invoke (NativeMethodAccessorImpl.java:62)
    at jdk.internal.reflect.DelegatingMethodAccessorImpl.invoke (DelegatingMethodAccessorImpl.java:43)
    at java.lang.reflect.Method.invoke (Method.java:567)
    at org.codehaus.plexus.classworlds.launcher.Launcher.launchEnhanced (Launcher.java:282)
    at org.codehaus.plexus.classworlds.launcher.Launcher.launch (Launcher.java:225)
    at org.codehaus.plexus.classworlds.launcher.Launcher.mainWithExitCode (Launcher.java:406)
    at org.codehaus.plexus.classworlds.launcher.Launcher.main (Launcher.java:347)
[ERROR]
[ERROR] Re-run Maven using the -X switch to enable full debug logging.
[ERROR]
[ERROR] For more information about the errors and possible solutions, please read the following articles:
[ERROR] [Help 1] http://cwiki.apache.org/confluence/display/MAVEN/MojoFailureException
[Pipeline] }
[Pipeline] // dir
[Pipeline] }
[withMaven] junitPublisher - Archive test results for Maven artifact org.apache.maven.plugins:maven-compiler-plugin:maven-plugin:3.7.1-SNAPSHOT generated by maven-surefire-plugin:test (default-test): windows-jdk13-m3.6.x_build\target\surefire-reports\*.xml
Recording test results
[withMaven] openTasksPublisher - Scan Tasks for Maven artifact org.apache.maven.plugins:maven-compiler-plugin:maven-plugin:3.7.1-SNAPSHOT in source directory windows-jdk13-m3.6.x_build\src\main\java
[TASKS] Scanning folder 'f:\jenkins\jenkins-slave\workspace\en-compiler-plugin_MCOMPILER-320@2' for files matching the pattern 'windows-jdk13-m3.6.x_build\src\main\java\**\*' - excludes: null
[TASKS] Found 9 files to scan for tasks
[TASKS] Found 6 open tasks.
Skipping warnings blame since pipelines do not have an SCM link.%n
[TASKS] Computing warning deltas based on reference build #23
[withMaven] invokerPublisher - Archive invoker results for Maven artifact MavenArtifact{org.apache.maven.plugins:maven-compiler-plugin:maven-plugin:3.7.1-SNAPSHOT(version: 3.7.1-SNAPSHOT, snapshot:false) } generated by PluginInvocation{org.apache.maven.plugins:maven-invoker-plugin:3.0.1@integration-test  integration-test}: windows-jdk13-m3.6.x_build\target\invoker-reports\*.xml
[withMaven] Publishers: Generated Artifacts Publisher: 10 ms, Junit Publisher: 54 ms, Open Task Scanner Publisher: 83 ms, Invoker Publisher: 19289 ms
[Pipeline] // withMaven
[Pipeline] cleanWs
[WS-CLEANUP] Deleting project workspace...
[WS-CLEANUP] Deferred wipeout is used...
[WS-CLEANUP] done
[Pipeline] cleanWs
[WS-CLEANUP] Deleting project workspace...
[WS-CLEANUP] Deferred wipeout is used...
[WS-CLEANUP] done
[Pipeline] }
[Pipeline] // stage
[Pipeline] }
[Pipeline] // ws
[Pipeline] }
[Pipeline] // node
[Pipeline] }
Failed in branch windows-jdk13-m3.6.x_build
[INFO] run post-build script verify.groovy
[INFO]           multirelease-patterns\multiproject\pom.xml ....... SUCCESS (28.0 s)
[INFO] Building: multirelease-patterns\packaging-plugin\pom.xml
[INFO] run post-build script verify.groovy
[INFO]           multirelease-patterns\packaging-plugin\pom.xml ... SUCCESS (16.5 s)
[INFO] Building: multirelease-patterns\singleproject-runtime\pom.xml
[INFO] run post-build script verify.groovy
[INFO]           multirelease-patterns\singleproject-runtime\pom.xml SUCCESS (11.6 s)
[INFO] Building: non-english-warnings\pom.xml
[INFO] run post-build script verify.bsh
[INFO]           non-english-warnings\pom.xml ..................... SUCCESS (5.4 s)
[INFO] Building: test1\pom.xml
[INFO]           test1\pom.xml .................................... SUCCESS (5.1 s)
[INFO]
[INFO] --- maven-checkstyle-plugin:3.0.0:check (checkstyle-check) @ maven-compiler-plugin ---
[INFO] There are 2 errors reported by Checkstyle 6.18 with config/maven_checks.xml ruleset.
[INFO] Ignored 2 errors, 0 violation remaining.
[INFO]
[INFO] --- maven-invoker-plugin:3.0.1:verify (integration-test) @ maven-compiler-plugin ---
[INFO] -------------------------------------------------
[INFO] Build Summary:
[INFO]   Passed: 41, Failed: 11, Errors: 0, Skipped: 2
[INFO] -------------------------------------------------
[ERROR] The following builds failed:
[ERROR] *  error-prone-compiler\pom.xml
[ERROR] *  jdk16-annotation\pom.xml
[ERROR] *  mcompiler-120\pom.xml
[ERROR] *  mcompiler-135\pom.xml
[ERROR] *  MCOMPILER-157\pom.xml
[ERROR] *  mcompiler-179\pom.xml
[ERROR] *  MCOMPILER-203-processorpath\pom.xml
[ERROR] *  MCOMPILER-224\pom.xml
[ERROR] *  MCOMPILER-260_customArguments\pom.xml
[ERROR] *  MCOMPILER-270_release\pom.xml
[ERROR] *  MCOMPILER-275_separate-moduleinfo\pom.xml
[INFO] -------------------------------------------------
[INFO] ------------------------------------------------------------------------
[INFO] BUILD FAILURE
[INFO] ------------------------------------------------------------------------
[INFO] Total time:  06:46 min
[INFO] Finished at: 2019-10-26T14:23:27-07:00
[INFO] ------------------------------------------------------------------------
[INFO] [jenkins-event-spy] Generated F:\jenkins\jenkins-slave\workspace\en-compiler-plugin_MCOMPILER-320@2@tmp\withMaven1c3341a6\maven-spy-20191026-141640-6655141676492779592778.log
[ERROR] Failed to execute goal org.apache.maven.plugins:maven-invoker-plugin:3.0.1:verify (integration-test) on project maven-compiler-plugin: 11 builds failed. See console output above for details. -> [Help 1]
org.apache.maven.lifecycle.LifecycleExecutionException: Failed to execute goal org.apache.maven.plugins:maven-invoker-plugin:3.0.1:verify (integration-test) on project maven-compiler-plugin: 11 builds failed. See console output above for details.
    at org.apache.maven.lifecycle.internal.MojoExecutor.execute (MojoExecutor.java:215)
    at org.apache.maven.lifecycle.internal.MojoExecutor.execute (MojoExecutor.java:156)
    at org.apache.maven.lifecycle.internal.MojoExecutor.execute (MojoExecutor.java:148)
    at org.apache.maven.lifecycle.internal.LifecycleModuleBuilder.buildProject (LifecycleModuleBuilder.java:117)
    at org.apache.maven.lifecycle.internal.LifecycleModuleBuilder.buildProject (LifecycleModuleBuilder.java:81)
    at org.apache.maven.lifecycle.internal.builder.singlethreaded.SingleThreadedBuilder.build (SingleThreadedBuilder.java:56)
    at org.apache.maven.lifecycle.internal.LifecycleStarter.execute (LifecycleStarter.java:128)
    at org.apache.maven.DefaultMaven.doExecute (DefaultMaven.java:305)
    at org.apache.maven.DefaultMaven.doExecute (DefaultMaven.java:192)
    at org.apache.maven.DefaultMaven.execute (DefaultMaven.java:105)
    at org.apache.maven.cli.MavenCli.execute (MavenCli.java:956)
    at org.apache.maven.cli.MavenCli.doMain (MavenCli.java:288)
    at org.apache.maven.cli.MavenCli.main (MavenCli.java:192)
    at jdk.internal.reflect.NativeMethodAccessorImpl.invoke0 (Native Method)
    at jdk.internal.reflect.NativeMethodAccessorImpl.invoke (NativeMethodAccessorImpl.java:62)
    at jdk.internal.reflect.DelegatingMethodAccessorImpl.invoke (DelegatingMethodAccessorImpl.java:43)
    at java.lang.reflect.Method.invoke (Method.java:567)
    at org.codehaus.plexus.classworlds.launcher.Launcher.launchEnhanced (Launcher.java:282)
    at org.codehaus.plexus.classworlds.launcher.Launcher.launch (Launcher.java:225)
    at org.codehaus.plexus.classworlds.launcher.Launcher.mainWithExitCode (Launcher.java:406)
    at org.codehaus.plexus.classworlds.launcher.Launcher.main (Launcher.java:347)
Caused by: org.apache.maven.plugin.MojoFailureException: 11 builds failed. See console output above for details.
    at org.apache.maven.plugins.invoker.InvokerSession.handleFailures (InvokerSession.java:260)
    at org.apache.maven.plugins.invoker.VerifyMojo.execute (VerifyMojo.java:137)
    at org.apache.maven.plugin.DefaultBuildPluginManager.executeMojo (DefaultBuildPluginManager.java:137)
    at org.apache.maven.lifecycle.internal.MojoExecutor.execute (MojoExecutor.java:210)
    at org.apache.maven.lifecycle.internal.MojoExecutor.execute (MojoExecutor.java:156)
    at org.apache.maven.lifecycle.internal.MojoExecutor.execute (MojoExecutor.java:148)
    at org.apache.maven.lifecycle.internal.LifecycleModuleBuilder.buildProject (LifecycleModuleBuilder.java:117)
    at org.apache.maven.lifecycle.internal.LifecycleModuleBuilder.buildProject (LifecycleModuleBuilder.java:81)
    at org.apache.maven.lifecycle.internal.builder.singlethreaded.SingleThreadedBuilder.build (SingleThreadedBuilder.java:56)
    at org.apache.maven.lifecycle.internal.LifecycleStarter.execute (LifecycleStarter.java:128)
    at org.apache.maven.DefaultMaven.doExecute (DefaultMaven.java:305)
    at org.apache.maven.DefaultMaven.doExecute (DefaultMaven.java:192)
    at org.apache.maven.DefaultMaven.execute (DefaultMaven.java:105)
    at org.apache.maven.cli.MavenCli.execute (MavenCli.java:956)
    at org.apache.maven.cli.MavenCli.doMain (MavenCli.java:288)
    at org.apache.maven.cli.MavenCli.main (MavenCli.java:192)
    at jdk.internal.reflect.NativeMethodAccessorImpl.invoke0 (Native Method)
    at jdk.internal.reflect.NativeMethodAccessorImpl.invoke (NativeMethodAccessorImpl.java:62)
    at jdk.internal.reflect.DelegatingMethodAccessorImpl.invoke (DelegatingMethodAccessorImpl.java:43)
    at java.lang.reflect.Method.invoke (Method.java:567)
    at org.codehaus.plexus.classworlds.launcher.Launcher.launchEnhanced (Launcher.java:282)
    at org.codehaus.plexus.classworlds.launcher.Launcher.launch (Launcher.java:225)
    at org.codehaus.plexus.classworlds.launcher.Launcher.mainWithExitCode (Launcher.java:406)
    at org.codehaus.plexus.classworlds.launcher.Launcher.main (Launcher.java:347)
[ERROR]
[ERROR] Re-run Maven using the -X switch to enable full debug logging.
[ERROR]
[ERROR] For more information about the errors and possible solutions, please read the following articles:
[ERROR] [Help 1] http://cwiki.apache.org/confluence/display/MAVEN/MojoFailureException
[Pipeline] }
[Pipeline] // dir
[Pipeline] }
[withMaven] junitPublisher - Archive test results for Maven artifact org.apache.maven.plugins:maven-compiler-plugin:maven-plugin:3.7.1-SNAPSHOT generated by maven-surefire-plugin:test (default-test): windows-jdk14-m3.6.x_build\target\surefire-reports\*.xml
Recording test results
[withMaven] openTasksPublisher - Scan Tasks for Maven artifact org.apache.maven.plugins:maven-compiler-plugin:maven-plugin:3.7.1-SNAPSHOT in source directory windows-jdk14-m3.6.x_build\src\main\java
[TASKS] Scanning folder 'f:\jenkins\jenkins-slave\workspace\en-compiler-plugin_MCOMPILER-320@2' for files matching the pattern 'windows-jdk14-m3.6.x_build\src\main\java\**\*' - excludes: null
[TASKS] Found 9 files to scan for tasks
[TASKS] Found 6 open tasks.
Skipping warnings blame since pipelines do not have an SCM link.%n
[TASKS] Computing warning deltas based on reference build #23
[withMaven] invokerPublisher - Archive invoker results for Maven artifact MavenArtifact{org.apache.maven.plugins:maven-compiler-plugin:maven-plugin:3.7.1-SNAPSHOT(version: 3.7.1-SNAPSHOT, snapshot:false) } generated by PluginInvocation{org.apache.maven.plugins:maven-invoker-plugin:3.0.1@integration-test  integration-test}: windows-jdk14-m3.6.x_build\target\invoker-reports\*.xml
[withMaven] Publishers: Generated Artifacts Publisher: 10 ms, Junit Publisher: 56 ms, Open Task Scanner Publisher: 70 ms, Invoker Publisher: 25271 ms
[Pipeline] // withMaven
[Pipeline] cleanWs
[WS-CLEANUP] Deleting project workspace...
[WS-CLEANUP] Deferred wipeout is used...
[WS-CLEANUP] done
[Pipeline] cleanWs
[WS-CLEANUP] Deleting project workspace...
[WS-CLEANUP] Deferred wipeout is used...
[WS-CLEANUP] done
[Pipeline] }
[Pipeline] // stage
[Pipeline] }
[Pipeline] // ws
[Pipeline] }
[Pipeline] // node
[Pipeline] }
Failed in branch windows-jdk14-m3.6.x_build
[Pipeline] // parallel
[Pipeline] stage
[Pipeline] { (Notifications)
[Pipeline] echo
Build result: FAILURE
[Pipeline] jiraIssueSelector
[Pipeline] echo
The authors of changes [rfscholte].
[Pipeline] echo
Sending email ...
[Pipeline] emailext
Reply | Threaded
Open this post in threaded view
|

Build failed in Jenkins: Maven TLP » maven-compiler-plugin » MCOMPILER-320 #48

Apache Jenkins Server-2
See https://builds.apache.org/job/maven-box/job/maven-compiler-plugin/job/MCOMPILER-320/48/

Changes:

* echo NODE_NAME

12 tests failed.
FAILED:  org.apache.maven.plugin.compiler.CompilerMojoTestCase.linux-jdk13-m3.6.x_build / Build linux-jdk13-m3.6.x_build / testCompilerBasic

Error Message:
Compilation failure

Stack Trace:
org.apache.maven.plugin.compiler.CompilationFailureException: Compilation failure
        at org.apache.maven.plugin.compiler.CompilerMojoTestCase.testCompilerBasic(CompilerMojoTestCase.java:99)


FAILED:  org.apache.maven.plugin.compiler.CompilerMojoTestCase.linux-jdk13-m3.6.x_build / Build linux-jdk13-m3.6.x_build / testCompilerIncludesExcludes

Error Message:
Compilation failure

Stack Trace:
org.apache.maven.plugin.compiler.CompilationFailureException: Compilation failure
        at org.apache.maven.plugin.compiler.CompilerMojoTestCase.testCompilerIncludesExcludes(CompilerMojoTestCase.java:190)


FAILED:  org.apache.maven.plugin.compiler.CompilerMojoTestCase.linux-jdk13-m3.6.x_build / Build linux-jdk13-m3.6.x_build / testCompilerFork

Error Message:
Compilation failure

Stack Trace:
org.apache.maven.plugin.compiler.CompilationFailureException: Compilation failure
        at org.apache.maven.plugin.compiler.CompilerMojoTestCase.testCompilerFork(CompilerMojoTestCase.java:226)


FAILED:  org.apache.maven.plugin.compiler.CompilerMojoTestCase.linux-jdk14-m3.6.x_build / Build linux-jdk14-m3.6.x_build / testCompilerBasic

Error Message:
Compilation failure

Stack Trace:
org.apache.maven.plugin.compiler.CompilationFailureException: Compilation failure
        at org.apache.maven.plugin.compiler.CompilerMojoTestCase.testCompilerBasic(CompilerMojoTestCase.java:99)


FAILED:  org.apache.maven.plugin.compiler.CompilerMojoTestCase.linux-jdk14-m3.6.x_build / Build linux-jdk14-m3.6.x_build / testCompilerIncludesExcludes

Error Message:
Compilation failure

Stack Trace:
org.apache.maven.plugin.compiler.CompilationFailureException: Compilation failure
        at org.apache.maven.plugin.compiler.CompilerMojoTestCase.testCompilerIncludesExcludes(CompilerMojoTestCase.java:190)


FAILED:  org.apache.maven.plugin.compiler.CompilerMojoTestCase.linux-jdk14-m3.6.x_build / Build linux-jdk14-m3.6.x_build / testCompilerFork

Error Message:
Compilation failure

Stack Trace:
org.apache.maven.plugin.compiler.CompilationFailureException: Compilation failure
        at org.apache.maven.plugin.compiler.CompilerMojoTestCase.testCompilerFork(CompilerMojoTestCase.java:226)


FAILED:  org.apache.maven.plugin.compiler.CompilerMojoTestCase.windows-jdk13-m3.6.x_build / Build windows-jdk13-m3.6.x_build / testCompilerBasic

Error Message:
Compilation failure

Stack Trace:
org.apache.maven.plugin.compiler.CompilationFailureException: Compilation failure
        at org.apache.maven.plugin.compiler.CompilerMojoTestCase.testCompilerBasic(CompilerMojoTestCase.java:99)


FAILED:  org.apache.maven.plugin.compiler.CompilerMojoTestCase.windows-jdk13-m3.6.x_build / Build windows-jdk13-m3.6.x_build / testCompilerIncludesExcludes

Error Message:
Compilation failure

Stack Trace:
org.apache.maven.plugin.compiler.CompilationFailureException: Compilation failure
        at org.apache.maven.plugin.compiler.CompilerMojoTestCase.testCompilerIncludesExcludes(CompilerMojoTestCase.java:190)


FAILED:  org.apache.maven.plugin.compiler.CompilerMojoTestCase.windows-jdk13-m3.6.x_build / Build windows-jdk13-m3.6.x_build / testCompilerFork

Error Message:
Compilation failure

Stack Trace:
org.apache.maven.plugin.compiler.CompilationFailureException: Compilation failure
        at org.apache.maven.plugin.compiler.CompilerMojoTestCase.testCompilerFork(CompilerMojoTestCase.java:226)


FAILED:  org.apache.maven.plugin.compiler.CompilerMojoTestCase.windows-jdk14-m3.6.x_build / Build windows-jdk14-m3.6.x_build / testCompilerBasic

Error Message:
Compilation failure

Stack Trace:
org.apache.maven.plugin.compiler.CompilationFailureException: Compilation failure
        at org.apache.maven.plugin.compiler.CompilerMojoTestCase.testCompilerBasic(CompilerMojoTestCase.java:99)


FAILED:  org.apache.maven.plugin.compiler.CompilerMojoTestCase.windows-jdk14-m3.6.x_build / Build windows-jdk14-m3.6.x_build / testCompilerIncludesExcludes

Error Message:
Compilation failure

Stack Trace:
org.apache.maven.plugin.compiler.CompilationFailureException: Compilation failure
        at org.apache.maven.plugin.compiler.CompilerMojoTestCase.testCompilerIncludesExcludes(CompilerMojoTestCase.java:190)


FAILED:  org.apache.maven.plugin.compiler.CompilerMojoTestCase.windows-jdk14-m3.6.x_build / Build windows-jdk14-m3.6.x_build / testCompilerFork

Error Message:
Compilation failure

Stack Trace:
org.apache.maven.plugin.compiler.CompilationFailureException: Compilation failure
        at org.apache.maven.plugin.compiler.CompilerMojoTestCase.testCompilerFork(CompilerMojoTestCase.java:226)




Build log:
[...truncated 12147 lines...]
[INFO] [jenkins-event-spy] Generated F:\jenkins\jenkins-slave\workspace\en-compiler-plugin_MCOMPILER-320@3@2@tmp\withMavened4ca942\maven-spy-20191102-025554-21515705293457049074790.log
[ERROR] Failed to execute goal org.apache.maven.plugins:maven-invoker-plugin:3.2.0:verify (integration-test) on project maven-compiler-plugin: 2 builds failed. See console output above for details. -> [Help 1]
org.apache.maven.lifecycle.LifecycleExecutionException: Failed to execute goal org.apache.maven.plugins:maven-invoker-plugin:3.2.0:verify (integration-test) on project maven-compiler-plugin: 2 builds failed. See console output above for details.
    at org.apache.maven.lifecycle.internal.MojoExecutor.execute (MojoExecutor.java:215)
    at org.apache.maven.lifecycle.internal.MojoExecutor.execute (MojoExecutor.java:156)
    at org.apache.maven.lifecycle.internal.MojoExecutor.execute (MojoExecutor.java:148)
    at org.apache.maven.lifecycle.internal.LifecycleModuleBuilder.buildProject (LifecycleModuleBuilder.java:117)
    at org.apache.maven.lifecycle.internal.LifecycleModuleBuilder.buildProject (LifecycleModuleBuilder.java:81)
    at org.apache.maven.lifecycle.internal.builder.singlethreaded.SingleThreadedBuilder.build (SingleThreadedBuilder.java:56)
    at org.apache.maven.lifecycle.internal.LifecycleStarter.execute (LifecycleStarter.java:128)
    at org.apache.maven.DefaultMaven.doExecute (DefaultMaven.java:305)
    at org.apache.maven.DefaultMaven.doExecute (DefaultMaven.java:192)
    at org.apache.maven.DefaultMaven.execute (DefaultMaven.java:105)
    at org.apache.maven.cli.MavenCli.execute (MavenCli.java:956)
    at org.apache.maven.cli.MavenCli.doMain (MavenCli.java:288)
    at org.apache.maven.cli.MavenCli.main (MavenCli.java:192)
    at jdk.internal.reflect.NativeMethodAccessorImpl.invoke0 (Native Method)
    at jdk.internal.reflect.NativeMethodAccessorImpl.invoke (NativeMethodAccessorImpl.java:62)
    at jdk.internal.reflect.DelegatingMethodAccessorImpl.invoke (DelegatingMethodAccessorImpl.java:43)
    at java.lang.reflect.Method.invoke (Method.java:567)
    at org.codehaus.plexus.classworlds.launcher.Launcher.launchEnhanced (Launcher.java:282)
    at org.codehaus.plexus.classworlds.launcher.Launcher.launch (Launcher.java:225)
    at org.codehaus.plexus.classworlds.launcher.Launcher.mainWithExitCode (Launcher.java:406)
    at org.codehaus.plexus.classworlds.launcher.Launcher.main (Launcher.java:347)
Caused by: org.apache.maven.plugin.MojoFailureException: 2 builds failed. See console output above for details.
    at org.apache.maven.plugins.invoker.InvokerSession.handleFailures (InvokerSession.java:260)
    at org.apache.maven.plugins.invoker.VerifyMojo.execute (VerifyMojo.java:140)
    at org.apache.maven.plugin.DefaultBuildPluginManager.executeMojo (DefaultBuildPluginManager.java:137)
    at org.apache.maven.lifecycle.internal.MojoExecutor.execute (MojoExecutor.java:210)
    at org.apache.maven.lifecycle.internal.MojoExecutor.execute (MojoExecutor.java:156)
    at org.apache.maven.lifecycle.internal.MojoExecutor.execute (MojoExecutor.java:148)
    at org.apache.maven.lifecycle.internal.LifecycleModuleBuilder.buildProject (LifecycleModuleBuilder.java:117)
    at org.apache.maven.lifecycle.internal.LifecycleModuleBuilder.buildProject (LifecycleModuleBuilder.java:81)
    at org.apache.maven.lifecycle.internal.builder.singlethreaded.SingleThreadedBuilder.build (SingleThreadedBuilder.java:56)
    at org.apache.maven.lifecycle.internal.LifecycleStarter.execute (LifecycleStarter.java:128)
    at org.apache.maven.DefaultMaven.doExecute (DefaultMaven.java:305)
    at org.apache.maven.DefaultMaven.doExecute (DefaultMaven.java:192)
    at org.apache.maven.DefaultMaven.execute (DefaultMaven.java:105)
    at org.apache.maven.cli.MavenCli.execute (MavenCli.java:956)
    at org.apache.maven.cli.MavenCli.doMain (MavenCli.java:288)
    at org.apache.maven.cli.MavenCli.main (MavenCli.java:192)
    at jdk.internal.reflect.NativeMethodAccessorImpl.invoke0 (Native Method)
    at jdk.internal.reflect.NativeMethodAccessorImpl.invoke (NativeMethodAccessorImpl.java:62)
    at jdk.internal.reflect.DelegatingMethodAccessorImpl.invoke (DelegatingMethodAccessorImpl.java:43)
    at java.lang.reflect.Method.invoke (Method.java:567)
    at org.codehaus.plexus.classworlds.launcher.Launcher.launchEnhanced (Launcher.java:282)
    at org.codehaus.plexus.classworlds.launcher.Launcher.launch (Launcher.java:225)
    at org.codehaus.plexus.classworlds.launcher.Launcher.mainWithExitCode (Launcher.java:406)
    at org.codehaus.plexus.classworlds.launcher.Launcher.main (Launcher.java:347)
[ERROR]
[ERROR] Re-run Maven using the -X switch to enable full debug logging.
[ERROR]
[ERROR] For more information about the errors and possible solutions, please read the following articles:
[ERROR] [Help 1] http://cwiki.apache.org/confluence/display/MAVEN/MojoFailureException
[Pipeline] }
[Pipeline] // dir
[Pipeline] }
[Pipeline] }
[Pipeline] // dir
[Pipeline] }
[withMaven] junitPublisher - Archive test results for Maven artifact org.apache.maven.plugins:maven-compiler-plugin:maven-plugin:3.8.2-SNAPSHOT generated by maven-surefire-plugin:test (default-test): windows-jdk13-m3.6.x_build\target\surefire-reports\*.xml
Recording test results
[INFO]           MCOMPILER-379\pom.xml ............................ SUCCESS (4.1 s)
[INFO] Building: multirelease-patterns\multimodule\pom.xml
[withMaven] openTasksPublisher - Scan Tasks for Maven artifact org.apache.maven.plugins:maven-compiler-plugin:maven-plugin:3.8.2-SNAPSHOT in source directory windows-jdk13-m3.6.x_build\src\main\java
[withMaven] junitPublisher - Archive test results for Maven artifact org.apache.maven.plugins:maven-compiler-plugin:maven-plugin:3.8.2-SNAPSHOT generated by maven-surefire-plugin:test (default-test): windows-jdk11-m3.6.x_build\target\surefire-reports\*.xml
Recording test results
[TASKS] Scanning folder 'f:\jenkins\jenkins-slave\workspace\en-compiler-plugin_MCOMPILER-320@3@2' for files matching the pattern 'windows-jdk13-m3.6.x_build\src\main\java\**\*' - excludes: null
[TASKS] Found 9 files to scan for tasks
[TASKS] Found 6 open tasks.
Skipping warnings blame since pipelines do not have an SCM link.%n
[withMaven] openTasksPublisher - Scan Tasks for Maven artifact org.apache.maven.plugins:maven-compiler-plugin:maven-plugin:3.8.2-SNAPSHOT in source directory windows-jdk11-m3.6.x_build\src\main\java
[TASKS] Computing warning deltas based on reference build #23
[TASKS] Scanning folder 'f:\jenkins\jenkins-slave\workspace\en-compiler-plugin_MCOMPILER-320@2' for files matching the pattern 'windows-jdk11-m3.6.x_build\src\main\java\**\*' - excludes: null
[TASKS] Found 9 files to scan for tasks
[TASKS] Found 6 open tasks.
Skipping warnings blame since pipelines do not have an SCM link.%n
[withMaven] invokerPublisher - Archive invoker results for Maven artifact MavenArtifact{org.apache.maven.plugins:maven-compiler-plugin:maven-plugin:3.8.2-SNAPSHOT(version: 3.8.2-SNAPSHOT, snapshot:false) } generated by PluginInvocation{org.apache.maven.plugins:maven-invoker-plugin:3.2.0@integration-test  integration-test}: windows-jdk13-m3.6.x_build\target\invoker-reports\*.xml
[TASKS] Computing warning deltas based on reference build #23
[withMaven] invokerPublisher - Archive invoker results for Maven artifact MavenArtifact{org.apache.maven.plugins:maven-compiler-plugin:maven-plugin:3.8.2-SNAPSHOT(version: 3.8.2-SNAPSHOT, snapshot:false) } generated by PluginInvocation{org.apache.maven.plugins:maven-invoker-plugin:3.2.0@integration-test  integration-test}: windows-jdk11-m3.6.x_build\target\invoker-reports\*.xml
[INFO] run post-build script verify.groovy
[INFO]   The post-build script did not succeed. f:\jenkins\jenkins-slave\workspace\en-compiler-plugin_MCOMPILER-320@3@2\windows-jdk14-m3.6.x_build\target\it\multirelease-patterns\multimodule\multirelease\target\multirelease-1.0.0-SNAPSHOT.jar
[INFO]           multirelease-patterns\multimodule\pom.xml ........ FAILED (8.7 s)
[INFO] Building: multirelease-patterns\multiproject\pom.xml
[INFO] run post-build script verify.groovy
[INFO]   The post-build script did not succeed. base should be built twice. Expression: (2 == log.text.count([INFO] Building Base 1.0.0-SNAPSHOT))
[INFO]           multirelease-patterns\multiproject\pom.xml ....... FAILED (14.5 s)
[INFO] Building: multirelease-patterns\packaging-plugin\pom.xml
[withMaven] Publishers: Generated Artifacts Publisher: 12 ms, Junit Publisher: 60 ms, Open Task Scanner Publisher: 94 ms, Invoker Publisher: 24820 ms
[withMaven] Publishers: Generated Artifacts Publisher: 56 ms, Junit Publisher: 48 ms, Open Task Scanner Publisher: 79 ms, Invoker Publisher: 25080 ms
[Pipeline] // withMaven
[Pipeline] // withMaven
[Pipeline] cleanWs
[Pipeline] cleanWs
[WS-CLEANUP] Deleting project workspace...
[WS-CLEANUP] Deferred wipeout is used...
[WS-CLEANUP] Deleting project workspace...
[WS-CLEANUP] Deferred wipeout is used...
[WS-CLEANUP] done
[Pipeline] cleanWs
[WS-CLEANUP] done
[WS-CLEANUP] Deleting project workspace...
[WS-CLEANUP] Deferred wipeout is used...
[WS-CLEANUP] done
[Pipeline] cleanWs
[WS-CLEANUP] Deleting project workspace...
[WS-CLEANUP] Deferred wipeout is used...
[Pipeline] }
[WS-CLEANUP] done
[Pipeline] // stage
[Pipeline] }
[Pipeline] }
[Pipeline] // ws
[Pipeline] // stage
[Pipeline] }
[Pipeline] }
[Pipeline] // node
[Pipeline] // ws
[Pipeline] }
Failed in branch windows-jdk11-m3.6.x_build
[Pipeline] }
[Pipeline] // node
[Pipeline] }
Failed in branch windows-jdk13-m3.6.x_build
[INFO] run post-build script verify.groovy
[INFO]           multirelease-patterns\packaging-plugin\pom.xml ... SUCCESS (16.5 s)
[INFO] Building: multirelease-patterns\singleproject-runtime\pom.xml
[INFO] run post-build script verify.groovy
[INFO]           multirelease-patterns\singleproject-runtime\pom.xml SUCCESS (8.5 s)
[INFO] Building: non-english-warnings\pom.xml
[INFO] run post-build script verify.bsh
[INFO]           non-english-warnings\pom.xml ..................... SUCCESS (4.2 s)
[INFO] Building: test1\pom.xml
[INFO]           test1\pom.xml .................................... SUCCESS (3.8 s)
[INFO]
[INFO] --- maven-checkstyle-plugin:3.0.0:check (checkstyle-check) @ maven-compiler-plugin ---
[INFO] There are 2 errors reported by Checkstyle 6.18 with config/maven_checks.xml ruleset.
[INFO] Ignored 2 errors, 0 violation remaining.
[INFO]
[INFO] --- maven-invoker-plugin:3.2.0:verify (integration-test) @ maven-compiler-plugin ---
[INFO] -------------------------------------------------
[INFO] Build Summary:
[INFO]   Passed: 49, Failed: 2, Errors: 0, Skipped: 4
[INFO] -------------------------------------------------
[ERROR] The following builds failed:
[ERROR] *  multirelease-patterns\multimodule\pom.xml
[ERROR] *  multirelease-patterns\multiproject\pom.xml
[INFO] -------------------------------------------------
[INFO] ------------------------------------------------------------------------
[INFO] BUILD FAILURE
[INFO] ------------------------------------------------------------------------
[INFO] Total time:  07:25 min
[INFO] Finished at: 2019-11-02T03:04:21-07:00
[INFO] ------------------------------------------------------------------------
[INFO] [jenkins-event-spy] Generated F:\jenkins\jenkins-slave\workspace\en-compiler-plugin_MCOMPILER-320@3@2@tmp\withMavenff0f6239\maven-spy-20191102-025655-4216959829039555884840.log
[ERROR] Failed to execute goal org.apache.maven.plugins:maven-invoker-plugin:3.2.0:verify (integration-test) on project maven-compiler-plugin: 2 builds failed. See console output above for details. -> [Help 1]
org.apache.maven.lifecycle.LifecycleExecutionException: Failed to execute goal org.apache.maven.plugins:maven-invoker-plugin:3.2.0:verify (integration-test) on project maven-compiler-plugin: 2 builds failed. See console output above for details.
    at org.apache.maven.lifecycle.internal.MojoExecutor.execute (MojoExecutor.java:215)
    at org.apache.maven.lifecycle.internal.MojoExecutor.execute (MojoExecutor.java:156)
    at org.apache.maven.lifecycle.internal.MojoExecutor.execute (MojoExecutor.java:148)
    at org.apache.maven.lifecycle.internal.LifecycleModuleBuilder.buildProject (LifecycleModuleBuilder.java:117)
    at org.apache.maven.lifecycle.internal.LifecycleModuleBuilder.buildProject (LifecycleModuleBuilder.java:81)
    at org.apache.maven.lifecycle.internal.builder.singlethreaded.SingleThreadedBuilder.build (SingleThreadedBuilder.java:56)
    at org.apache.maven.lifecycle.internal.LifecycleStarter.execute (LifecycleStarter.java:128)
    at org.apache.maven.DefaultMaven.doExecute (DefaultMaven.java:305)
    at org.apache.maven.DefaultMaven.doExecute (DefaultMaven.java:192)
    at org.apache.maven.DefaultMaven.execute (DefaultMaven.java:105)
    at org.apache.maven.cli.MavenCli.execute (MavenCli.java:956)
    at org.apache.maven.cli.MavenCli.doMain (MavenCli.java:288)
    at org.apache.maven.cli.MavenCli.main (MavenCli.java:192)
    at jdk.internal.reflect.NativeMethodAccessorImpl.invoke0 (Native Method)
    at jdk.internal.reflect.NativeMethodAccessorImpl.invoke (NativeMethodAccessorImpl.java:62)
    at jdk.internal.reflect.DelegatingMethodAccessorImpl.invoke (DelegatingMethodAccessorImpl.java:43)
    at java.lang.reflect.Method.invoke (Method.java:567)
    at org.codehaus.plexus.classworlds.launcher.Launcher.launchEnhanced (Launcher.java:282)
    at org.codehaus.plexus.classworlds.launcher.Launcher.launch (Launcher.java:225)
    at org.codehaus.plexus.classworlds.launcher.Launcher.mainWithExitCode (Launcher.java:406)
    at org.codehaus.plexus.classworlds.launcher.Launcher.main (Launcher.java:347)
Caused by: org.apache.maven.plugin.MojoFailureException: 2 builds failed. See console output above for details.
    at org.apache.maven.plugins.invoker.InvokerSession.handleFailures (InvokerSession.java:260)
    at org.apache.maven.plugins.invoker.VerifyMojo.execute (VerifyMojo.java:140)
    at org.apache.maven.plugin.DefaultBuildPluginManager.executeMojo (DefaultBuildPluginManager.java:137)
    at org.apache.maven.lifecycle.internal.MojoExecutor.execute (MojoExecutor.java:210)
    at org.apache.maven.lifecycle.internal.MojoExecutor.execute (MojoExecutor.java:156)
    at org.apache.maven.lifecycle.internal.MojoExecutor.execute (MojoExecutor.java:148)
    at org.apache.maven.lifecycle.internal.LifecycleModuleBuilder.buildProject (LifecycleModuleBuilder.java:117)
    at org.apache.maven.lifecycle.internal.LifecycleModuleBuilder.buildProject (LifecycleModuleBuilder.java:81)
    at org.apache.maven.lifecycle.internal.builder.singlethreaded.SingleThreadedBuilder.build (SingleThreadedBuilder.java:56)
    at org.apache.maven.lifecycle.internal.LifecycleStarter.execute (LifecycleStarter.java:128)
    at org.apache.maven.DefaultMaven.doExecute (DefaultMaven.java:305)
    at org.apache.maven.DefaultMaven.doExecute (DefaultMaven.java:192)
    at org.apache.maven.DefaultMaven.execute (DefaultMaven.java:105)
    at org.apache.maven.cli.MavenCli.execute (MavenCli.java:956)
    at org.apache.maven.cli.MavenCli.doMain (MavenCli.java:288)
    at org.apache.maven.cli.MavenCli.main (MavenCli.java:192)
    at jdk.internal.reflect.NativeMethodAccessorImpl.invoke0 (Native Method)
    at jdk.internal.reflect.NativeMethodAccessorImpl.invoke (NativeMethodAccessorImpl.java:62)
    at jdk.internal.reflect.DelegatingMethodAccessorImpl.invoke (DelegatingMethodAccessorImpl.java:43)
    at java.lang.reflect.Method.invoke (Method.java:567)
    at org.codehaus.plexus.classworlds.launcher.Launcher.launchEnhanced (Launcher.java:282)
    at org.codehaus.plexus.classworlds.launcher.Launcher.launch (Launcher.java:225)
    at org.codehaus.plexus.classworlds.launcher.Launcher.mainWithExitCode (Launcher.java:406)
    at org.codehaus.plexus.classworlds.launcher.Launcher.main (Launcher.java:347)
[ERROR]
[ERROR] Re-run Maven using the -X switch to enable full debug logging.
[ERROR]
[ERROR] For more information about the errors and possible solutions, please read the following articles:
[ERROR] [Help 1] http://cwiki.apache.org/confluence/display/MAVEN/MojoFailureException
[Pipeline] }
[Pipeline] // dir
[Pipeline] }
[withMaven] junitPublisher - Archive test results for Maven artifact org.apache.maven.plugins:maven-compiler-plugin:maven-plugin:3.8.2-SNAPSHOT generated by maven-surefire-plugin:test (default-test): windows-jdk14-m3.6.x_build\target\surefire-reports\*.xml
Recording test results
[withMaven] openTasksPublisher - Scan Tasks for Maven artifact org.apache.maven.plugins:maven-compiler-plugin:maven-plugin:3.8.2-SNAPSHOT in source directory windows-jdk14-m3.6.x_build\src\main\java
[TASKS] Scanning folder 'f:\jenkins\jenkins-slave\workspace\en-compiler-plugin_MCOMPILER-320@3@2' for files matching the pattern 'windows-jdk14-m3.6.x_build\src\main\java\**\*' - excludes: null
[TASKS] Found 9 files to scan for tasks
[TASKS] Found 6 open tasks.
Skipping warnings blame since pipelines do not have an SCM link.%n
[TASKS] Computing warning deltas based on reference build #23
[withMaven] invokerPublisher - Archive invoker results for Maven artifact MavenArtifact{org.apache.maven.plugins:maven-compiler-plugin:maven-plugin:3.8.2-SNAPSHOT(version: 3.8.2-SNAPSHOT, snapshot:false) } generated by PluginInvocation{org.apache.maven.plugins:maven-invoker-plugin:3.2.0@integration-test  integration-test}: windows-jdk14-m3.6.x_build\target\invoker-reports\*.xml
[withMaven] Publishers: Generated Artifacts Publisher: 10 ms, Junit Publisher: 57 ms, Open Task Scanner Publisher: 86 ms, Invoker Publisher: 22689 ms
[Pipeline] // withMaven
[Pipeline] cleanWs
[WS-CLEANUP] Deleting project workspace...
[WS-CLEANUP] Deferred wipeout is used...
[WS-CLEANUP] done
[Pipeline] cleanWs
[WS-CLEANUP] Deleting project workspace...
[WS-CLEANUP] Deferred wipeout is used...
[WS-CLEANUP] done
[Pipeline] }
[Pipeline] // stage
[Pipeline] }
[Pipeline] // ws
[Pipeline] }
[Pipeline] // node
[Pipeline] }
Failed in branch windows-jdk14-m3.6.x_build
[Pipeline] // parallel
[Pipeline] stage
[Pipeline] { (Notifications)
[Pipeline] echo
Build result: FAILURE
[Pipeline] jiraIssueSelector
[Pipeline] echo
The authors of changes [hboutemy].
[Pipeline] echo
Sending email ...
[Pipeline] emailext