Build failed in Jenkins: Maven TLP » maven-checkstyle-plugin » MCHECKSTYLE-353 #8

classic Classic list List threaded Threaded
2 messages Options
Reply | Threaded
Open this post in threaded view
|

Build failed in Jenkins: Maven TLP » maven-checkstyle-plugin » MCHECKSTYLE-353 #8

Apache Jenkins Server-2
See https://builds.apache.org/job/maven-box/job/maven-checkstyle-plugin/job/MCHECKSTYLE-353/8/

No changes.

All tests passed

Build log:
[...truncated 3798 lines...]
[INFO] Building: multi-modules-aggregate\pom.xml
[INFO] run post-build script verify.groovy
[INFO]           MCHECKSTYLE-70-multi-sourcefolder\pom.xml ........ SUCCESS (12.5 s)
[INFO] Building: minimal-pom\pom.xml
[INFO] run post-build script verify.groovy
[INFO]           multi-modules-aggregate\pom.xml .................. SUCCESS (8.5 s)
[INFO] Building: multimoduleproject\pom.xml
[INFO] run post-build script verify.groovy
[INFO]           MCHECKSTYLE-70-multi-sourcefolder\pom.xml ........ SUCCESS (12.1 s)
[INFO] Building: minimal-pom\pom.xml
[INFO] run post-build script verify.bsh
[INFO]           minimal-pom\pom.xml .............................. SUCCESS (13.9 s)
[INFO] Building: multi-modules\pom.xml
[INFO]           multimoduleproject\pom.xml ....................... SUCCESS (7.2 s)
[INFO]
[INFO] --- maven-checkstyle-plugin:3.0.0:check (checkstyle-check) @ maven-checkstyle-plugin ---
[INFO] There is 1 error reported by Checkstyle 6.18 with config/maven_checks.xml ruleset.
[INFO] Ignored 1 error, 0 violation remaining.
[INFO]
[INFO] --- maven-invoker-plugin:3.1.0:verify (integration-test) @ maven-checkstyle-plugin ---
[INFO] -------------------------------------------------
[INFO] Build Summary:
[INFO]   Passed: 44, Failed: 0, Errors: 0, Skipped: 0
[INFO] -------------------------------------------------
[INFO] ------------------------------------------------------------------------
[INFO] BUILD SUCCESS
[INFO] ------------------------------------------------------------------------
[INFO] Total time: 07:55 min
[INFO] Finished at: 2019-02-02T00:59:33-08:00
[INFO] Final Memory: 47M/164M
[INFO] ------------------------------------------------------------------------
[INFO] [jenkins-event-spy] Generated F:\jenkins\jenkins-slave\workspace\heckstyle-plugin_MCHECKSTYLE-353@2@tmp\withMavenedb9a662\maven-spy-20190202-005137-4396193013376556105785.log
[Pipeline] }
[Pipeline] // dir
[Pipeline] }
[withMaven] artifactsPublisher - Archive artifact windows-jdk11-m3.5.x_build\pom.xml under org\apache\maven\plugins\maven-checkstyle-plugin\3.0.1-SNAPSHOT\maven-checkstyle-plugin-3.0.1-SNAPSHOT.pom
[withMaven] artifactsPublisher - Archive artifact windows-jdk11-m3.5.x_build\target\maven-checkstyle-plugin-3.0.1-SNAPSHOT.jar under org\apache\maven\plugins\maven-checkstyle-plugin\3.0.1-SNAPSHOT\maven-checkstyle-plugin-3.0.1-SNAPSHOT.jar
[withMaven] junitPublisher - Archive test results for Maven artifact org.apache.maven.plugins:maven-checkstyle-plugin:maven-plugin:3.0.1-SNAPSHOT generated by maven-surefire-plugin:test (default-test): windows-jdk11-m3.5.x_build\target\surefire-reports\*.xml
Recording test results
[withMaven] openTasksPublisher - Scan Tasks for Maven artifact org.apache.maven.plugins:maven-checkstyle-plugin:maven-plugin:3.0.1-SNAPSHOT in source directory windows-jdk11-m3.5.x_build\src\main\java
[TASKS] Scanning folder 'f:\jenkins\jenkins-slave\workspace\heckstyle-plugin_MCHECKSTYLE-353@2' for files matching the pattern 'windows-jdk11-m3.5.x_build\src\main\java\**\*' - excludes: null
[TASKS] Found 20 files to scan for tasks
[TASKS] Found 5 open tasks.
Skipping warnings blame since pipelines do not have an SCM link.%n
[TASKS] Computing warning deltas based on reference build #7
[withMaven] Publishers: Generated Artifacts Publisher: 146 ms, Junit Publisher: 374 ms, Open Task Scanner Publisher: 201 ms, Pipeline Graph Publisher: 2 ms
[Pipeline] // withMaven
[Pipeline] cleanWs
[WS-CLEANUP] Deleting project workspace...
[WS-CLEANUP] Deferred wipeout is used...
[WS-CLEANUP] done
[Pipeline] }
[Pipeline] // stage
[Pipeline] }
[Pipeline] // ws
[Pipeline] }
[Pipeline] // node
[Pipeline] }
[INFO] run post-build script verify.bsh
[INFO]           minimal-pom\pom.xml .............................. SUCCESS (13.8 s)
[INFO] Building: multi-modules\pom.xml
[INFO]           multi-modules\pom.xml ............................ SUCCESS (15.2 s)
[INFO] Building: multi-modules-aggregate\pom.xml
[INFO]           multi-modules\pom.xml ............................ SUCCESS (15.8 s)
[INFO] Building: multi-modules-aggregate\pom.xml
[INFO] run post-build script verify.groovy
[INFO]           multi-modules-aggregate\pom.xml .................. SUCCESS (11.0 s)
[INFO] Building: multimoduleproject\pom.xml
[INFO] run post-build script verify.groovy
[INFO]           multi-modules-aggregate\pom.xml .................. SUCCESS (11.6 s)
[INFO] Building: multimoduleproject\pom.xml
[INFO]           multimoduleproject\pom.xml ....................... SUCCESS (11.2 s)
[INFO]
[INFO] --- maven-checkstyle-plugin:3.0.0:check (checkstyle-check) @ maven-checkstyle-plugin ---
[INFO] There is 1 error reported by Checkstyle 6.18 with config/maven_checks.xml ruleset.
[INFO] Ignored 1 error, 0 violation remaining.
[INFO]
[INFO] --- maven-invoker-plugin:3.1.0:verify (integration-test) @ maven-checkstyle-plugin ---
[INFO] -------------------------------------------------
[INFO] Build Summary:
[INFO]   Passed: 41, Failed: 1, Errors: 0, Skipped: 2
[INFO] -------------------------------------------------
[ERROR] The following builds failed:
[ERROR] *  MCHECKSTYLE-163\pom.xml
[INFO] -------------------------------------------------
[INFO] ------------------------------------------------------------------------
[INFO] BUILD FAILURE
[INFO] ------------------------------------------------------------------------
[INFO] Total time: 08:46 min
[INFO] Finished at: 2019-02-02T01:00:10-08:00
[INFO] Final Memory: 55M/1011M
[INFO] ------------------------------------------------------------------------
[INFO] [jenkins-event-spy] Generated F:\jenkins\jenkins-slave\workspace\heckstyle-plugin_MCHECKSTYLE-353@2@tmp\withMaven98fae78d\maven-spy-20190202-005123-2071255485690310231086.log
[ERROR] Failed to execute goal org.apache.maven.plugins:maven-invoker-plugin:3.1.0:verify (integration-test) on project maven-checkstyle-plugin: 1 build failed. See console output above for details. -> [Help 1]
org.apache.maven.lifecycle.LifecycleExecutionException: Failed to execute goal org.apache.maven.plugins:maven-invoker-plugin:3.1.0:verify (integration-test) on project maven-checkstyle-plugin: 1 build failed. See console output above for details.
        at org.apache.maven.lifecycle.internal.MojoExecutor.execute(MojoExecutor.java:212)
        at org.apache.maven.lifecycle.internal.MojoExecutor.execute(MojoExecutor.java:153)
        at org.apache.maven.lifecycle.internal.MojoExecutor.execute(MojoExecutor.java:145)
        at org.apache.maven.lifecycle.internal.LifecycleModuleBuilder.buildProject(LifecycleModuleBuilder.java:116)
        at org.apache.maven.lifecycle.internal.LifecycleModuleBuilder.buildProject(LifecycleModuleBuilder.java:80)
        at org.apache.maven.lifecycle.internal.builder.singlethreaded.SingleThreadedBuilder.build(SingleThreadedBuilder.java:51)
        at org.apache.maven.lifecycle.internal.LifecycleStarter.execute(LifecycleStarter.java:120)
        at org.apache.maven.DefaultMaven.doExecute(DefaultMaven.java:355)
        at org.apache.maven.DefaultMaven.execute(DefaultMaven.java:155)
        at org.apache.maven.cli.MavenCli.execute(MavenCli.java:584)
        at org.apache.maven.cli.MavenCli.doMain(MavenCli.java:216)
        at org.apache.maven.cli.MavenCli.main(MavenCli.java:160)
        at sun.reflect.NativeMethodAccessorImpl.invoke0(Native Method)
        at sun.reflect.NativeMethodAccessorImpl.invoke(NativeMethodAccessorImpl.java:57)
        at sun.reflect.DelegatingMethodAccessorImpl.invoke(DelegatingMethodAccessorImpl.java:43)
        at java.lang.reflect.Method.invoke(Method.java:606)
        at org.codehaus.plexus.classworlds.launcher.Launcher.launchEnhanced(Launcher.java:289)
        at org.codehaus.plexus.classworlds.launcher.Launcher.launch(Launcher.java:229)
        at org.codehaus.plexus.classworlds.launcher.Launcher.mainWithExitCode(Launcher.java:415)
        at org.codehaus.plexus.classworlds.launcher.Launcher.main(Launcher.java:356)
Caused by: org.apache.maven.plugin.MojoFailureException: 1 build failed. See console output above for details.
        at org.apache.maven.plugins.invoker.InvokerSession.handleFailures(InvokerSession.java:260)
        at org.apache.maven.plugins.invoker.VerifyMojo.execute(VerifyMojo.java:137)
        at org.apache.maven.plugin.DefaultBuildPluginManager.executeMojo(DefaultBuildPluginManager.java:132)
        at org.apache.maven.lifecycle.internal.MojoExecutor.execute(MojoExecutor.java:208)
        ... 19 more
[ERROR]
[ERROR] Re-run Maven using the -X switch to enable full debug logging.
[ERROR]
[ERROR] For more information about the errors and possible solutions, please read the following articles:
[ERROR] [Help 1] http://cwiki.apache.org/confluence/display/MAVEN/MojoFailureException
Picked up JAVA_TOOL_OPTIONS: -Dmaven.ext.class.path="f:\jenkins\jenkins-slave\workspace\heckstyle-plugin_MCHECKSTYLE-353@2@tmp\withMaven98fae78d\pipeline-maven-spy.jar" -Dorg.jenkinsci.plugins.pipeline.maven.reportsFolder="f:\jenkins\jenkins-slave\workspace\heckstyle-plugin_MCHECKSTYLE-353@2@tmp\withMaven98fae78d"
[Pipeline] }
[Pipeline] // dir
[Pipeline] }
[withMaven] junitPublisher - Archive test results for Maven artifact org.apache.maven.plugins:maven-checkstyle-plugin:maven-plugin:3.0.1-SNAPSHOT generated by maven-surefire-plugin:test (default-test): windows-jdk7-m3.2.x_build\target\surefire-reports\*.xml
Recording test results
[withMaven] openTasksPublisher - Scan Tasks for Maven artifact org.apache.maven.plugins:maven-checkstyle-plugin:maven-plugin:3.0.1-SNAPSHOT in source directory windows-jdk7-m3.2.x_build\src\main\java
[TASKS] Scanning folder 'f:\jenkins\jenkins-slave\workspace\heckstyle-plugin_MCHECKSTYLE-353@2' for files matching the pattern 'windows-jdk7-m3.2.x_build\src\main\java\**\*' - excludes: null
[TASKS] Found 20 files to scan for tasks
[TASKS] Found 5 open tasks.
Skipping warnings blame since pipelines do not have an SCM link.%n
[TASKS] Computing warning deltas based on reference build #7
[withMaven] Publishers: Generated Artifacts Publisher: 36 ms, Junit Publisher: 400 ms, Open Task Scanner Publisher: 200 ms
[Pipeline] // withMaven
[Pipeline] cleanWs
[WS-CLEANUP] Deleting project workspace...
[WS-CLEANUP] Deferred wipeout is used...
[WS-CLEANUP] done
[Pipeline] cleanWs
[WS-CLEANUP] Deleting project workspace...
[WS-CLEANUP] Deferred wipeout is used...
[WS-CLEANUP] done
[Pipeline] }
[Pipeline] // stage
[Pipeline] }
[Pipeline] // ws
[Pipeline] }
[Pipeline] // node
[Pipeline] }
Failed in branch windows-jdk7-m3.2.x_build
[INFO]           multimoduleproject\pom.xml ....................... SUCCESS (12.2 s)
[INFO]
[INFO] --- maven-checkstyle-plugin:3.0.0:check (checkstyle-check) @ maven-checkstyle-plugin ---
[INFO] There is 1 error reported by Checkstyle 6.18 with config/maven_checks.xml ruleset.
[INFO] Ignored 1 error, 0 violation remaining.
[INFO]
[INFO] --- maven-invoker-plugin:3.1.0:verify (integration-test) @ maven-checkstyle-plugin ---
[INFO] -------------------------------------------------
[INFO] Build Summary:
[INFO]   Passed: 41, Failed: 1, Errors: 0, Skipped: 2
[INFO] -------------------------------------------------
[ERROR] The following builds failed:
[ERROR] *  MCHECKSTYLE-163\pom.xml
[INFO] -------------------------------------------------
[INFO] ------------------------------------------------------------------------
[INFO] BUILD FAILURE
[INFO] ------------------------------------------------------------------------
[INFO] Total time: 08:57 min
[INFO] Finished at: 2019-02-02T01:00:20-08:00
[INFO] Final Memory: 58M/1115M
[INFO] ------------------------------------------------------------------------
[INFO] [jenkins-event-spy] Generated F:\jenkins\jenkins-slave\workspace\heckstyle-plugin_MCHECKSTYLE-353@3@2@tmp\withMaven621a929e\maven-spy-20190202-005122-4951153712538492806097.log
[ERROR] Failed to execute goal org.apache.maven.plugins:maven-invoker-plugin:3.1.0:verify (integration-test) on project maven-checkstyle-plugin: 1 build failed. See console output above for details. -> [Help 1]
org.apache.maven.lifecycle.LifecycleExecutionException: Failed to execute goal org.apache.maven.plugins:maven-invoker-plugin:3.1.0:verify (integration-test) on project maven-checkstyle-plugin: 1 build failed. See console output above for details.
        at org.apache.maven.lifecycle.internal.MojoExecutor.execute(MojoExecutor.java:212)
        at org.apache.maven.lifecycle.internal.MojoExecutor.execute(MojoExecutor.java:153)
        at org.apache.maven.lifecycle.internal.MojoExecutor.execute(MojoExecutor.java:145)
        at org.apache.maven.lifecycle.internal.LifecycleModuleBuilder.buildProject(LifecycleModuleBuilder.java:116)
        at org.apache.maven.lifecycle.internal.LifecycleModuleBuilder.buildProject(LifecycleModuleBuilder.java:80)
        at org.apache.maven.lifecycle.internal.builder.singlethreaded.SingleThreadedBuilder.build(SingleThreadedBuilder.java:51)
        at org.apache.maven.lifecycle.internal.LifecycleStarter.execute(LifecycleStarter.java:128)
        at org.apache.maven.DefaultMaven.doExecute(DefaultMaven.java:307)
        at org.apache.maven.DefaultMaven.doExecute(DefaultMaven.java:193)
        at org.apache.maven.DefaultMaven.execute(DefaultMaven.java:106)
        at org.apache.maven.cli.MavenCli.execute(MavenCli.java:863)
        at org.apache.maven.cli.MavenCli.doMain(MavenCli.java:288)
        at org.apache.maven.cli.MavenCli.main(MavenCli.java:199)
        at sun.reflect.NativeMethodAccessorImpl.invoke0(Native Method)
        at sun.reflect.NativeMethodAccessorImpl.invoke(NativeMethodAccessorImpl.java:57)
        at sun.reflect.DelegatingMethodAccessorImpl.invoke(DelegatingMethodAccessorImpl.java:43)
        at java.lang.reflect.Method.invoke(Method.java:606)
        at org.codehaus.plexus.classworlds.launcher.Launcher.launchEnhanced(Launcher.java:289)
        at org.codehaus.plexus.classworlds.launcher.Launcher.launch(Launcher.java:229)
        at org.codehaus.plexus.classworlds.launcher.Launcher.mainWithExitCode(Launcher.java:415)
        at org.codehaus.plexus.classworlds.launcher.Launcher.main(Launcher.java:356)
Caused by: org.apache.maven.plugin.MojoFailureException: 1 build failed. See console output above for details.
        at org.apache.maven.plugins.invoker.InvokerSession.handleFailures(InvokerSession.java:260)
        at org.apache.maven.plugins.invoker.VerifyMojo.execute(VerifyMojo.java:137)
        at org.apache.maven.plugin.DefaultBuildPluginManager.executeMojo(DefaultBuildPluginManager.java:134)
        at org.apache.maven.lifecycle.internal.MojoExecutor.execute(MojoExecutor.java:207)
        ... 20 more
[ERROR]
[ERROR] Re-run Maven using the -X switch to enable full debug logging.
[ERROR]
[ERROR] For more information about the errors and possible solutions, please read the following articles:
[ERROR] [Help 1] http://cwiki.apache.org/confluence/display/MAVEN/MojoFailureException
Picked up JAVA_TOOL_OPTIONS: -Dmaven.ext.class.path="f:\jenkins\jenkins-slave\workspace\heckstyle-plugin_MCHECKSTYLE-353@3@2@tmp\withMaven621a929e\pipeline-maven-spy.jar" -Dorg.jenkinsci.plugins.pipeline.maven.reportsFolder="f:\jenkins\jenkins-slave\workspace\heckstyle-plugin_MCHECKSTYLE-353@3@2@tmp\withMaven621a929e"
[Pipeline] }
[Pipeline] // dir
[Pipeline] }
[withMaven] junitPublisher - Archive test results for Maven artifact org.apache.maven.plugins:maven-checkstyle-plugin:maven-plugin:3.0.1-SNAPSHOT generated by maven-surefire-plugin:test (default-test): windows-jdk7-m3.3.x_build\target\surefire-reports\*.xml
Recording test results
[withMaven] openTasksPublisher - Scan Tasks for Maven artifact org.apache.maven.plugins:maven-checkstyle-plugin:maven-plugin:3.0.1-SNAPSHOT in source directory windows-jdk7-m3.3.x_build\src\main\java
[TASKS] Scanning folder 'f:\jenkins\jenkins-slave\workspace\heckstyle-plugin_MCHECKSTYLE-353@3@2' for files matching the pattern 'windows-jdk7-m3.3.x_build\src\main\java\**\*' - excludes: null
[TASKS] Found 20 files to scan for tasks
[TASKS] Found 5 open tasks.
Skipping warnings blame since pipelines do not have an SCM link.%n
[TASKS] Computing warning deltas based on reference build #7
[withMaven] Publishers: Generated Artifacts Publisher: 31 ms, Junit Publisher: 383 ms, Open Task Scanner Publisher: 234 ms
[Pipeline] // withMaven
[Pipeline] cleanWs
[WS-CLEANUP] Deleting project workspace...
[WS-CLEANUP] Deferred wipeout is used...
[WS-CLEANUP] done
[Pipeline] cleanWs
[WS-CLEANUP] Deleting project workspace...
[WS-CLEANUP] Deferred wipeout is used...
[WS-CLEANUP] done
[Pipeline] }
[Pipeline] // stage
[Pipeline] }
[Pipeline] // ws
[Pipeline] }
[Pipeline] // node
[Pipeline] }
Failed in branch windows-jdk7-m3.3.x_build
[Pipeline] // parallel
[Pipeline] stage
[Pipeline] { (Notifications)
[Pipeline] echo
Build result: FAILURE
[Pipeline] jiraIssueSelector
[Pipeline] emailext
Reply | Threaded
Open this post in threaded view
|

Build failed in Jenkins: Maven TLP » maven-checkstyle-plugin » MCHECKSTYLE-353 #9

Apache Jenkins Server-2
See https://builds.apache.org/job/maven-box/job/maven-checkstyle-plugin/job/MCHECKSTYLE-353/9/

Changes:

* JDK 12 is now in the Release Candidate Phase
* [INFRA-17514] Jenkins invoker-plugin updated by INFRA

All tests passed

Build log:
[...truncated 4592 lines...]
[INFO] Building: MCHECKSTYLE-357-with-header-override/pom.xml
[INFO] run post-build script verify.groovy
[INFO]           multi-modules-aggregate/pom.xml .................. SUCCESS (7.6 s)
[INFO] Building: MCHECKSTYLE-214-basedir-resource/pom.xml
[INFO] run post-build script verify.groovy
[INFO]           MCHECKSTYLE-268/pom.xml .......................... SUCCESS (6.7 s)
[INFO] Building: minimal-pom/pom.xml
[INFO] run post-build script verify.groovy
[INFO]           MCHECKSTYLE-357-with-header-override/pom.xml ..... SUCCESS (7.8 s)
[INFO] Building: MCHECKSTYLE-337/pom.xml
[INFO] run post-build script verify.groovy
[INFO]           MCHECKSTYLE-214-basedir-resource/pom.xml ......... SUCCESS (4.4 s)
[INFO] Building: check-pass/pom.xml
[INFO] run post-build script verify.groovy
[INFO]           MCHECKSTYLE-337/pom.xml .......................... SUCCESS (5.3 s)
[INFO] Building: multi-modules-aggregate/pom.xml
[INFO]           check-pass/pom.xml ............................... SUCCESS (6.8 s)
[INFO] Building: MCHECKSTYLE-169/pom.xml
[INFO] run post-build script verify.bsh
[INFO]           minimal-pom/pom.xml .............................. SUCCESS (11.2 s)
[INFO] Building: MCHECKSTYLE-137/pom.xml
[INFO] run post-build script verify.groovy
[INFO]           multi-modules-aggregate/pom.xml .................. SUCCESS (5.7 s)
[INFO]
[INFO] --- maven-checkstyle-plugin:3.0.0:check (checkstyle-check) @ maven-checkstyle-plugin ---
[INFO] run post-build script verify.groovy
[INFO]           MCHECKSTYLE-169/pom.xml .......................... SUCCESS (5.8 s)
[INFO]
[INFO] --- maven-checkstyle-plugin:3.0.0:check (checkstyle-check) @ maven-checkstyle-plugin ---
[INFO]           MCHECKSTYLE-137/pom.xml .......................... SUCCESS (5.6 s)
[INFO] Building: MCHECKSTYLE-54/pom.xml
[INFO] There is 1 error reported by Checkstyle 6.18 with config/maven_checks.xml ruleset.
[INFO] Ignored 1 error, 0 violation remaining.
[INFO]
[INFO] --- maven-invoker-plugin:3.1.0:verify (integration-test) @ maven-checkstyle-plugin ---
[INFO] -------------------------------------------------
[INFO] Build Summary:
[INFO]   Passed: 44, Failed: 0, Errors: 0, Skipped: 0
[INFO] -------------------------------------------------
[INFO] ------------------------------------------------------------------------
[INFO] BUILD SUCCESS
[INFO] ------------------------------------------------------------------------
[INFO] Total time: 04:13 min
[INFO] Finished at: 2019-02-12T23:26:32Z
[INFO] ------------------------------------------------------------------------
[INFO] [jenkins-event-spy] Generated /home/jenkins/jenkins-slave/workspace/heckstyle-plugin_MCHECKSTYLE-353@2@tmp/withMaven9e45de89/maven-spy-20190212-232218-68612717397784589072022.log
[Pipeline] }
[Pipeline] // dir
[Pipeline] }
[withMaven] artifactsPublisher - Archive artifact linux-jdk11-m3.5.x_build/pom.xml under org/apache/maven/plugins/maven-checkstyle-plugin/3.0.1-SNAPSHOT/maven-checkstyle-plugin-3.0.1-SNAPSHOT.pom
[withMaven] artifactsPublisher - Archive artifact linux-jdk11-m3.5.x_build/target/maven-checkstyle-plugin-3.0.1-SNAPSHOT.jar under org/apache/maven/plugins/maven-checkstyle-plugin/3.0.1-SNAPSHOT/maven-checkstyle-plugin-3.0.1-SNAPSHOT.jar
[withMaven] junitPublisher - Archive test results for Maven artifact org.apache.maven.plugins:maven-checkstyle-plugin:maven-plugin:3.0.1-SNAPSHOT generated by maven-surefire-plugin:test (default-test): linux-jdk11-m3.5.x_build/target/surefire-reports/*.xml
Recording test results
[INFO] There is 1 error reported by Checkstyle 6.18 with config/maven_checks.xml ruleset.
[INFO] Ignored 1 error, 0 violation remaining.
[INFO]
[INFO] --- maven-invoker-plugin:3.1.0:verify (integration-test) @ maven-checkstyle-plugin ---
[INFO] -------------------------------------------------
[INFO] Build Summary:
[INFO]   Passed: 44, Failed: 0, Errors: 0, Skipped: 0
[INFO] -------------------------------------------------
[INFO] ------------------------------------------------------------------------
[INFO] BUILD SUCCESS
[INFO] ------------------------------------------------------------------------
[INFO] Total time: 05:33 min
[INFO] Finished at: 2019-02-12T23:26:35Z
[INFO] ------------------------------------------------------------------------
[INFO] [jenkins-event-spy] Generated /home/jenkins/jenkins-slave/workspace/heckstyle-plugin_MCHECKSTYLE-353@2@tmp/withMaven71bd24df/maven-spy-20190212-232101-855296378980850350892.log
[Pipeline] }
[INFO]           MCHECKSTYLE-54/pom.xml ........................... SUCCESS (5.0 s)
[INFO] Building: multi-modules/pom.xml
[Pipeline] // dir
[Pipeline] }
[withMaven] openTasksPublisher - Scan Tasks for Maven artifact org.apache.maven.plugins:maven-checkstyle-plugin:maven-plugin:3.0.1-SNAPSHOT in source directory linux-jdk11-m3.5.x_build/src/main/java
[TASKS] Scanning folder '/home/jenkins/jenkins-slave/workspace/heckstyle-plugin_MCHECKSTYLE-353@2' for files matching the pattern 'linux-jdk11-m3.5.x_build/src/main/java/**/*' - excludes: null
[TASKS] Found 20 files to scan for tasks
[TASKS] Found 5 open tasks.
Skipping warnings blame since pipelines do not have an SCM link.%n
[TASKS] Computing warning deltas based on reference build #7
[withMaven] artifactsPublisher - Archive artifact linux-jdk8-m3.5.x_build/pom.xml under org/apache/maven/plugins/maven-checkstyle-plugin/3.0.1-SNAPSHOT/maven-checkstyle-plugin-3.0.1-SNAPSHOT.pom
[withMaven] artifactsPublisher - Archive artifact linux-jdk8-m3.5.x_build/target/maven-checkstyle-plugin-3.0.1-SNAPSHOT.jar under org/apache/maven/plugins/maven-checkstyle-plugin/3.0.1-SNAPSHOT/maven-checkstyle-plugin-3.0.1-SNAPSHOT.jar
[withMaven] invokerPublisher - Archive invoker results for Maven artifact MavenArtifact{org.apache.maven.plugins:maven-checkstyle-plugin:maven-plugin:3.0.1-SNAPSHOT(version: 3.0.1-SNAPSHOT, snapshot:false) } generated by PluginInvocation{org.apache.maven.plugins:maven-invoker-plugin:3.1.0@integration-test  integration-test}: linux-jdk11-m3.5.x_build/target/invoker-reports/*.xml
[withMaven] junitPublisher - Archive test results for Maven artifact org.apache.maven.plugins:maven-checkstyle-plugin:maven-plugin:3.0.1-SNAPSHOT generated by maven-surefire-plugin:test (default-test): linux-jdk8-m3.5.x_build/target/surefire-reports/*.xml
Recording test results
[withMaven] openTasksPublisher - Scan Tasks for Maven artifact org.apache.maven.plugins:maven-checkstyle-plugin:maven-plugin:3.0.1-SNAPSHOT in source directory linux-jdk8-m3.5.x_build/src/main/java
[TASKS] Scanning folder '/home/jenkins/jenkins-slave/workspace/heckstyle-plugin_MCHECKSTYLE-353@2' for files matching the pattern 'linux-jdk8-m3.5.x_build/src/main/java/**/*' - excludes: null
[TASKS] Found 20 files to scan for tasks
[TASKS] Found 5 open tasks.
Skipping warnings blame since pipelines do not have an SCM link.%n
[TASKS] Computing warning deltas based on reference build #7
[INFO]           multi-modules/pom.xml ............................ SUCCESS (8.1 s)
[INFO] Building: MCHECKSTYLE-219-no-license_failure/pom.xml
[withMaven] invokerPublisher - Archive invoker results for Maven artifact MavenArtifact{org.apache.maven.plugins:maven-checkstyle-plugin:maven-plugin:3.0.1-SNAPSHOT(version: 3.0.1-SNAPSHOT, snapshot:false) } generated by PluginInvocation{org.apache.maven.plugins:maven-invoker-plugin:3.1.0@integration-test  integration-test}: linux-jdk8-m3.5.x_build/target/invoker-reports/*.xml
[INFO] run post-build script verify.groovy
[INFO]           MCHECKSTYLE-219-no-license_failure/pom.xml ....... SUCCESS (4.8 s)
[INFO] Building: MCHECKSTYLE-332_cache-checker/pom.xml
[INFO] run post-build script verify.groovy
[INFO]           MCHECKSTYLE-332_cache-checker/pom.xml ............ SUCCESS (6.8 s)
[INFO] Building: MCHECKSTYLE-173-with-charset/pom.xml
[INFO]           MCHECKSTYLE-173-with-charset/pom.xml ............. SUCCESS (7.2 s)
[INFO] Building: MCHECKSTYLE-70-multi-sourcefolder/pom.xml
[INFO] run post-build script verify.groovy
[INFO]           MCHECKSTYLE-70-multi-sourcefolder/pom.xml ........ SUCCESS (7.9 s)
[INFO] Building: MCHECKSTYLE-225-LICENSE.txt/pom.xml
[INFO] run post-build script verify.groovy
[INFO]           MCHECKSTYLE-225-LICENSE.txt/pom.xml .............. SUCCESS (6.0 s)
[INFO] Building: MCHECKSTYLE-357/pom.xml
[withMaven] Publishers: Generated Artifacts Publisher: 1162 ms, Junit Publisher: 3440 ms, Open Task Scanner Publisher: 1148 ms, Invoker Publisher: 39429 ms, Pipeline Graph Publisher: 1 ms
[Pipeline] // withMaven
[Pipeline] cleanWs
[WS-CLEANUP] Deleting project workspace...
[WS-CLEANUP] Deferred wipeout is used...
[WS-CLEANUP] done
[Pipeline] }
[Pipeline] // stage
[Pipeline] }
[Pipeline] // ws
[Pipeline] }
[Pipeline] // node
[Pipeline] }
[withMaven] Publishers: Generated Artifacts Publisher: 1151 ms, Junit Publisher: 3457 ms, Open Task Scanner Publisher: 1167 ms, Invoker Publisher: 39533 ms, Pipeline Graph Publisher: 1 ms
[Pipeline] // withMaven
[Pipeline] cleanWs
[WS-CLEANUP] Deleting project workspace...
[WS-CLEANUP] Deferred wipeout is used...
[WS-CLEANUP] done
[Pipeline] }
[Pipeline] // stage
[Pipeline] }
[Pipeline] // ws
[Pipeline] }
[Pipeline] // node
[Pipeline] }
[INFO] run post-build script verify.groovy
[INFO]           MCHECKSTYLE-357/pom.xml .......................... SUCCESS (8.4 s)
[INFO] Building: checkstyle-report/pom.xml
[INFO] run post-build script verify.groovy
[INFO]           checkstyle-report/pom.xml ........................ SUCCESS (7.1 s)
[INFO] Building: MCHECKSTYLE-225-customHeader/pom.xml
[INFO] run post-build script verify.groovy
[INFO]           MCHECKSTYLE-225-customHeader/pom.xml ............. SUCCESS (5.7 s)
[INFO] Building: MCHECKSTYLE-222-resources/pom.xml
[INFO] run post-build script verify.groovy
[INFO]           MCHECKSTYLE-222-resources/pom.xml ................ SUCCESS (5.7 s)
[INFO] Building: MCHECKSTYLE-338/pom.xml
[INFO] run post-build script verify.groovy
[INFO]           MCHECKSTYLE-338/pom.xml .......................... SUCCESS (7.3 s)
[INFO] Building: MCHECKSTYLE-220/pom.xml
[INFO] run post-build script verify.groovy
[INFO]           MCHECKSTYLE-220/pom.xml .......................... SUCCESS (6.6 s)
[INFO] Building: MCHECKSTYLE-337/pom.xml
[INFO] run post-build script verify.groovy
[INFO]           MCHECKSTYLE-337/pom.xml .......................... SUCCESS (6.5 s)
[INFO] Building: MCHECKSTYLE-347/pom.xml
[INFO] run post-build script verify.groovy
[INFO]           MCHECKSTYLE-347/pom.xml .......................... SUCCESS (3.9 s)
[INFO] Building: multimoduleproject/pom.xml
[INFO]           multimoduleproject/pom.xml ....................... SUCCESS (5.7 s)
[INFO] Building: MCHECKSTYLE-163/pom.xml
[INFO]           MCHECKSTYLE-163/pom.xml .......................... SUCCESS (4.7 s)
[INFO] Building: MCHECKSTYLE-357-with-header-override/pom.xml
[INFO] run post-build script verify.groovy
[INFO]           MCHECKSTYLE-357-with-header-override/pom.xml ..... SUCCESS (10.1 s)
[INFO] Building: MCHECKSTYLE-129/pom.xml
[INFO]           MCHECKSTYLE-129/pom.xml .......................... SUCCESS (9.2 s)
[INFO] Building: MCHECKSTYLE-193/pom.xml
[INFO]           MCHECKSTYLE-193/pom.xml .......................... SUCCESS (5.8 s)
[INFO] Building: checkstyle-goal/pom.xml
[INFO] run post-build script verify.groovy
[INFO]           checkstyle-goal/pom.xml .......................... SUCCESS (5.4 s)
[INFO] Building: MCHECKSTYLE-225-pluginManagement/pom.xml
[INFO] run post-build script verify.groovy
[INFO]           MCHECKSTYLE-225-pluginManagement/pom.xml ......... SUCCESS (6.4 s)
[INFO] Building: MCHECKSTYLE-222-testResources/pom.xml
[INFO] run post-build script verify.groovy
[INFO]           MCHECKSTYLE-222-testResources/pom.xml ............ SUCCESS (5.4 s)
[INFO] Building: MCHECKSTYLE-224/pom.xml
[INFO] run post-build script verify.groovy
[INFO]           MCHECKSTYLE-224/pom.xml .......................... SUCCESS (8.3 s)
[INFO] Building: MCHECKSTYLE-173-without-charset/pom.xml
[INFO]           MCHECKSTYLE-173-without-charset/pom.xml .......... SUCCESS (7.4 s)
[INFO] Building: check-fail/pom.xml
[INFO] run post-build script verify.groovy
[INFO]           check-fail/pom.xml ............................... SUCCESS (6.6 s)
[INFO] Building: MCHECKSTYLE-260-testSourceDirectories/pom.xml
[INFO] run post-build script verify.groovy
[INFO]           MCHECKSTYLE-260-testSourceDirectories/pom.xml .... SUCCESS (7.6 s)
[INFO] Building: multi-modules-aggregate/pom.xml
[INFO] run post-build script verify.groovy
[INFO]           multi-modules-aggregate/pom.xml .................. SUCCESS (7.2 s)
[INFO] Building: MCHECKSTYLE-214-basedir-resource/pom.xml
[INFO] run post-build script verify.groovy
[INFO]           MCHECKSTYLE-214-basedir-resource/pom.xml ......... SUCCESS (4.2 s)
[INFO] Building: check-pass/pom.xml
[INFO]           check-pass/pom.xml ............................... SUCCESS (6.6 s)
[INFO] Building: MCHECKSTYLE-169/pom.xml
[INFO] run post-build script verify.groovy
[INFO]           MCHECKSTYLE-169/pom.xml .......................... SUCCESS (5.1 s)
[INFO]
[INFO] --- maven-checkstyle-plugin:3.0.0:check (checkstyle-check) @ maven-checkstyle-plugin ---
[INFO] There is 1 error reported by Checkstyle 6.18 with config/maven_checks.xml ruleset.
[INFO] Ignored 1 error, 0 violation remaining.
[INFO]
[INFO] --- maven-invoker-plugin:3.1.0:verify (integration-test) @ maven-checkstyle-plugin ---
[INFO] -------------------------------------------------
[INFO] Build Summary:
[INFO]   Passed: 44, Failed: 0, Errors: 0, Skipped: 0
[INFO] -------------------------------------------------
[INFO] ------------------------------------------------------------------------
[INFO] BUILD SUCCESS
[INFO] ------------------------------------------------------------------------
[INFO] Total time: 05:20 min
[INFO] Finished at: 2019-02-12T23:29:57Z
[INFO] ------------------------------------------------------------------------
[INFO] [jenkins-event-spy] Generated /home/jenkins/jenkins-slave/workspace/heckstyle-plugin_MCHECKSTYLE-353@3@2@tmp/withMaven9c1e4939/maven-spy-20190212-232435-95415222273325478994498.log
[Pipeline] }
[Pipeline] // dir
[Pipeline] }
[withMaven] artifactsPublisher - Archive artifact linux-jdk12-m3.5.x_build/pom.xml under org/apache/maven/plugins/maven-checkstyle-plugin/3.0.1-SNAPSHOT/maven-checkstyle-plugin-3.0.1-SNAPSHOT.pom
[withMaven] artifactsPublisher - Archive artifact linux-jdk12-m3.5.x_build/target/maven-checkstyle-plugin-3.0.1-SNAPSHOT.jar under org/apache/maven/plugins/maven-checkstyle-plugin/3.0.1-SNAPSHOT/maven-checkstyle-plugin-3.0.1-SNAPSHOT.jar
[withMaven] junitPublisher - Archive test results for Maven artifact org.apache.maven.plugins:maven-checkstyle-plugin:maven-plugin:3.0.1-SNAPSHOT generated by maven-surefire-plugin:test (default-test): linux-jdk12-m3.5.x_build/target/surefire-reports/*.xml
Recording test results
[withMaven] openTasksPublisher - Scan Tasks for Maven artifact org.apache.maven.plugins:maven-checkstyle-plugin:maven-plugin:3.0.1-SNAPSHOT in source directory linux-jdk12-m3.5.x_build/src/main/java
[TASKS] Scanning folder '/home/jenkins/jenkins-slave/workspace/heckstyle-plugin_MCHECKSTYLE-353@3@2' for files matching the pattern 'linux-jdk12-m3.5.x_build/src/main/java/**/*' - excludes: null
[TASKS] Found 20 files to scan for tasks
[TASKS] Found 5 open tasks.
Skipping warnings blame since pipelines do not have an SCM link.%n
[TASKS] Computing warning deltas based on reference build #7
[withMaven] invokerPublisher - Archive invoker results for Maven artifact MavenArtifact{org.apache.maven.plugins:maven-checkstyle-plugin:maven-plugin:3.0.1-SNAPSHOT(version: 3.0.1-SNAPSHOT, snapshot:false) } generated by PluginInvocation{org.apache.maven.plugins:maven-invoker-plugin:3.1.0@integration-test  integration-test}: linux-jdk12-m3.5.x_build/target/invoker-reports/*.xml
[withMaven] Publishers: Generated Artifacts Publisher: 1131 ms, Junit Publisher: 3470 ms, Open Task Scanner Publisher: 1270 ms, Invoker Publisher: 40238 ms, Pipeline Graph Publisher: 1 ms
[Pipeline] // withMaven
[Pipeline] cleanWs
[WS-CLEANUP] Deleting project workspace...
[WS-CLEANUP] Deferred wipeout is used...
[WS-CLEANUP] done
[Pipeline] }
[Pipeline] // stage
[Pipeline] }
[Pipeline] // ws
[Pipeline] }
[Pipeline] // node
[Pipeline] }
[Pipeline] // parallel
[Pipeline] stage
[Pipeline] { (Notifications)
[Pipeline] echo
Build result: FAILURE
[Pipeline] jiraIssueSelector
[Pipeline] emailext