Build failed in Jenkins: Maven TLP » maven-assembly-plugin » master #44

classic Classic list List threaded Threaded
9 messages Options
Reply | Threaded
Open this post in threaded view
|

Build failed in Jenkins: Maven TLP » maven-assembly-plugin » master #44

Apache Jenkins Server-2
See https://builds.apache.org/job/maven-box/job/maven-assembly-plugin/job/master/44/

Changes:

* increase a bit archiving
* increase a bit archiving

All tests passed

Build log:
[...truncated 4.05 MB...]
[windows-jdk7-m3.5.x_build] [INFO] Downloading from central: https://repo.maven.apache.org/maven2/org/apache/maven/shared/maven-shared-resources/2/maven-shared-resources-2.pom
[windows-jdk7-m3.5.x_build] [INFO] Downloaded from central: https://repo.maven.apache.org/maven2/org/apache/maven/shared/maven-shared-resources/2/maven-shared-resources-2.pom (3.0 kB at 34 kB/s)
[windows-jdk7-m3.5.x_build] [INFO] Downloading from central: https://repo.maven.apache.org/maven2/org/codehaus/plexus/plexus-utils/3.0.10/plexus-utils-3.0.10.pom
[windows-jdk7-m3.5.x_build] [INFO] Downloaded from central: https://repo.maven.apache.org/maven2/org/codehaus/plexus/plexus-utils/3.0.10/plexus-utils-3.0.10.pom (3.1 kB at 87 kB/s)
[windows-jdk7-m3.5.x_build] [INFO] Downloading from central: https://repo.maven.apache.org/maven2/org/codehaus/plexus/plexus/3.3/plexus-3.3.pom
[windows-jdk7-m3.5.x_build] [INFO] Downloaded from central: https://repo.maven.apache.org/maven2/org/codehaus/plexus/plexus/3.3/plexus-3.3.pom (20 kB at 355 kB/s)
[windows-jdk7-m3.5.x_build] [INFO] Downloading from central: https://repo.maven.apache.org/maven2/org/apache/maven/doxia/doxia-integration-tools/1.6/doxia-integration-tools-1.6.pom
[windows-jdk7-m3.5.x_build] [INFO] Downloaded from central: https://repo.maven.apache.org/maven2/org/apache/maven/doxia/doxia-integration-tools/1.6/doxia-integration-tools-1.6.pom (7.0 kB at 151 kB/s)
[windows-jdk7-m3.5.x_build] [INFO] Downloading from central: https://repo.maven.apache.org/maven2/org/apache/maven/doxia/doxia-tools/3/doxia-tools-3.pom
[windows-jdk7-m3.5.x_build] [INFO] Downloaded from central: https://repo.maven.apache.org/maven2/org/apache/maven/doxia/doxia-tools/3/doxia-tools-3.pom (9.9 kB at 211 kB/s)
[windows-jdk7-m3.5.x_build] [INFO] Downloading from central: https://repo.maven.apache.org/maven2/org/codehaus/plexus/plexus-resources/1.1.0/plexus-resources-1.1.0.pom
[windows-jdk7-m3.5.x_build] [INFO] Downloaded from central: https://repo.maven.apache.org/maven2/org/codehaus/plexus/plexus-resources/1.1.0/plexus-resources-1.1.0.pom (3.2 kB at 71 kB/s)
[windows-jdk7-m3.5.x_build] [INFO] Downloading from central: https://repo.maven.apache.org/maven2/com/puppycrawl/tools/checkstyle/6.18/checkstyle-6.18.pom
[windows-jdk7-m3.5.x_build] [INFO] Downloaded from central: https://repo.maven.apache.org/maven2/com/puppycrawl/tools/checkstyle/6.18/checkstyle-6.18.pom (71 kB at 1.2 MB/s)
[windows-jdk7-m3.5.x_build] [INFO] Downloading from central: https://repo.maven.apache.org/maven2/antlr/antlr/2.7.7/antlr-2.7.7.pom
[windows-jdk7-m3.5.x_build] [INFO] Downloaded from central: https://repo.maven.apache.org/maven2/antlr/antlr/2.7.7/antlr-2.7.7.pom (632 B at 14 kB/s)
[windows-jdk7-m3.5.x_build] [INFO] Downloading from central: https://repo.maven.apache.org/maven2/org/antlr/antlr4-runtime/4.5.3/antlr4-runtime-4.5.3.pom
[windows-jdk7-m3.5.x_build] [INFO] Downloaded from central: https://repo.maven.apache.org/maven2/org/antlr/antlr4-runtime/4.5.3/antlr4-runtime-4.5.3.pom (2.3 kB at 50 kB/s)
[windows-jdk7-m3.5.x_build] [INFO] Downloading from central: https://repo.maven.apache.org/maven2/org/antlr/antlr4-master/4.5.3/antlr4-master-4.5.3.pom
[windows-jdk7-m3.5.x_build] [INFO] Downloaded from central: https://repo.maven.apache.org/maven2/org/antlr/antlr4-master/4.5.3/antlr4-master-4.5.3.pom (3.7 kB at 77 kB/s)
[windows-jdk7-m3.5.x_build] [INFO] Downloading from central: https://repo.maven.apache.org/maven2/commons-beanutils/commons-beanutils/1.9.2/commons-beanutils-1.9.2.pom
[windows-jdk7-m3.5.x_build] [INFO] Downloaded from central: https://repo.maven.apache.org/maven2/commons-beanutils/commons-beanutils/1.9.2/commons-beanutils-1.9.2.pom (14 kB at 311 kB/s)
[windows-jdk7-m3.5.x_build] [INFO] Downloading from central: https://repo.maven.apache.org/maven2/org/apache/commons/commons-parent/33/commons-parent-33.pom
[windows-jdk7-m3.5.x_build] [INFO] Downloaded from central: https://repo.maven.apache.org/maven2/org/apache/commons/commons-parent/33/commons-parent-33.pom (53 kB at 870 kB/s)
[windows-jdk7-m3.5.x_build] [INFO] Downloading from central: https://repo.maven.apache.org/maven2/commons-cli/commons-cli/1.3.1/commons-cli-1.3.1.pom
[windows-jdk7-m3.5.x_build] [INFO] Downloaded from central: https://repo.maven.apache.org/maven2/commons-cli/commons-cli/1.3.1/commons-cli-1.3.1.pom (10 kB at 247 kB/s)
[windows-jdk7-m3.5.x_build] [INFO] Downloading from central: https://repo.maven.apache.org/maven2/com/google/guava/guava/19.0/guava-19.0.pom
[windows-jdk7-m3.5.x_build] [INFO] Downloaded from central: https://repo.maven.apache.org/maven2/com/google/guava/guava/19.0/guava-19.0.pom (6.8 kB at 139 kB/s)
[windows-jdk7-m3.5.x_build] [INFO] Downloading from central: https://repo.maven.apache.org/maven2/com/google/guava/guava-parent/19.0/guava-parent-19.0.pom
[windows-jdk7-m3.5.x_build] [INFO] Downloaded from central: https://repo.maven.apache.org/maven2/com/google/guava/guava-parent/19.0/guava-parent-19.0.pom (9.9 kB at 219 kB/s)
[windows-jdk7-m3.5.x_build] [INFO] Downloading from central: https://repo.maven.apache.org/maven2/org/sonatype/oss/oss-parent/7/oss-parent-7.pom
[windows-jdk7-m3.5.x_build] [INFO] Downloaded from central: https://repo.maven.apache.org/maven2/org/sonatype/oss/oss-parent/7/oss-parent-7.pom (4.8 kB at 121 kB/s)
[windows-jdk7-m3.5.x_build] [INFO] Downloading from central: https://repo.maven.apache.org/maven2/org/apache/maven/shared/maven-shared-resources/2/maven-shared-resources-2.jar
[windows-jdk7-m3.5.x_build] [INFO] Downloading from central: https://repo.maven.apache.org/maven2/org/apache/maven/doxia/doxia-core/1.2/doxia-core-1.2.jar
[windows-jdk7-m3.5.x_build] [INFO] Downloading from central: https://repo.maven.apache.org/maven2/commons-digester/commons-digester/1.6/commons-digester-1.6.jar
[windows-jdk7-m3.5.x_build] [INFO] Downloading from central: https://repo.maven.apache.org/maven2/org/apache/maven/doxia/doxia-integration-tools/1.6/doxia-integration-tools-1.6.jar
[windows-jdk7-m3.5.x_build] [INFO] Downloading from central: https://repo.maven.apache.org/maven2/commons-logging/commons-logging/1.0.4/commons-logging-1.0.4.jar
[windows-jdk7-m3.5.x_build] [INFO] Downloaded from central: https://repo.maven.apache.org/maven2/commons-digester/commons-digester/1.6/commons-digester-1.6.jar (168 kB at 2.9 MB/s)
[windows-jdk7-m3.5.x_build] [INFO] Downloading from central: https://repo.maven.apache.org/maven2/commons-io/commons-io/1.4/commons-io-1.4.jar
[windows-jdk7-m3.5.x_build] [INFO] Downloaded from central: https://repo.maven.apache.org/maven2/commons-logging/commons-logging/1.0.4/commons-logging-1.0.4.jar (38 kB at 413 kB/s)
[windows-jdk7-m3.5.x_build] [INFO] Downloading from central: https://repo.maven.apache.org/maven2/org/codehaus/plexus/plexus-resources/1.1.0/plexus-resources-1.1.0.jar
[windows-jdk7-m3.5.x_build] [INFO] Downloaded from central: https://repo.maven.apache.org/maven2/org/apache/maven/doxia/doxia-core/1.2/doxia-core-1.2.jar (154 kB at 1.5 MB/s)
[windows-jdk7-m3.5.x_build] [INFO] Downloading from central: https://repo.maven.apache.org/maven2/com/puppycrawl/tools/checkstyle/6.18/checkstyle-6.18.jar
[windows-jdk7-m3.5.x_build] [INFO] Downloaded from central: https://repo.maven.apache.org/maven2/commons-io/commons-io/1.4/commons-io-1.4.jar (109 kB at 932 kB/s)
[windows-jdk7-m3.5.x_build] [INFO] Downloading from central: https://repo.maven.apache.org/maven2/antlr/antlr/2.7.7/antlr-2.7.7.jar
[windows-jdk7-m3.5.x_build] [INFO] Downloaded from central: https://repo.maven.apache.org/maven2/org/apache/maven/shared/maven-shared-resources/2/maven-shared-resources-2.jar (13 kB at 100 kB/s)
[windows-jdk7-m3.5.x_build] [INFO] Downloading from central: https://repo.maven.apache.org/maven2/org/antlr/antlr4-runtime/4.5.3/antlr4-runtime-4.5.3.jar
[windows-jdk7-m3.5.x_build] [INFO] Downloaded from central: https://repo.maven.apache.org/maven2/antlr/antlr/2.7.7/antlr-2.7.7.jar (445 kB at 2.6 MB/s)
[windows-jdk7-m3.5.x_build] [INFO] Downloading from central: https://repo.maven.apache.org/maven2/commons-beanutils/commons-beanutils/1.9.2/commons-beanutils-1.9.2.jar
[windows-jdk7-m3.5.x_build] [INFO] Downloaded from central: https://repo.maven.apache.org/maven2/org/antlr/antlr4-runtime/4.5.3/antlr4-runtime-4.5.3.jar (302 kB at 1.7 MB/s)
[windows-jdk7-m3.5.x_build] [INFO] Downloading from central: https://repo.maven.apache.org/maven2/commons-cli/commons-cli/1.3.1/commons-cli-1.3.1.jar
[windows-jdk7-m3.5.x_build] [INFO] Downloaded from central: https://repo.maven.apache.org/maven2/com/puppycrawl/tools/checkstyle/6.18/checkstyle-6.18.jar (1.2 MB at 5.6 MB/s)
[windows-jdk7-m3.5.x_build] [INFO] Downloading from central: https://repo.maven.apache.org/maven2/com/google/guava/guava/19.0/guava-19.0.jar
[windows-jdk7-m3.5.x_build] [INFO] Downloaded from central: https://repo.maven.apache.org/maven2/commons-beanutils/commons-beanutils/1.9.2/commons-beanutils-1.9.2.jar (234 kB at 1.1 MB/s)
[windows-jdk7-m3.5.x_build] [INFO] Downloading from central: https://repo.maven.apache.org/maven2/commons-lang/commons-lang/2.1/commons-lang-2.1.jar
[windows-jdk7-m3.5.x_build] [INFO] Downloaded from central: https://repo.maven.apache.org/maven2/commons-cli/commons-cli/1.3.1/commons-cli-1.3.1.jar (53 kB at 239 kB/s)
[windows-jdk7-m3.5.x_build] [INFO] Downloaded from central: https://repo.maven.apache.org/maven2/org/codehaus/plexus/plexus-resources/1.1.0/plexus-resources-1.1.0.jar (23 kB at 92 kB/s)
[windows-jdk7-m3.5.x_build] [INFO] Downloaded from central: https://repo.maven.apache.org/maven2/commons-lang/commons-lang/2.1/commons-lang-2.1.jar (208 kB at 824 kB/s)
[windows-jdk7-m3.5.x_build] [INFO] Downloaded from central: https://repo.maven.apache.org/maven2/org/apache/maven/doxia/doxia-integration-tools/1.6/doxia-integration-tools-1.6.jar (45 kB at 148 kB/s)
[windows-jdk7-m3.5.x_build] [INFO] Downloaded from central: https://repo.maven.apache.org/maven2/com/google/guava/guava/19.0/guava-19.0.jar (2.3 MB at 7.4 MB/s)
[windows-jdk7-m3.5.x_build] [INFO] There are 2 errors reported by Checkstyle 6.18 with config/maven_checks.xml ruleset.
[windows-jdk7-m3.5.x_build] [INFO] Ignored 2 errors, 0 violation remaining.
[windows-jdk7-m3.5.x_build] [INFO]
[windows-jdk7-m3.5.x_build] [INFO] --- maven-invoker-plugin:3.1.0:verify (integration-test) @ maven-assembly-plugin ---
[windows-jdk7-m3.5.x_build] [INFO] -------------------------------------------------
[windows-jdk7-m3.5.x_build] [INFO] Build Summary:
[windows-jdk7-m3.5.x_build] [INFO]   Passed: 135, Failed: 0, Errors: 0, Skipped: 2
[windows-jdk7-m3.5.x_build] [INFO] -------------------------------------------------
[windows-jdk7-m3.5.x_build] [INFO] ------------------------------------------------------------------------
[windows-jdk7-m3.5.x_build] [INFO] BUILD SUCCESS
[windows-jdk7-m3.5.x_build] [INFO] ------------------------------------------------------------------------
[windows-jdk7-m3.5.x_build] [INFO] Total time: 26:00 min
[windows-jdk7-m3.5.x_build] [INFO] Finished at: 2018-12-28T04:37:27-08:00
[windows-jdk7-m3.5.x_build] [INFO] Final Memory: 51M/307M
[windows-jdk7-m3.5.x_build] [INFO] ------------------------------------------------------------------------
[windows-jdk7-m3.5.x_build] [INFO] [jenkins-event-spy] Generated C:\Users\jenkins\AppData\Local\Temp\2\jenkins-maven-box-maven-assembly-plugin-master-44@tmp\withMaven81ee6c73\maven-spy-20181228-041126-6726301577394145360330.log
[windows-jdk7-m3.5.x_build] Picked up JAVA_TOOL_OPTIONS: -Dmaven.ext.class.path="C:\Users\jenkins\AppData\Local\Temp\2\jenkins-maven-box-maven-assembly-plugin-master-44@tmp\withMaven81ee6c73\pipeline-maven-spy.jar" -Dorg.jenkinsci.plugins.pipeline.maven.reportsFolder="C:\Users\jenkins\AppData\Local\Temp\2\jenkins-maven-box-maven-assembly-plugin-master-44@tmp\withMaven81ee6c73"
[Pipeline] [windows-jdk7-m3.2.x_build] }
[windows-jdk7-m3.2.x_build] [withMaven] artifactsPublisher - Archive artifact windows-jdk7-m3.2.x_build\pom.xml under org\apache\maven\plugins\maven-assembly-plugin\3.1.1-SNAPSHOT\maven-assembly-plugin-3.1.1-SNAPSHOT.pom
[windows-jdk7-m3.2.x_build] [withMaven] artifactsPublisher - Archive artifact windows-jdk7-m3.2.x_build\target\maven-assembly-plugin-3.1.1-SNAPSHOT.jar under org\apache\maven\plugins\maven-assembly-plugin\3.1.1-SNAPSHOT\maven-assembly-plugin-3.1.1-SNAPSHOT.jar
[windows-jdk7-m3.2.x_build] [withMaven] invokerPublisher - Archive invoker results for Maven artifact MavenArtifact{org.apache.maven.plugins:maven-assembly-plugin::3.1.1-SNAPSHOT(version: 3.1.1-SNAPSHOT, snapshot:false) } generated by PluginInvocation{org.apache.maven.plugins:maven-invoker-plugin:3.1.0@integration-test  integration-test}: windows-jdk7-m3.2.x_build\target\invoker-reports\*.xml
[windows-jdk7-m3.2.x_build] [withMaven] junitPublisher - Archive test results for Maven artifact org.apache.maven.plugins:maven-assembly-plugin:3.1.1-SNAPSHOT generated by maven-surefire-plugin:test (default-test): windows-jdk7-m3.2.x_build\target\surefire-reports\*.xml
[windows-jdk7-m3.2.x_build] Recording test results
[windows-jdk7-m3.2.x_build] [withMaven] openTasksPublisher - Scan Tasks for Maven artifact org.apache.maven.plugins:maven-assembly-plugin:3.1.1-SNAPSHOT in source directory windows-jdk7-m3.2.x_build\src\main\java
[windows-jdk7-m3.2.x_build] [TASKS] Scanning folder 'C:\Users\jenkins\AppData\Local\Temp\2\jenkins-maven-box-maven-assembly-plugin-master-44' for files matching the pattern 'windows-jdk7-m3.2.x_build\src\main\java\**\*' - excludes: null
[windows-jdk7-m3.2.x_build] [TASKS] Found 71 files to scan for tasks
[windows-jdk7-m3.2.x_build] [TASKS] Found 14 open tasks.
[windows-jdk7-m3.2.x_build] Skipping warnings blame since pipelines do not have an SCM link.%n
[windows-jdk7-m3.2.x_build] [TASKS] Computing warning deltas based on reference build #43
[Pipeline] [windows-jdk7-m3.3.x_build] }
[windows-jdk7-m3.3.x_build] [withMaven] artifactsPublisher - Archive artifact windows-jdk7-m3.3.x_build\pom.xml under org\apache\maven\plugins\maven-assembly-plugin\3.1.1-SNAPSHOT\maven-assembly-plugin-3.1.1-SNAPSHOT.pom
[windows-jdk7-m3.3.x_build] [withMaven] artifactsPublisher - Archive artifact windows-jdk7-m3.3.x_build\target\maven-assembly-plugin-3.1.1-SNAPSHOT.jar under org\apache\maven\plugins\maven-assembly-plugin\3.1.1-SNAPSHOT\maven-assembly-plugin-3.1.1-SNAPSHOT.jar
[windows-jdk7-m3.3.x_build] [withMaven] invokerPublisher - Archive invoker results for Maven artifact MavenArtifact{org.apache.maven.plugins:maven-assembly-plugin::3.1.1-SNAPSHOT(version: 3.1.1-SNAPSHOT, snapshot:false) } generated by PluginInvocation{org.apache.maven.plugins:maven-invoker-plugin:3.1.0@integration-test  integration-test}: windows-jdk7-m3.3.x_build\target\invoker-reports\*.xml
[windows-jdk7-m3.3.x_build] [withMaven] junitPublisher - Archive test results for Maven artifact org.apache.maven.plugins:maven-assembly-plugin:3.1.1-SNAPSHOT generated by maven-surefire-plugin:test (default-test): windows-jdk7-m3.3.x_build\target\surefire-reports\*.xml
[windows-jdk7-m3.3.x_build] Recording test results
[windows-jdk7-m3.3.x_build] [withMaven] openTasksPublisher - Scan Tasks for Maven artifact org.apache.maven.plugins:maven-assembly-plugin:3.1.1-SNAPSHOT in source directory windows-jdk7-m3.3.x_build\src\main\java
[windows-jdk7-m3.3.x_build] [TASKS] Scanning folder 'C:\Users\jenkins\AppData\Local\Temp\2\jenkins-maven-box-maven-assembly-plugin-master-44@2' for files matching the pattern 'windows-jdk7-m3.3.x_build\src\main\java\**\*' - excludes: null
[windows-jdk7-m3.3.x_build] [TASKS] Found 71 files to scan for tasks
[windows-jdk7-m3.3.x_build] [TASKS] Found 14 open tasks.
[windows-jdk7-m3.3.x_build] Skipping warnings blame since pipelines do not have an SCM link.%n
[windows-jdk7-m3.3.x_build] [TASKS] Computing warning deltas based on reference build #43
[Pipeline] [windows-jdk8-m3.5.x_build] }
[windows-jdk8-m3.5.x_build] [withMaven] artifactsPublisher - Archive artifact windows-jdk8-m3.5.x_build\pom.xml under org\apache\maven\plugins\maven-assembly-plugin\3.1.1-SNAPSHOT\maven-assembly-plugin-3.1.1-SNAPSHOT.pom
[windows-jdk8-m3.5.x_build] [withMaven] artifactsPublisher - Archive artifact windows-jdk8-m3.5.x_build\target\maven-assembly-plugin-3.1.1-SNAPSHOT.jar under org\apache\maven\plugins\maven-assembly-plugin\3.1.1-SNAPSHOT\maven-assembly-plugin-3.1.1-SNAPSHOT.jar
[windows-jdk8-m3.5.x_build] [withMaven] invokerPublisher - Archive invoker results for Maven artifact MavenArtifact{org.apache.maven.plugins:maven-assembly-plugin::3.1.1-SNAPSHOT(version: 3.1.1-SNAPSHOT, snapshot:false) } generated by PluginInvocation{org.apache.maven.plugins:maven-invoker-plugin:3.1.0@integration-test  integration-test}: windows-jdk8-m3.5.x_build\target\invoker-reports\*.xml
[windows-jdk8-m3.5.x_build] [withMaven] junitPublisher - Archive test results for Maven artifact org.apache.maven.plugins:maven-assembly-plugin:3.1.1-SNAPSHOT generated by maven-surefire-plugin:test (default-test): windows-jdk8-m3.5.x_build\target\surefire-reports\*.xml
[windows-jdk8-m3.5.x_build] Recording test results
[windows-jdk8-m3.5.x_build] [withMaven] openTasksPublisher - Scan Tasks for Maven artifact org.apache.maven.plugins:maven-assembly-plugin:3.1.1-SNAPSHOT in source directory windows-jdk8-m3.5.x_build\src\main\java
[windows-jdk8-m3.5.x_build] [TASKS] Scanning folder 'C:\Users\jenkins\AppData\Local\Temp\2\jenkins-maven-box-maven-assembly-plugin-master-44' for files matching the pattern 'windows-jdk8-m3.5.x_build\src\main\java\**\*' - excludes: null
[windows-jdk8-m3.5.x_build] [TASKS] Found 71 files to scan for tasks
[windows-jdk8-m3.5.x_build] [TASKS] Found 14 open tasks.
[windows-jdk8-m3.5.x_build] Skipping warnings blame since pipelines do not have an SCM link.%n
[windows-jdk8-m3.5.x_build] [TASKS] Computing warning deltas based on reference build #43
[Pipeline] [windows-jdk11-m3.5.x_build] }
[windows-jdk11-m3.5.x_build] [withMaven] artifactsPublisher - Archive artifact windows-jdk11-m3.5.x_build\pom.xml under org\apache\maven\plugins\maven-assembly-plugin\3.1.1-SNAPSHOT\maven-assembly-plugin-3.1.1-SNAPSHOT.pom
[windows-jdk11-m3.5.x_build] [withMaven] artifactsPublisher - Archive artifact windows-jdk11-m3.5.x_build\target\maven-assembly-plugin-3.1.1-SNAPSHOT.jar under org\apache\maven\plugins\maven-assembly-plugin\3.1.1-SNAPSHOT\maven-assembly-plugin-3.1.1-SNAPSHOT.jar
[windows-jdk11-m3.5.x_build] [withMaven] invokerPublisher - Archive invoker results for Maven artifact MavenArtifact{org.apache.maven.plugins:maven-assembly-plugin::3.1.1-SNAPSHOT(version: 3.1.1-SNAPSHOT, snapshot:false) } generated by PluginInvocation{org.apache.maven.plugins:maven-invoker-plugin:3.1.0@integration-test  integration-test}: windows-jdk11-m3.5.x_build\target\invoker-reports\*.xml
[windows-jdk11-m3.5.x_build] [withMaven] junitPublisher - Archive test results for Maven artifact org.apache.maven.plugins:maven-assembly-plugin:3.1.1-SNAPSHOT generated by maven-surefire-plugin:test (default-test): windows-jdk11-m3.5.x_build\target\surefire-reports\*.xml
[windows-jdk11-m3.5.x_build] Recording test results
[windows-jdk11-m3.5.x_build] [withMaven] openTasksPublisher - Scan Tasks for Maven artifact org.apache.maven.plugins:maven-assembly-plugin:3.1.1-SNAPSHOT in source directory windows-jdk11-m3.5.x_build\src\main\java
[windows-jdk11-m3.5.x_build] [TASKS] Scanning folder 'C:\Users\jenkins\AppData\Local\Temp\2\jenkins-maven-box-maven-assembly-plugin-master-44' for files matching the pattern 'windows-jdk11-m3.5.x_build\src\main\java\**\*' - excludes: null
[windows-jdk11-m3.5.x_build] [TASKS] Found 71 files to scan for tasks
[windows-jdk11-m3.5.x_build] [TASKS] Found 14 open tasks.
[windows-jdk11-m3.5.x_build] Skipping warnings blame since pipelines do not have an SCM link.%n
[windows-jdk11-m3.5.x_build] [TASKS] Computing warning deltas based on reference build #43
[Pipeline] [linux-jdk7-m3.2.x_build] }
[Pipeline] [linux-jdk8-m3.5.x_build] }
[linux-jdk8-m3.5.x_build] [withMaven] artifactsPublisher - Archive artifact linux-jdk8-m3.5.x_build/pom.xml under org/apache/maven/plugins/maven-assembly-plugin/3.1.1-SNAPSHOT/maven-assembly-plugin-3.1.1-SNAPSHOT.pom
[linux-jdk8-m3.5.x_build] [withMaven] artifactsPublisher - Archive artifact linux-jdk8-m3.5.x_build/target/maven-assembly-plugin-3.1.1-SNAPSHOT.jar under org/apache/maven/plugins/maven-assembly-plugin/3.1.1-SNAPSHOT/maven-assembly-plugin-3.1.1-SNAPSHOT.jar
[linux-jdk8-m3.5.x_build] [withMaven] invokerPublisher - Archive invoker results for Maven artifact MavenArtifact{org.apache.maven.plugins:maven-assembly-plugin::3.1.1-SNAPSHOT(version: 3.1.1-SNAPSHOT, snapshot:false) } generated by PluginInvocation{org.apache.maven.plugins:maven-invoker-plugin:3.1.0@integration-test  integration-test}: linux-jdk8-m3.5.x_build/target/invoker-reports/*.xml
[linux-jdk8-m3.5.x_build] [withMaven] junitPublisher - Archive test results for Maven artifact org.apache.maven.plugins:maven-assembly-plugin:3.1.1-SNAPSHOT generated by maven-surefire-plugin:test (default-test): linux-jdk8-m3.5.x_build/target/surefire-reports/*.xml
[linux-jdk8-m3.5.x_build] Recording test results
[linux-jdk8-m3.5.x_build] [withMaven] openTasksPublisher - Scan Tasks for Maven artifact org.apache.maven.plugins:maven-assembly-plugin:3.1.1-SNAPSHOT in source directory linux-jdk8-m3.5.x_build/src/main/java
[linux-jdk8-m3.5.x_build] [TASKS] Scanning folder '/home/jenkins/jenkins-slave/workspace/aven-assembly-plugin_master-SP4DXUL4GVN3Q5KJHI5ED6WPWUEC2L2PUW2RCT2SFVGTCXHUIFDQ@2' for files matching the pattern 'linux-jdk8-m3.5.x_build/src/main/java/**/*' - excludes: null
[linux-jdk8-m3.5.x_build] [TASKS] Found 71 files to scan for tasks
[linux-jdk8-m3.5.x_build] [TASKS] Found 14 open tasks.
[linux-jdk8-m3.5.x_build] Skipping warnings blame since pipelines do not have an SCM link.%n
[linux-jdk8-m3.5.x_build] [TASKS] Computing warning deltas based on reference build #43
[Pipeline] [linux-jdk7-m3.3.x_build] }
[Pipeline] [windows-jdk7-m3.2.x_build] // withMaven
[Pipeline] [windows-jdk7-m3.3.x_build] // withMaven
[Pipeline] [windows-jdk8-m3.5.x_build] // withMaven
[Pipeline] [windows-jdk11-m3.5.x_build] // withMaven
[Pipeline] [linux-jdk7-m3.2.x_build] // ws
[Pipeline] [linux-jdk8-m3.5.x_build] // withMaven
[Pipeline] [windows-jdk7-m3.2.x_build] cleanWs
[Pipeline] [windows-jdk7-m3.3.x_build] cleanWs
[Pipeline] [windows-jdk7-m3.5.x_build] }
[Pipeline] [windows-jdk8-m3.5.x_build] cleanWs
[Pipeline] [windows-jdk11-m3.5.x_build] cleanWs
[Pipeline] [linux-jdk7-m3.2.x_build] }
[Pipeline] [linux-jdk7-m3.5.x_build] }
[Pipeline] [linux-jdk8-m3.5.x_build] cleanWs
[Pipeline] [linux-jdk11-m3.5.x_build] }
[windows-jdk8-m3.5.x_build] [WS-CLEANUP] Deleting project workspace...Cannot delete workspace :remote file operation failed: C:\Users\jenkins\AppData\Local\Temp\2/jenkins-maven-box-maven-assembly-plugin-master-44 at hudson.remoting.Channel@121270d5:JNLP4-connect connection from 37.48.69.226/37.48.69.226:54213: java.nio.file.AccessDeniedException: C:\Users\jenkins\AppData\Local\Temp\2\jenkins-maven-box-maven-assembly-plugin-master-44 -> C:\Users\jenkins\AppData\Local\Temp\2\jenkins-maven-box-maven-assembly-plugin-master-44_ws-cleanup_1546001295327
[Pipeline] [linux-jdk7-m3.3.x_build] // stage
[Pipeline] [linux-jdk7-m3.3.x_build] }
[windows-jdk7-m3.2.x_build] [WS-CLEANUP] Deleting project workspace...Cannot delete workspace :remote file operation failed: C:\Users\jenkins\AppData\Local\Temp\2/jenkins-maven-box-maven-assembly-plugin-master-44 at hudson.remoting.Channel@7f96cc69:JNLP4-connect connection from 37.48.69.226/37.48.69.226:63010: java.nio.file.AccessDeniedException: C:\Users\jenkins\AppData\Local\Temp\2\jenkins-maven-box-maven-assembly-plugin-master-44 -> C:\Users\jenkins\AppData\Local\Temp\2\jenkins-maven-box-maven-assembly-plugin-master-44_ws-cleanup_1546001295326
[windows-jdk7-m3.3.x_build] [WS-CLEANUP] Deleting project workspace...Cannot delete workspace :remote file operation failed: C:\Users\jenkins\AppData\Local\Temp\2/jenkins-maven-box-maven-assembly-plugin-master-44@2 at hudson.remoting.Channel@7f96cc69:JNLP4-connect connection from 37.48.69.226/37.48.69.226:63010: java.nio.file.AccessDeniedException: C:\Users\jenkins\AppData\Local\Temp\2\jenkins-maven-box-maven-assembly-plugin-master-44@2 -> C:\Users\jenkins\AppData\Local\Temp\2\jenkins-maven-box-maven-assembly-plugin-master-44@2_ws-cleanup_1546001295327
[windows-jdk11-m3.5.x_build] [WS-CLEANUP] Deleting project workspace...Cannot delete workspace :remote file operation failed: C:\Users\jenkins\AppData\Local\Temp\2/jenkins-maven-box-maven-assembly-plugin-master-44 at hudson.remoting.Channel@4ee2423:JNLP4-connect connection from 37.48.69.226/37.48.69.226:64887: java.nio.file.AccessDeniedException: C:\Users\jenkins\AppData\Local\Temp\2\jenkins-maven-box-maven-assembly-plugin-master-44 -> C:\Users\jenkins\AppData\Local\Temp\2\jenkins-maven-box-maven-assembly-plugin-master-44_ws-cleanup_1546001295335
[Pipeline] [windows-jdk7-m3.5.x_build] // dir
[Pipeline] [linux-jdk7-m3.2.x_build] // node
[Pipeline] [linux-jdk7-m3.5.x_build] // stage
[Pipeline] [linux-jdk11-m3.5.x_build] // stage
[linux-jdk8-m3.5.x_build] [WS-CLEANUP] Deleting project workspace...[WS-CLEANUP] done
[Pipeline] [linux-jdk7-m3.2.x_build] }
[Pipeline] [windows-jdk7-m3.5.x_build] }
[windows-jdk7-m3.5.x_build] [withMaven] artifactsPublisher - Archive artifact windows-jdk7-m3.5.x_build\pom.xml under org\apache\maven\plugins\maven-assembly-plugin\3.1.1-SNAPSHOT\maven-assembly-plugin-3.1.1-SNAPSHOT.pom
[windows-jdk7-m3.5.x_build] [withMaven] artifactsPublisher - Archive artifact windows-jdk7-m3.5.x_build\target\maven-assembly-plugin-3.1.1-SNAPSHOT.jar under org\apache\maven\plugins\maven-assembly-plugin\3.1.1-SNAPSHOT\maven-assembly-plugin-3.1.1-SNAPSHOT.jar
[windows-jdk7-m3.5.x_build] [withMaven] invokerPublisher - Archive invoker results for Maven artifact MavenArtifact{org.apache.maven.plugins:maven-assembly-plugin::3.1.1-SNAPSHOT(version: 3.1.1-SNAPSHOT, snapshot:false) } generated by PluginInvocation{org.apache.maven.plugins:maven-invoker-plugin:3.1.0@integration-test  integration-test}: windows-jdk7-m3.5.x_build\target\invoker-reports\*.xml
[windows-jdk7-m3.5.x_build] [withMaven] junitPublisher - Archive test results for Maven artifact org.apache.maven.plugins:maven-assembly-plugin:3.1.1-SNAPSHOT generated by maven-surefire-plugin:test (default-test): windows-jdk7-m3.5.x_build\target\surefire-reports\*.xml
[windows-jdk7-m3.5.x_build] Recording test results
[windows-jdk7-m3.5.x_build] [withMaven] openTasksPublisher - Scan Tasks for Maven artifact org.apache.maven.plugins:maven-assembly-plugin:3.1.1-SNAPSHOT in source directory windows-jdk7-m3.5.x_build\src\main\java
[windows-jdk7-m3.5.x_build] [TASKS] Scanning folder 'C:\Users\jenkins\AppData\Local\Temp\2\jenkins-maven-box-maven-assembly-plugin-master-44' for files matching the pattern 'windows-jdk7-m3.5.x_build\src\main\java\**\*' - excludes: null
[windows-jdk7-m3.5.x_build] [TASKS] Found 71 files to scan for tasks
[windows-jdk7-m3.5.x_build] [TASKS] Found 14 open tasks.
[windows-jdk7-m3.5.x_build] Skipping warnings blame since pipelines do not have an SCM link.%n
[windows-jdk7-m3.5.x_build] [TASKS] Computing warning deltas based on reference build #43
[Pipeline] [linux-jdk7-m3.5.x_build] }
[Pipeline] [linux-jdk11-m3.5.x_build] }
[Pipeline] [linux-jdk7-m3.3.x_build] // ws
[Pipeline] [windows-jdk7-m3.2.x_build] }
[Pipeline] [windows-jdk7-m3.3.x_build] }
[Pipeline] [windows-jdk8-m3.5.x_build] }
[Pipeline] [windows-jdk11-m3.5.x_build] }
[Pipeline] [linux-jdk7-m3.3.x_build] }
[Pipeline] [windows-jdk7-m3.5.x_build] // withMaven
[Pipeline] [linux-jdk7-m3.5.x_build] // ws
[Pipeline] [linux-jdk11-m3.5.x_build] // ws
[Pipeline] [windows-jdk7-m3.5.x_build] cleanWs
[Pipeline] [linux-jdk7-m3.5.x_build] }
[Pipeline] [linux-jdk8-m3.5.x_build] }
[Pipeline] [linux-jdk11-m3.5.x_build] }
[windows-jdk7-m3.5.x_build] [WS-CLEANUP] Deleting project workspace...Cannot delete workspace :remote file operation failed: C:\Users\jenkins\AppData\Local\Temp\2/jenkins-maven-box-maven-assembly-plugin-master-44 at hudson.remoting.Channel@6abd639f:JNLP4-connect connection from 37.48.69.226/37.48.69.226:55130: java.nio.file.AccessDeniedException: C:\Users\jenkins\AppData\Local\Temp\2\jenkins-maven-box-maven-assembly-plugin-master-44 -> C:\Users\jenkins\AppData\Local\Temp\2\jenkins-maven-box-maven-assembly-plugin-master-44_ws-cleanup_1546001460470
[Pipeline] [windows-jdk7-m3.2.x_build] // stage
[Pipeline] [windows-jdk7-m3.3.x_build] // stage
[Pipeline] [windows-jdk8-m3.5.x_build] // stage
[Pipeline] [windows-jdk11-m3.5.x_build] // stage
[Pipeline] [linux-jdk7-m3.3.x_build] // node
[Pipeline] [linux-jdk7-m3.3.x_build] }
[Pipeline] [windows-jdk7-m3.2.x_build] }
[Pipeline] [windows-jdk7-m3.3.x_build] }
[Pipeline] [windows-jdk8-m3.5.x_build] }
[Pipeline] [windows-jdk11-m3.5.x_build] }
[Pipeline] [linux-jdk7-m3.5.x_build] // node
[Pipeline] [linux-jdk8-m3.5.x_build] // stage
[Pipeline] [linux-jdk11-m3.5.x_build] // node
[Pipeline] [linux-jdk7-m3.5.x_build] }
[Pipeline] [linux-jdk11-m3.5.x_build] }
[Pipeline] [linux-jdk8-m3.5.x_build] }
[Pipeline] [windows-jdk7-m3.5.x_build] }
[Pipeline] [windows-jdk7-m3.2.x_build] // ws
[Pipeline] [windows-jdk7-m3.3.x_build] // ws
[Pipeline] [windows-jdk8-m3.5.x_build] // ws
[Pipeline] [windows-jdk11-m3.5.x_build] // ws
[Pipeline] [windows-jdk7-m3.2.x_build] }
[Pipeline] [windows-jdk7-m3.3.x_build] }
[Pipeline] [windows-jdk8-m3.5.x_build] }
[Pipeline] [windows-jdk11-m3.5.x_build] }
[Pipeline] [linux-jdk8-m3.5.x_build] // ws
[Pipeline] [linux-jdk8-m3.5.x_build] }
[Pipeline] [windows-jdk7-m3.5.x_build] // stage
[Pipeline] [windows-jdk7-m3.5.x_build] }
[Pipeline] [windows-jdk7-m3.2.x_build] // node
[Pipeline] [windows-jdk7-m3.3.x_build] // node
[Pipeline] [windows-jdk8-m3.5.x_build] // node
[Pipeline] [windows-jdk11-m3.5.x_build] // node
[Pipeline] [windows-jdk7-m3.2.x_build] }
[windows-jdk7-m3.2.x_build] Failed in branch windows-jdk7-m3.2.x_build
[Pipeline] [windows-jdk7-m3.3.x_build] }
[windows-jdk7-m3.3.x_build] Failed in branch windows-jdk7-m3.3.x_build
[Pipeline] [windows-jdk8-m3.5.x_build] }
[windows-jdk8-m3.5.x_build] Failed in branch windows-jdk8-m3.5.x_build
[Pipeline] [windows-jdk11-m3.5.x_build] }
[windows-jdk11-m3.5.x_build] Failed in branch windows-jdk11-m3.5.x_build
[Pipeline] [linux-jdk8-m3.5.x_build] // node
[Pipeline] [linux-jdk8-m3.5.x_build] }
[Pipeline] [windows-jdk7-m3.5.x_build] // ws
[Pipeline] [windows-jdk7-m3.5.x_build] }
[Pipeline] [windows-jdk7-m3.5.x_build] // node
[Pipeline] [windows-jdk7-m3.5.x_build] }
[windows-jdk7-m3.5.x_build] Failed in branch windows-jdk7-m3.5.x_build
[Pipeline] // parallel
[Pipeline] stage
[Pipeline] { (Notifications)
[Pipeline] echo
Build result: FAILURE
[Pipeline] jiraIssueSelector
[Pipeline] emailext
Reply | Threaded
Open this post in threaded view
|

Build failed in Jenkins: Maven TLP » maven-assembly-plugin » master #45

Apache Jenkins Server-2
See https://builds.apache.org/job/maven-box/job/maven-assembly-plugin/job/master/45/

Changes:

* Activate sonarqube on first project
* Disable sonar:sonar for now
* [MASSEMBLY-902]  Some Integration tests fails if launched with an very
* MASSEMBLY-901 Fix trivial javadocs HTML errors
* [MASSEMBLY-902]  Some Integration tests fails if launched with an very
* MASSEMBLY-901 Fix trivial javadocs HTML errors
* [MASSEMBLY-902]  Some Integration tests fails if launched with an very
* MASSEMBLY-901 Fix trivial javadocs HTML errors
* [MASSEMBLY-902]  Some Integration tests fails if launched with an very
* MASSEMBLY-901 Fix trivial javadocs HTML errors
* [MASSEMBLY-902]  Some Integration tests fails if launched with an very
* MASSEMBLY-901 Fix trivial javadocs HTML errors
* [MASSEMBLY-902]  Some Integration tests fails if launched with an very
* MASSEMBLY-901 Fix trivial javadocs HTML errors
* [MASSEMBLY-902]  Some Integration tests fails if launched with an very
* MASSEMBLY-901 Fix trivial javadocs HTML errors
* [MASSEMBLY-902]  Some Integration tests fails if launched with an very
* MASSEMBLY-901 Fix trivial javadocs HTML errors

All tests passed

Build log:
[...truncated 4.05 MB...]
[Pipeline] [windows-jdk8-m3.5.x_build] // dir
[Pipeline] [windows-jdk7-m3.3.x_build] // dir
[Pipeline] [windows-jdk7-m3.5.x_build] // dir
[windows-jdk11-m3.5.x_build] [WS-CLEANUP] Deleting project workspace...Cannot delete workspace :remote file operation failed: C:\Users\jenkins\AppData\Local\Temp\2/jenkins-maven-box-maven-assembly-plugin-master-45 at hudson.remoting.Channel@398d98d3:JNLP4-connect connection from ec2-34-228-168-168.compute-1.amazonaws.com/34.228.168.168:51626: java.nio.file.AccessDeniedException: C:\Users\jenkins\AppData\Local\Temp\2\jenkins-maven-box-maven-assembly-plugin-master-45 -> C:\Users\jenkins\AppData\Local\Temp\2\jenkins-maven-box-maven-assembly-plugin-master-45_ws-cleanup_1546011188409
[linux-jdk7-m3.2.x_build] [WS-CLEANUP] Deleting project workspace...[WS-CLEANUP] done
[linux-jdk11-m3.5.x_build] [WS-CLEANUP] Deleting project workspace...[WS-CLEANUP] done
[windows-jdk7-m3.2.x_build] [INFO] run post-build script verify.bsh
[windows-jdk7-m3.2.x_build] [INFO]           projects\repositories\massembly-196\pom.xml ...... SUCCESS (18.0 s)
[windows-jdk7-m3.2.x_build] [INFO] Building: projects\repositories\massembly-855\pom.xml
[windows-jdk7-m3.2.x_build] [INFO] run post-build script verify.bsh
[windows-jdk7-m3.2.x_build] [INFO]           projects\repositories\massembly-855\pom.xml ...... SUCCESS (6.2 s)
[windows-jdk7-m3.2.x_build] [INFO]
[windows-jdk7-m3.2.x_build] [INFO] --- maven-checkstyle-plugin:3.0.0:check (checkstyle-check) @ maven-assembly-plugin ---
[windows-jdk7-m3.2.x_build] [INFO] Downloading: https://repo.maven.apache.org/maven2/org/apache/maven/shared/maven-shared-resources/2/maven-shared-resources-2.pom
[windows-jdk7-m3.2.x_build] [INFO] Downloaded: https://repo.maven.apache.org/maven2/org/apache/maven/shared/maven-shared-resources/2/maven-shared-resources-2.pom (3 KB at 27.8 KB/sec)
[windows-jdk7-m3.2.x_build] [INFO] Downloading: https://repo.maven.apache.org/maven2/org/codehaus/plexus/plexus-utils/3.0.10/plexus-utils-3.0.10.pom
[windows-jdk7-m3.2.x_build] [INFO] Downloaded: https://repo.maven.apache.org/maven2/org/codehaus/plexus/plexus-utils/3.0.10/plexus-utils-3.0.10.pom (4 KB at 74.9 KB/sec)
[windows-jdk7-m3.2.x_build] [INFO] Downloading: https://repo.maven.apache.org/maven2/org/codehaus/plexus/plexus/3.3/plexus-3.3.pom
[windows-jdk7-m3.2.x_build] [INFO] Downloaded: https://repo.maven.apache.org/maven2/org/codehaus/plexus/plexus/3.3/plexus-3.3.pom (20 KB at 329.4 KB/sec)
[windows-jdk7-m3.2.x_build] [INFO] Downloading: https://repo.maven.apache.org/maven2/org/apache/maven/doxia/doxia-integration-tools/1.6/doxia-integration-tools-1.6.pom
[windows-jdk7-m3.2.x_build] [INFO] Downloaded: https://repo.maven.apache.org/maven2/org/apache/maven/doxia/doxia-integration-tools/1.6/doxia-integration-tools-1.6.pom (7 KB at 128.2 KB/sec)
[windows-jdk7-m3.2.x_build] [INFO] Downloading: https://repo.maven.apache.org/maven2/org/apache/maven/doxia/doxia-tools/3/doxia-tools-3.pom
[windows-jdk7-m3.2.x_build] [INFO] Downloaded: https://repo.maven.apache.org/maven2/org/apache/maven/doxia/doxia-tools/3/doxia-tools-3.pom (10 KB at 176.3 KB/sec)
[windows-jdk7-m3.2.x_build] [INFO] Downloading: https://repo.maven.apache.org/maven2/org/codehaus/plexus/plexus-resources/1.1.0/plexus-resources-1.1.0.pom
[windows-jdk7-m3.2.x_build] [INFO] Downloaded: https://repo.maven.apache.org/maven2/org/codehaus/plexus/plexus-resources/1.1.0/plexus-resources-1.1.0.pom (4 KB at 58.5 KB/sec)
[windows-jdk7-m3.2.x_build] [INFO] Downloading: https://repo.maven.apache.org/maven2/com/puppycrawl/tools/checkstyle/6.18/checkstyle-6.18.pom
[windows-jdk7-m3.2.x_build] [INFO] Downloaded: https://repo.maven.apache.org/maven2/com/puppycrawl/tools/checkstyle/6.18/checkstyle-6.18.pom (70 KB at 990.9 KB/sec)
[windows-jdk7-m3.2.x_build] [INFO] Downloading: https://repo.maven.apache.org/maven2/antlr/antlr/2.7.7/antlr-2.7.7.pom
[windows-jdk7-m3.2.x_build] [INFO] Downloaded: https://repo.maven.apache.org/maven2/antlr/antlr/2.7.7/antlr-2.7.7.pom (632 B at 11.6 KB/sec)
[windows-jdk7-m3.2.x_build] [INFO] Downloading: https://repo.maven.apache.org/maven2/org/antlr/antlr4-runtime/4.5.3/antlr4-runtime-4.5.3.pom
[windows-jdk7-m3.2.x_build] [INFO] Downloaded: https://repo.maven.apache.org/maven2/org/antlr/antlr4-runtime/4.5.3/antlr4-runtime-4.5.3.pom (3 KB at 47.0 KB/sec)
[windows-jdk7-m3.2.x_build] [INFO] Downloading: https://repo.maven.apache.org/maven2/org/antlr/antlr4-master/4.5.3/antlr4-master-4.5.3.pom
[windows-jdk7-m3.2.x_build] [INFO] Downloaded: https://repo.maven.apache.org/maven2/org/antlr/antlr4-master/4.5.3/antlr4-master-4.5.3.pom (4 KB at 70.5 KB/sec)
[windows-jdk7-m3.2.x_build] [INFO] Downloading: https://repo.maven.apache.org/maven2/commons-beanutils/commons-beanutils/1.9.2/commons-beanutils-1.9.2.pom
[windows-jdk7-m3.2.x_build] [INFO] Downloaded: https://repo.maven.apache.org/maven2/commons-beanutils/commons-beanutils/1.9.2/commons-beanutils-1.9.2.pom (14 KB at 240.9 KB/sec)
[windows-jdk7-m3.2.x_build] [INFO] Downloading: https://repo.maven.apache.org/maven2/org/apache/commons/commons-parent/33/commons-parent-33.pom
[windows-jdk7-m3.2.x_build] [INFO] Downloaded: https://repo.maven.apache.org/maven2/org/apache/commons/commons-parent/33/commons-parent-33.pom (52 KB at 751.4 KB/sec)
[windows-jdk7-m3.2.x_build] [INFO] Downloading: https://repo.maven.apache.org/maven2/commons-cli/commons-cli/1.3.1/commons-cli-1.3.1.pom
[windows-jdk7-m3.2.x_build] [INFO] Downloaded: https://repo.maven.apache.org/maven2/commons-cli/commons-cli/1.3.1/commons-cli-1.3.1.pom (11 KB at 188.0 KB/sec)
[windows-jdk7-m3.2.x_build] [INFO] Downloading: https://repo.maven.apache.org/maven2/com/google/guava/guava/19.0/guava-19.0.pom
[windows-jdk7-m3.2.x_build] [INFO] Downloaded: https://repo.maven.apache.org/maven2/com/google/guava/guava/19.0/guava-19.0.pom (7 KB at 112.4 KB/sec)
[windows-jdk7-m3.2.x_build] [INFO] Downloading: https://repo.maven.apache.org/maven2/com/google/guava/guava-parent/19.0/guava-parent-19.0.pom
[windows-jdk7-m3.2.x_build] [INFO] Downloaded: https://repo.maven.apache.org/maven2/com/google/guava/guava-parent/19.0/guava-parent-19.0.pom (10 KB at 166.3 KB/sec)
[windows-jdk7-m3.2.x_build] [INFO] Downloading: https://repo.maven.apache.org/maven2/org/sonatype/oss/oss-parent/7/oss-parent-7.pom
[windows-jdk7-m3.2.x_build] [INFO] Downloaded: https://repo.maven.apache.org/maven2/org/sonatype/oss/oss-parent/7/oss-parent-7.pom (5 KB at 92.4 KB/sec)
[windows-jdk7-m3.2.x_build] [INFO] Downloading: https://repo.maven.apache.org/maven2/org/apache/maven/shared/maven-shared-resources/2/maven-shared-resources-2.jar
[windows-jdk7-m3.2.x_build] [INFO] Downloading: https://repo.maven.apache.org/maven2/commons-logging/commons-logging/1.0.4/commons-logging-1.0.4.jar
[windows-jdk7-m3.2.x_build] [INFO] Downloading: https://repo.maven.apache.org/maven2/org/apache/maven/doxia/doxia-core/1.2/doxia-core-1.2.jar
[windows-jdk7-m3.2.x_build] [INFO] Downloading: https://repo.maven.apache.org/maven2/commons-digester/commons-digester/1.6/commons-digester-1.6.jar
[windows-jdk7-m3.2.x_build] [INFO] Downloading: https://repo.maven.apache.org/maven2/org/apache/maven/doxia/doxia-integration-tools/1.6/doxia-integration-tools-1.6.jar
[windows-jdk7-m3.2.x_build] [INFO] Downloaded: https://repo.maven.apache.org/maven2/commons-logging/commons-logging/1.0.4/commons-logging-1.0.4.jar (38 KB at 675.0 KB/sec)
[windows-jdk7-m3.2.x_build] [INFO] Downloading: https://repo.maven.apache.org/maven2/commons-io/commons-io/1.4/commons-io-1.4.jar
[windows-jdk7-m3.2.x_build] [INFO] Downloaded: https://repo.maven.apache.org/maven2/commons-digester/commons-digester/1.6/commons-digester-1.6.jar (165 KB at 1495.4 KB/sec)
[windows-jdk7-m3.2.x_build] [INFO] Downloading: https://repo.maven.apache.org/maven2/org/codehaus/plexus/plexus-resources/1.1.0/plexus-resources-1.1.0.jar
[windows-jdk7-m3.2.x_build] [INFO] Downloaded: https://repo.maven.apache.org/maven2/commons-io/commons-io/1.4/commons-io-1.4.jar (107 KB at 788.8 KB/sec)
[windows-jdk7-m3.2.x_build] [INFO] Downloading: https://repo.maven.apache.org/maven2/com/puppycrawl/tools/checkstyle/6.18/checkstyle-6.18.jar
[windows-jdk7-m3.2.x_build] [INFO] Downloaded: https://repo.maven.apache.org/maven2/org/apache/maven/doxia/doxia-core/1.2/doxia-core-1.2.jar (151 KB at 395.0 KB/sec)
[windows-jdk7-m3.2.x_build] [INFO] Downloading: https://repo.maven.apache.org/maven2/antlr/antlr/2.7.7/antlr-2.7.7.jar
[windows-jdk7-m3.2.x_build] [INFO] Downloaded: https://repo.maven.apache.org/maven2/org/apache/maven/shared/maven-shared-resources/2/maven-shared-resources-2.jar (13 KB at 30.1 KB/sec)
[windows-jdk7-m3.2.x_build] [INFO] Downloading: https://repo.maven.apache.org/maven2/org/antlr/antlr4-runtime/4.5.3/antlr4-runtime-4.5.3.jar
[windows-jdk7-m3.2.x_build] [INFO] Downloaded: https://repo.maven.apache.org/maven2/antlr/antlr/2.7.7/antlr-2.7.7.jar (435 KB at 979.4 KB/sec)
[windows-jdk7-m3.2.x_build] [INFO] Downloading: https://repo.maven.apache.org/maven2/commons-beanutils/commons-beanutils/1.9.2/commons-beanutils-1.9.2.jar
[windows-jdk7-m3.2.x_build] [INFO] Downloaded: https://repo.maven.apache.org/maven2/org/codehaus/plexus/plexus-resources/1.1.0/plexus-resources-1.1.0.jar (23 KB at 43.4 KB/sec)
[windows-jdk7-m3.2.x_build] [INFO] Downloading: https://repo.maven.apache.org/maven2/commons-cli/commons-cli/1.3.1/commons-cli-1.3.1.jar
[windows-jdk7-m3.2.x_build] [INFO] Downloaded: https://repo.maven.apache.org/maven2/org/apache/maven/doxia/doxia-integration-tools/1.6/doxia-integration-tools-1.6.jar (44 KB at 67.6 KB/sec)
[windows-jdk7-m3.2.x_build] [INFO] Downloading: https://repo.maven.apache.org/maven2/com/google/guava/guava/19.0/guava-19.0.jar
[windows-jdk7-m3.2.x_build] [INFO] Downloaded: https://repo.maven.apache.org/maven2/commons-beanutils/commons-beanutils/1.9.2/commons-beanutils-1.9.2.jar (229 KB at 349.2 KB/sec)
[windows-jdk7-m3.2.x_build] [INFO] Downloading: https://repo.maven.apache.org/maven2/commons-lang/commons-lang/2.1/commons-lang-2.1.jar
[windows-jdk7-m3.2.x_build] [INFO] Downloaded: https://repo.maven.apache.org/maven2/org/antlr/antlr4-runtime/4.5.3/antlr4-runtime-4.5.3.jar (296 KB at 437.9 KB/sec)
[windows-jdk7-m3.2.x_build] [INFO] Downloaded: https://repo.maven.apache.org/maven2/commons-lang/commons-lang/2.1/commons-lang-2.1.jar (203 KB at 282.1 KB/sec)
[windows-jdk7-m3.2.x_build] [INFO] Downloaded: https://repo.maven.apache.org/maven2/com/puppycrawl/tools/checkstyle/6.18/checkstyle-6.18.jar (1132 KB at 1568.9 KB/sec)
[windows-jdk7-m3.2.x_build] [INFO] Downloaded: https://repo.maven.apache.org/maven2/commons-cli/commons-cli/1.3.1/commons-cli-1.3.1.jar (52 KB at 68.4 KB/sec)
[windows-jdk7-m3.2.x_build] [INFO] Downloaded: https://repo.maven.apache.org/maven2/com/google/guava/guava/19.0/guava-19.0.jar (2255 KB at 2034.7 KB/sec)
[windows-jdk7-m3.2.x_build] [INFO] There are 2 errors reported by Checkstyle 6.18 with config/maven_checks.xml ruleset.
[windows-jdk7-m3.2.x_build] [INFO] Ignored 2 errors, 0 violation remaining.
[windows-jdk7-m3.2.x_build] [INFO]
[windows-jdk7-m3.2.x_build] [INFO] --- maven-invoker-plugin:3.1.0:verify (integration-test) @ maven-assembly-plugin ---
[windows-jdk7-m3.2.x_build] [INFO] -------------------------------------------------
[windows-jdk7-m3.2.x_build] [INFO] Build Summary:
[windows-jdk7-m3.2.x_build] [INFO]   Passed: 134, Failed: 0, Errors: 0, Skipped: 3
[windows-jdk7-m3.2.x_build] [INFO] -------------------------------------------------
[windows-jdk7-m3.2.x_build] [INFO] ------------------------------------------------------------------------
[windows-jdk7-m3.2.x_build] [INFO] BUILD SUCCESS
[windows-jdk7-m3.2.x_build] [INFO] ------------------------------------------------------------------------
[windows-jdk7-m3.2.x_build] [INFO] Total time: 25:49 min
[windows-jdk7-m3.2.x_build] [INFO] Finished at: 2018-12-28T07:33:32-08:00
[windows-jdk7-m3.2.x_build] [INFO] Final Memory: 47M/318M
[windows-jdk7-m3.2.x_build] [INFO] ------------------------------------------------------------------------
[windows-jdk7-m3.2.x_build] [INFO] [jenkins-event-spy] Generated C:\Users\jenkins\AppData\Local\Temp\2\jenkins-maven-box-maven-assembly-plugin-master-45@tmp\withMavene982d4d8\maven-spy-20181228-070741-8242536332965771400388.log
[windows-jdk7-m3.2.x_build] Picked up JAVA_TOOL_OPTIONS: -Dmaven.ext.class.path="C:\Users\jenkins\AppData\Local\Temp\2\jenkins-maven-box-maven-assembly-plugin-master-45@tmp\withMavene982d4d8\pipeline-maven-spy.jar" -Dorg.jenkinsci.plugins.pipeline.maven.reportsFolder="C:\Users\jenkins\AppData\Local\Temp\2\jenkins-maven-box-maven-assembly-plugin-master-45@tmp\withMavene982d4d8"
[Pipeline] [linux-jdk8-m3.5.x_build] }
[Pipeline] [linux-jdk7-m3.5.x_build] }
[linux-jdk7-m3.5.x_build] [withMaven] artifactsPublisher - Archive artifact linux-jdk7-m3.5.x_build/pom.xml under org/apache/maven/plugins/maven-assembly-plugin/3.1.1-SNAPSHOT/maven-assembly-plugin-3.1.1-SNAPSHOT.pom
[linux-jdk7-m3.5.x_build] [withMaven] artifactsPublisher - Archive artifact linux-jdk7-m3.5.x_build/target/maven-assembly-plugin-3.1.1-SNAPSHOT.jar under org/apache/maven/plugins/maven-assembly-plugin/3.1.1-SNAPSHOT/maven-assembly-plugin-3.1.1-SNAPSHOT.jar
[linux-jdk7-m3.5.x_build] [withMaven] invokerPublisher - Archive invoker results for Maven artifact MavenArtifact{org.apache.maven.plugins:maven-assembly-plugin::3.1.1-SNAPSHOT(version: 3.1.1-SNAPSHOT, snapshot:false) } generated by PluginInvocation{org.apache.maven.plugins:maven-invoker-plugin:3.1.0@integration-test  integration-test}: linux-jdk7-m3.5.x_build/target/invoker-reports/*.xml
[linux-jdk7-m3.5.x_build] [withMaven] junitPublisher - Archive test results for Maven artifact org.apache.maven.plugins:maven-assembly-plugin:3.1.1-SNAPSHOT generated by maven-surefire-plugin:test (default-test): linux-jdk7-m3.5.x_build/target/surefire-reports/*.xml
[linux-jdk7-m3.5.x_build] Recording test results
[linux-jdk7-m3.5.x_build] [withMaven] openTasksPublisher - Scan Tasks for Maven artifact org.apache.maven.plugins:maven-assembly-plugin:3.1.1-SNAPSHOT in source directory linux-jdk7-m3.5.x_build/src/main/java
[linux-jdk7-m3.5.x_build] [TASKS] Scanning folder '/home/jenkins/jenkins-slave/workspace/aven-assembly-plugin_master-SP4DXUL4GVN3Q5KJHI5ED6WPWUEC2L2PUW2RCT2SFVGTCXHUIFDQ@2' for files matching the pattern 'linux-jdk7-m3.5.x_build/src/main/java/**/*' - excludes: null
[linux-jdk7-m3.5.x_build] [TASKS] Found 71 files to scan for tasks
[linux-jdk7-m3.5.x_build] [TASKS] Found 14 open tasks.
[linux-jdk7-m3.5.x_build] Skipping warnings blame since pipelines do not have an SCM link.%n
[linux-jdk7-m3.5.x_build] [TASKS] Computing warning deltas based on reference build #43
[Pipeline] [windows-jdk8-m3.5.x_build] }
[windows-jdk8-m3.5.x_build] [withMaven] artifactsPublisher - Archive artifact windows-jdk8-m3.5.x_build\pom.xml under org\apache\maven\plugins\maven-assembly-plugin\3.1.1-SNAPSHOT\maven-assembly-plugin-3.1.1-SNAPSHOT.pom
[windows-jdk8-m3.5.x_build] [withMaven] artifactsPublisher - Archive artifact windows-jdk8-m3.5.x_build\target\maven-assembly-plugin-3.1.1-SNAPSHOT.jar under org\apache\maven\plugins\maven-assembly-plugin\3.1.1-SNAPSHOT\maven-assembly-plugin-3.1.1-SNAPSHOT.jar
[windows-jdk8-m3.5.x_build] [withMaven] invokerPublisher - Archive invoker results for Maven artifact MavenArtifact{org.apache.maven.plugins:maven-assembly-plugin::3.1.1-SNAPSHOT(version: 3.1.1-SNAPSHOT, snapshot:false) } generated by PluginInvocation{org.apache.maven.plugins:maven-invoker-plugin:3.1.0@integration-test  integration-test}: windows-jdk8-m3.5.x_build\target\invoker-reports\*.xml
[windows-jdk8-m3.5.x_build] [withMaven] junitPublisher - Archive test results for Maven artifact org.apache.maven.plugins:maven-assembly-plugin:3.1.1-SNAPSHOT generated by maven-surefire-plugin:test (default-test): windows-jdk8-m3.5.x_build\target\surefire-reports\*.xml
[windows-jdk8-m3.5.x_build] Recording test results
[windows-jdk8-m3.5.x_build] [withMaven] openTasksPublisher - Scan Tasks for Maven artifact org.apache.maven.plugins:maven-assembly-plugin:3.1.1-SNAPSHOT in source directory windows-jdk8-m3.5.x_build\src\main\java
[windows-jdk8-m3.5.x_build] [TASKS] Scanning folder 'C:\Users\jenkins\AppData\Local\Temp\2\jenkins-maven-box-maven-assembly-plugin-master-45' for files matching the pattern 'windows-jdk8-m3.5.x_build\src\main\java\**\*' - excludes: null
[windows-jdk8-m3.5.x_build] [TASKS] Found 71 files to scan for tasks
[windows-jdk8-m3.5.x_build] [TASKS] Found 14 open tasks.
[windows-jdk8-m3.5.x_build] Skipping warnings blame since pipelines do not have an SCM link.%n
[windows-jdk8-m3.5.x_build] [TASKS] Computing warning deltas based on reference build #43
[Pipeline] [windows-jdk7-m3.3.x_build] }
[windows-jdk7-m3.3.x_build] [withMaven] artifactsPublisher - Archive artifact windows-jdk7-m3.3.x_build\pom.xml under org\apache\maven\plugins\maven-assembly-plugin\3.1.1-SNAPSHOT\maven-assembly-plugin-3.1.1-SNAPSHOT.pom
[windows-jdk7-m3.3.x_build] [withMaven] artifactsPublisher - Archive artifact windows-jdk7-m3.3.x_build\target\maven-assembly-plugin-3.1.1-SNAPSHOT.jar under org\apache\maven\plugins\maven-assembly-plugin\3.1.1-SNAPSHOT\maven-assembly-plugin-3.1.1-SNAPSHOT.jar
[windows-jdk7-m3.3.x_build] [withMaven] invokerPublisher - Archive invoker results for Maven artifact MavenArtifact{org.apache.maven.plugins:maven-assembly-plugin::3.1.1-SNAPSHOT(version: 3.1.1-SNAPSHOT, snapshot:false) } generated by PluginInvocation{org.apache.maven.plugins:maven-invoker-plugin:3.1.0@integration-test  integration-test}: windows-jdk7-m3.3.x_build\target\invoker-reports\*.xml
[windows-jdk7-m3.3.x_build] [withMaven] junitPublisher - Archive test results for Maven artifact org.apache.maven.plugins:maven-assembly-plugin:3.1.1-SNAPSHOT generated by maven-surefire-plugin:test (default-test): windows-jdk7-m3.3.x_build\target\surefire-reports\*.xml
[windows-jdk7-m3.3.x_build] Recording test results
[windows-jdk7-m3.3.x_build] [withMaven] openTasksPublisher - Scan Tasks for Maven artifact org.apache.maven.plugins:maven-assembly-plugin:3.1.1-SNAPSHOT in source directory windows-jdk7-m3.3.x_build\src\main\java
[windows-jdk7-m3.3.x_build] [TASKS] Scanning folder 'C:\Users\jenkins\AppData\Local\Temp\2\jenkins-maven-box-maven-assembly-plugin-master-45' for files matching the pattern 'windows-jdk7-m3.3.x_build\src\main\java\**\*' - excludes: null
[windows-jdk7-m3.3.x_build] [TASKS] Found 71 files to scan for tasks
[windows-jdk7-m3.3.x_build] [TASKS] Found 14 open tasks.
[windows-jdk7-m3.3.x_build] Skipping warnings blame since pipelines do not have an SCM link.%n
[windows-jdk7-m3.3.x_build] [TASKS] Computing warning deltas based on reference build #43
[Pipeline] [windows-jdk7-m3.5.x_build] }
[windows-jdk7-m3.5.x_build] [withMaven] artifactsPublisher - Archive artifact windows-jdk7-m3.5.x_build\pom.xml under org\apache\maven\plugins\maven-assembly-plugin\3.1.1-SNAPSHOT\maven-assembly-plugin-3.1.1-SNAPSHOT.pom
[windows-jdk7-m3.5.x_build] [withMaven] artifactsPublisher - Archive artifact windows-jdk7-m3.5.x_build\target\maven-assembly-plugin-3.1.1-SNAPSHOT.jar under org\apache\maven\plugins\maven-assembly-plugin\3.1.1-SNAPSHOT\maven-assembly-plugin-3.1.1-SNAPSHOT.jar
[windows-jdk7-m3.5.x_build] [withMaven] invokerPublisher - Archive invoker results for Maven artifact MavenArtifact{org.apache.maven.plugins:maven-assembly-plugin::3.1.1-SNAPSHOT(version: 3.1.1-SNAPSHOT, snapshot:false) } generated by PluginInvocation{org.apache.maven.plugins:maven-invoker-plugin:3.1.0@integration-test  integration-test}: windows-jdk7-m3.5.x_build\target\invoker-reports\*.xml
[windows-jdk7-m3.5.x_build] [withMaven] junitPublisher - Archive test results for Maven artifact org.apache.maven.plugins:maven-assembly-plugin:3.1.1-SNAPSHOT generated by maven-surefire-plugin:test (default-test): windows-jdk7-m3.5.x_build\target\surefire-reports\*.xml
[windows-jdk7-m3.5.x_build] Recording test results
[windows-jdk7-m3.5.x_build] [withMaven] openTasksPublisher - Scan Tasks for Maven artifact org.apache.maven.plugins:maven-assembly-plugin:3.1.1-SNAPSHOT in source directory windows-jdk7-m3.5.x_build\src\main\java
[windows-jdk7-m3.5.x_build] [TASKS] Scanning folder 'C:\Users\jenkins\AppData\Local\Temp\2\jenkins-maven-box-maven-assembly-plugin-master-45@2' for files matching the pattern 'windows-jdk7-m3.5.x_build\src\main\java\**\*' - excludes: null
[windows-jdk7-m3.5.x_build] [TASKS] Found 71 files to scan for tasks
[windows-jdk7-m3.5.x_build] [TASKS] Found 14 open tasks.
[windows-jdk7-m3.5.x_build] Skipping warnings blame since pipelines do not have an SCM link.%n
[windows-jdk7-m3.5.x_build] [TASKS] Computing warning deltas based on reference build #43
[Pipeline] [linux-jdk7-m3.3.x_build] }
[Pipeline] [linux-jdk8-m3.5.x_build] // ws
[Pipeline] [linux-jdk7-m3.5.x_build] // withMaven
[Pipeline] [windows-jdk8-m3.5.x_build] // withMaven
[Pipeline] [windows-jdk7-m3.3.x_build] // withMaven
[Pipeline] [windows-jdk7-m3.5.x_build] // withMaven
[Pipeline] [linux-jdk8-m3.5.x_build] }
[Pipeline] [linux-jdk7-m3.5.x_build] cleanWs
[Pipeline] [linux-jdk7-m3.2.x_build] }
[Pipeline] [linux-jdk11-m3.5.x_build] }
[Pipeline] [windows-jdk8-m3.5.x_build] cleanWs
[Pipeline] [windows-jdk11-m3.5.x_build] }
[Pipeline] [windows-jdk7-m3.3.x_build] cleanWs
[Pipeline] [windows-jdk7-m3.5.x_build] cleanWs
[Pipeline] [windows-jdk7-m3.2.x_build] }
[Pipeline] [linux-jdk7-m3.3.x_build] // stage
[windows-jdk8-m3.5.x_build] [WS-CLEANUP] Deleting project workspace...Cannot delete workspace :remote file operation failed: C:\Users\jenkins\AppData\Local\Temp\2/jenkins-maven-box-maven-assembly-plugin-master-45 at hudson.remoting.Channel@41afa848:JNLP4-connect connection from 37.48.69.226/37.48.69.226:49574: java.nio.file.AccessDeniedException: C:\Users\jenkins\AppData\Local\Temp\2\jenkins-maven-box-maven-assembly-plugin-master-45 -> C:\Users\jenkins\AppData\Local\Temp\2\jenkins-maven-box-maven-assembly-plugin-master-45_ws-cleanup_1546011750734
[Pipeline] [linux-jdk7-m3.3.x_build] }
[windows-jdk7-m3.3.x_build] [WS-CLEANUP] Deleting project workspace...Cannot delete workspace :remote file operation failed: C:\Users\jenkins\AppData\Local\Temp\2/jenkins-maven-box-maven-assembly-plugin-master-45 at hudson.remoting.Channel@7f96cc69:JNLP4-connect connection from 37.48.69.226/37.48.69.226:63010: java.nio.file.AccessDeniedException: C:\Users\jenkins\AppData\Local\Temp\2\jenkins-maven-box-maven-assembly-plugin-master-45 -> C:\Users\jenkins\AppData\Local\Temp\2\jenkins-maven-box-maven-assembly-plugin-master-45_ws-cleanup_1546011750745
[windows-jdk7-m3.5.x_build] [WS-CLEANUP] Deleting project workspace...Cannot delete workspace :remote file operation failed: C:\Users\jenkins\AppData\Local\Temp\2/jenkins-maven-box-maven-assembly-plugin-master-45@2 at hudson.remoting.Channel@7f96cc69:JNLP4-connect connection from 37.48.69.226/37.48.69.226:63010: java.nio.file.AccessDeniedException: C:\Users\jenkins\AppData\Local\Temp\2\jenkins-maven-box-maven-assembly-plugin-master-45@2 -> C:\Users\jenkins\AppData\Local\Temp\2\jenkins-maven-box-maven-assembly-plugin-master-45@2_ws-cleanup_1546011750748
[Pipeline] [linux-jdk8-m3.5.x_build] // node
[Pipeline] [linux-jdk7-m3.2.x_build] // stage
[Pipeline] [linux-jdk11-m3.5.x_build] // stage
[Pipeline] [windows-jdk11-m3.5.x_build] // stage
[Pipeline] [windows-jdk7-m3.2.x_build] // dir
[linux-jdk7-m3.5.x_build] [WS-CLEANUP] Deleting project workspace...[WS-CLEANUP] done
[Pipeline] [linux-jdk8-m3.5.x_build] }
[Pipeline] [linux-jdk7-m3.2.x_build] }
[Pipeline] [linux-jdk11-m3.5.x_build] }
[Pipeline] [windows-jdk11-m3.5.x_build] }
[Pipeline] [windows-jdk7-m3.2.x_build] }
[windows-jdk7-m3.2.x_build] [withMaven] artifactsPublisher - Archive artifact windows-jdk7-m3.2.x_build\pom.xml under org\apache\maven\plugins\maven-assembly-plugin\3.1.1-SNAPSHOT\maven-assembly-plugin-3.1.1-SNAPSHOT.pom
[windows-jdk7-m3.2.x_build] [withMaven] artifactsPublisher - Archive artifact windows-jdk7-m3.2.x_build\target\maven-assembly-plugin-3.1.1-SNAPSHOT.jar under org\apache\maven\plugins\maven-assembly-plugin\3.1.1-SNAPSHOT\maven-assembly-plugin-3.1.1-SNAPSHOT.jar
[windows-jdk7-m3.2.x_build] [withMaven] invokerPublisher - Archive invoker results for Maven artifact MavenArtifact{org.apache.maven.plugins:maven-assembly-plugin::3.1.1-SNAPSHOT(version: 3.1.1-SNAPSHOT, snapshot:false) } generated by PluginInvocation{org.apache.maven.plugins:maven-invoker-plugin:3.1.0@integration-test  integration-test}: windows-jdk7-m3.2.x_build\target\invoker-reports\*.xml
[windows-jdk7-m3.2.x_build] [withMaven] junitPublisher - Archive test results for Maven artifact org.apache.maven.plugins:maven-assembly-plugin:3.1.1-SNAPSHOT generated by maven-surefire-plugin:test (default-test): windows-jdk7-m3.2.x_build\target\surefire-reports\*.xml
[windows-jdk7-m3.2.x_build] Recording test results
[windows-jdk7-m3.2.x_build] [withMaven] openTasksPublisher - Scan Tasks for Maven artifact org.apache.maven.plugins:maven-assembly-plugin:3.1.1-SNAPSHOT in source directory windows-jdk7-m3.2.x_build\src\main\java
[windows-jdk7-m3.2.x_build] [TASKS] Scanning folder 'C:\Users\jenkins\AppData\Local\Temp\2\jenkins-maven-box-maven-assembly-plugin-master-45' for files matching the pattern 'windows-jdk7-m3.2.x_build\src\main\java\**\*' - excludes: null
[windows-jdk7-m3.2.x_build] [TASKS] Found 71 files to scan for tasks
[windows-jdk7-m3.2.x_build] [TASKS] Found 14 open tasks.
[windows-jdk7-m3.2.x_build] Skipping warnings blame since pipelines do not have an SCM link.%n
[windows-jdk7-m3.2.x_build] [TASKS] Computing warning deltas based on reference build #43
[Pipeline] [linux-jdk7-m3.3.x_build] // ws
[Pipeline] [linux-jdk7-m3.3.x_build] }
[Pipeline] [windows-jdk8-m3.5.x_build] }
[Pipeline] [windows-jdk7-m3.3.x_build] }
[Pipeline] [windows-jdk7-m3.5.x_build] }
[Pipeline] [linux-jdk7-m3.2.x_build] // ws
[Pipeline] [linux-jdk11-m3.5.x_build] // ws
[Pipeline] [windows-jdk11-m3.5.x_build] // ws
[Pipeline] [windows-jdk7-m3.2.x_build] // withMaven
[Pipeline] [linux-jdk7-m3.2.x_build] }
[Pipeline] [linux-jdk11-m3.5.x_build] }
[Pipeline] [windows-jdk11-m3.5.x_build] }
[Pipeline] [linux-jdk7-m3.5.x_build] }
[Pipeline] [windows-jdk7-m3.2.x_build] cleanWs
[Pipeline] [linux-jdk7-m3.3.x_build] // node
[Pipeline] [windows-jdk8-m3.5.x_build] // stage
[windows-jdk7-m3.2.x_build] [WS-CLEANUP] Deleting project workspace...Cannot delete workspace :remote file operation failed: C:\Users\jenkins\AppData\Local\Temp\2/jenkins-maven-box-maven-assembly-plugin-master-45 at hudson.remoting.Channel@121270d5:JNLP4-connect connection from 37.48.69.226/37.48.69.226:54213: java.nio.file.AccessDeniedException: C:\Users\jenkins\AppData\Local\Temp\2\jenkins-maven-box-maven-assembly-plugin-master-45 -> C:\Users\jenkins\AppData\Local\Temp\2\jenkins-maven-box-maven-assembly-plugin-master-45_ws-cleanup_1546011912157
[Pipeline] [windows-jdk7-m3.3.x_build] // stage
[Pipeline] [windows-jdk7-m3.5.x_build] // stage
[Pipeline] [linux-jdk7-m3.3.x_build] }
[Pipeline] [windows-jdk7-m3.3.x_build] }
[Pipeline] [windows-jdk7-m3.5.x_build] }
[Pipeline] [windows-jdk8-m3.5.x_build] }
[Pipeline] [linux-jdk7-m3.2.x_build] // node
[Pipeline] [linux-jdk11-m3.5.x_build] // node
[Pipeline] [windows-jdk11-m3.5.x_build] // node
[Pipeline] [linux-jdk7-m3.5.x_build] // stage
[Pipeline] [linux-jdk7-m3.2.x_build] }
[Pipeline] [linux-jdk11-m3.5.x_build] }
[Pipeline] [windows-jdk11-m3.5.x_build] }
[windows-jdk11-m3.5.x_build] Failed in branch windows-jdk11-m3.5.x_build
[Pipeline] [linux-jdk7-m3.5.x_build] }
[Pipeline] [windows-jdk7-m3.2.x_build] }
[Pipeline] [windows-jdk7-m3.3.x_build] // ws
[Pipeline] [windows-jdk7-m3.5.x_build] // ws
[Pipeline] [windows-jdk8-m3.5.x_build] // ws
[Pipeline] [windows-jdk7-m3.3.x_build] }
[Pipeline] [windows-jdk7-m3.5.x_build] }
[Pipeline] [windows-jdk8-m3.5.x_build] }
[Pipeline] [linux-jdk7-m3.5.x_build] // ws
[Pipeline] [linux-jdk7-m3.5.x_build] }
[Pipeline] [windows-jdk7-m3.2.x_build] // stage
[Pipeline] [windows-jdk7-m3.2.x_build] }
[Pipeline] [windows-jdk7-m3.3.x_build] // node
[Pipeline] [windows-jdk7-m3.5.x_build] // node
[Pipeline] [windows-jdk8-m3.5.x_build] // node
[Pipeline] [windows-jdk7-m3.3.x_build] }
[windows-jdk7-m3.3.x_build] Failed in branch windows-jdk7-m3.3.x_build
[Pipeline] [windows-jdk7-m3.5.x_build] }
[windows-jdk7-m3.5.x_build] Failed in branch windows-jdk7-m3.5.x_build
[Pipeline] [windows-jdk8-m3.5.x_build] }
[windows-jdk8-m3.5.x_build] Failed in branch windows-jdk8-m3.5.x_build
[Pipeline] [linux-jdk7-m3.5.x_build] // node
[Pipeline] [linux-jdk7-m3.5.x_build] }
[Pipeline] [windows-jdk7-m3.2.x_build] // ws
[Pipeline] [windows-jdk7-m3.2.x_build] }
[Pipeline] [windows-jdk7-m3.2.x_build] // node
[Pipeline] [windows-jdk7-m3.2.x_build] }
[windows-jdk7-m3.2.x_build] Failed in branch windows-jdk7-m3.2.x_build
[Pipeline] // parallel
[Pipeline] stage
[Pipeline] { (Notifications)
[Pipeline] echo
Build result: FAILURE
[Pipeline] jiraIssueSelector
[Pipeline] jiraComment
[Pipeline] jiraComment
[Pipeline] emailext
Reply | Threaded
Open this post in threaded view
|

Build failed in Jenkins: Maven TLP » maven-assembly-plugin » master #46

Apache Jenkins Server-2
See https://builds.apache.org/job/maven-box/job/maven-assembly-plugin/job/master/46/

No changes.

All tests passed

Build log:
[...truncated 4.04 MB...]
[windows-jdk7-m3.2.x_build] [INFO] Downloaded: https://repo.maven.apache.org/maven2/com/puppycrawl/tools/checkstyle/6.18/checkstyle-6.18.jar (1132 KB at 1748.3 KB/sec)
[windows-jdk7-m3.2.x_build] [INFO] Downloading: https://repo.maven.apache.org/maven2/commons-lang/commons-lang/2.1/commons-lang-2.1.jar
[windows-jdk7-m3.2.x_build] [INFO] Downloaded: https://repo.maven.apache.org/maven2/commons-lang/commons-lang/2.1/commons-lang-2.1.jar (203 KB at 293.6 KB/sec)
[windows-jdk7-m3.2.x_build] [INFO] Downloaded: https://repo.maven.apache.org/maven2/org/antlr/antlr4-runtime/4.5.3/antlr4-runtime-4.5.3.jar (296 KB at 409.4 KB/sec)
[windows-jdk7-m3.2.x_build] [INFO] Downloaded: https://repo.maven.apache.org/maven2/commons-beanutils/commons-beanutils/1.9.2/commons-beanutils-1.9.2.jar (229 KB at 315.9 KB/sec)
[windows-jdk7-m3.2.x_build] [INFO] Downloaded: https://repo.maven.apache.org/maven2/commons-cli/commons-cli/1.3.1/commons-cli-1.3.1.jar (52 KB at 59.3 KB/sec)
[windows-jdk7-m3.2.x_build] [INFO] Downloaded: https://repo.maven.apache.org/maven2/com/google/guava/guava/19.0/guava-19.0.jar (2255 KB at 2203.7 KB/sec)
[windows-jdk7-m3.2.x_build] [INFO] There are 2 errors reported by Checkstyle 6.18 with config/maven_checks.xml ruleset.
[windows-jdk7-m3.2.x_build] [INFO] Ignored 2 errors, 0 violation remaining.
[windows-jdk7-m3.2.x_build] [INFO]
[windows-jdk7-m3.2.x_build] [INFO] --- maven-invoker-plugin:3.1.0:verify (integration-test) @ maven-assembly-plugin ---
[windows-jdk7-m3.2.x_build] [INFO] -------------------------------------------------
[windows-jdk7-m3.2.x_build] [INFO] Build Summary:
[windows-jdk7-m3.2.x_build] [INFO]   Passed: 134, Failed: 0, Errors: 0, Skipped: 3
[windows-jdk7-m3.2.x_build] [INFO] -------------------------------------------------
[windows-jdk7-m3.2.x_build] [INFO] ------------------------------------------------------------------------
[windows-jdk7-m3.2.x_build] [INFO] BUILD SUCCESS
[windows-jdk7-m3.2.x_build] [INFO] ------------------------------------------------------------------------
[windows-jdk7-m3.2.x_build] [INFO] Total time: 25:51 min
[windows-jdk7-m3.2.x_build] [INFO] Finished at: 2018-12-28T14:38:34-08:00
[windows-jdk7-m3.2.x_build] [INFO] Final Memory: 46M/282M
[windows-jdk7-m3.2.x_build] [INFO] ------------------------------------------------------------------------
[windows-jdk7-m3.2.x_build] [INFO] [jenkins-event-spy] Generated C:\Users\jenkins\AppData\Local\Temp\2\jenkins-maven-box-maven-assembly-plugin-master-46@tmp\withMaven4b44e306\maven-spy-20181228-141242-3741801707244586856854.log
[windows-jdk7-m3.2.x_build] Picked up JAVA_TOOL_OPTIONS: -Dmaven.ext.class.path="C:\Users\jenkins\AppData\Local\Temp\2\jenkins-maven-box-maven-assembly-plugin-master-46@tmp\withMaven4b44e306\pipeline-maven-spy.jar" -Dorg.jenkinsci.plugins.pipeline.maven.reportsFolder="C:\Users\jenkins\AppData\Local\Temp\2\jenkins-maven-box-maven-assembly-plugin-master-46@tmp\withMaven4b44e306"
[Pipeline] [linux-jdk7-m3.3.x_build] }
[linux-jdk7-m3.3.x_build] [withMaven] artifactsPublisher - Archive artifact linux-jdk7-m3.3.x_build/pom.xml under org/apache/maven/plugins/maven-assembly-plugin/3.1.1-SNAPSHOT/maven-assembly-plugin-3.1.1-SNAPSHOT.pom
[linux-jdk7-m3.3.x_build] [withMaven] artifactsPublisher - Archive artifact linux-jdk7-m3.3.x_build/target/maven-assembly-plugin-3.1.1-SNAPSHOT.jar under org/apache/maven/plugins/maven-assembly-plugin/3.1.1-SNAPSHOT/maven-assembly-plugin-3.1.1-SNAPSHOT.jar
[linux-jdk7-m3.3.x_build] [withMaven] invokerPublisher - Archive invoker results for Maven artifact MavenArtifact{org.apache.maven.plugins:maven-assembly-plugin::3.1.1-SNAPSHOT(version: 3.1.1-SNAPSHOT, snapshot:false) } generated by PluginInvocation{org.apache.maven.plugins:maven-invoker-plugin:3.1.0@integration-test  integration-test}: linux-jdk7-m3.3.x_build/target/invoker-reports/*.xml
[linux-jdk7-m3.3.x_build] [withMaven] junitPublisher - Archive test results for Maven artifact org.apache.maven.plugins:maven-assembly-plugin:3.1.1-SNAPSHOT generated by maven-surefire-plugin:test (default-test): linux-jdk7-m3.3.x_build/target/surefire-reports/*.xml
[linux-jdk7-m3.3.x_build] Recording test results
[linux-jdk7-m3.3.x_build] [withMaven] openTasksPublisher - Scan Tasks for Maven artifact org.apache.maven.plugins:maven-assembly-plugin:3.1.1-SNAPSHOT in source directory linux-jdk7-m3.3.x_build/src/main/java
[linux-jdk7-m3.3.x_build] [TASKS] Scanning folder '/home/jenkins/jenkins-slave/workspace/aven-assembly-plugin_master-SP4DXUL4GVN3Q5KJHI5ED6WPWUEC2L2PUW2RCT2SFVGTCXHUIFDQ@2' for files matching the pattern 'linux-jdk7-m3.3.x_build/src/main/java/**/*' - excludes: null
[linux-jdk7-m3.3.x_build] [TASKS] Found 71 files to scan for tasks
[linux-jdk7-m3.3.x_build] [TASKS] Found 14 open tasks.
[linux-jdk7-m3.3.x_build] Skipping warnings blame since pipelines do not have an SCM link.%n
[linux-jdk7-m3.3.x_build] [TASKS] Computing warning deltas based on reference build #43
[Pipeline] [linux-jdk7-m3.5.x_build] }
[linux-jdk7-m3.5.x_build] [withMaven] artifactsPublisher - Archive artifact linux-jdk7-m3.5.x_build/pom.xml under org/apache/maven/plugins/maven-assembly-plugin/3.1.1-SNAPSHOT/maven-assembly-plugin-3.1.1-SNAPSHOT.pom
[linux-jdk7-m3.5.x_build] [withMaven] artifactsPublisher - Archive artifact linux-jdk7-m3.5.x_build/target/maven-assembly-plugin-3.1.1-SNAPSHOT.jar under org/apache/maven/plugins/maven-assembly-plugin/3.1.1-SNAPSHOT/maven-assembly-plugin-3.1.1-SNAPSHOT.jar
[linux-jdk7-m3.5.x_build] [withMaven] invokerPublisher - Archive invoker results for Maven artifact MavenArtifact{org.apache.maven.plugins:maven-assembly-plugin::3.1.1-SNAPSHOT(version: 3.1.1-SNAPSHOT, snapshot:false) } generated by PluginInvocation{org.apache.maven.plugins:maven-invoker-plugin:3.1.0@integration-test  integration-test}: linux-jdk7-m3.5.x_build/target/invoker-reports/*.xml
[linux-jdk7-m3.5.x_build] [withMaven] junitPublisher - Archive test results for Maven artifact org.apache.maven.plugins:maven-assembly-plugin:3.1.1-SNAPSHOT generated by maven-surefire-plugin:test (default-test): linux-jdk7-m3.5.x_build/target/surefire-reports/*.xml
[linux-jdk7-m3.5.x_build] Recording test results
[linux-jdk7-m3.5.x_build] [withMaven] openTasksPublisher - Scan Tasks for Maven artifact org.apache.maven.plugins:maven-assembly-plugin:3.1.1-SNAPSHOT in source directory linux-jdk7-m3.5.x_build/src/main/java
[linux-jdk7-m3.5.x_build] [TASKS] Scanning folder '/home/jenkins/jenkins-slave/workspace/aven-assembly-plugin_master-SP4DXUL4GVN3Q5KJHI5ED6WPWUEC2L2PUW2RCT2SFVGTCXHUIFDQ@2' for files matching the pattern 'linux-jdk7-m3.5.x_build/src/main/java/**/*' - excludes: null
[linux-jdk7-m3.5.x_build] [TASKS] Found 71 files to scan for tasks
[linux-jdk7-m3.5.x_build] [TASKS] Found 14 open tasks.
[linux-jdk7-m3.5.x_build] Skipping warnings blame since pipelines do not have an SCM link.%n
[linux-jdk7-m3.5.x_build] [TASKS] Computing warning deltas based on reference build #43
[Pipeline] [linux-jdk7-m3.2.x_build] }
[linux-jdk7-m3.2.x_build] [withMaven] artifactsPublisher - Archive artifact linux-jdk7-m3.2.x_build/pom.xml under org/apache/maven/plugins/maven-assembly-plugin/3.1.1-SNAPSHOT/maven-assembly-plugin-3.1.1-SNAPSHOT.pom
[linux-jdk7-m3.2.x_build] [withMaven] artifactsPublisher - Archive artifact linux-jdk7-m3.2.x_build/target/maven-assembly-plugin-3.1.1-SNAPSHOT.jar under org/apache/maven/plugins/maven-assembly-plugin/3.1.1-SNAPSHOT/maven-assembly-plugin-3.1.1-SNAPSHOT.jar
[linux-jdk7-m3.2.x_build] [withMaven] invokerPublisher - Archive invoker results for Maven artifact MavenArtifact{org.apache.maven.plugins:maven-assembly-plugin::3.1.1-SNAPSHOT(version: 3.1.1-SNAPSHOT, snapshot:false) } generated by PluginInvocation{org.apache.maven.plugins:maven-invoker-plugin:3.1.0@integration-test  integration-test}: linux-jdk7-m3.2.x_build/target/invoker-reports/*.xml
[linux-jdk7-m3.2.x_build] [withMaven] junitPublisher - Archive test results for Maven artifact org.apache.maven.plugins:maven-assembly-plugin:3.1.1-SNAPSHOT generated by maven-surefire-plugin:test (default-test): linux-jdk7-m3.2.x_build/target/surefire-reports/*.xml
[linux-jdk7-m3.2.x_build] Recording test results
[linux-jdk7-m3.2.x_build] [withMaven] openTasksPublisher - Scan Tasks for Maven artifact org.apache.maven.plugins:maven-assembly-plugin:3.1.1-SNAPSHOT in source directory linux-jdk7-m3.2.x_build/src/main/java
[linux-jdk7-m3.2.x_build] [TASKS] Scanning folder '/home/jenkins/jenkins-slave/workspace/aven-assembly-plugin_master-SP4DXUL4GVN3Q5KJHI5ED6WPWUEC2L2PUW2RCT2SFVGTCXHUIFDQ@2' for files matching the pattern 'linux-jdk7-m3.2.x_build/src/main/java/**/*' - excludes: null
[linux-jdk7-m3.2.x_build] [TASKS] Found 71 files to scan for tasks
[linux-jdk7-m3.2.x_build] [TASKS] Found 14 open tasks.
[linux-jdk7-m3.2.x_build] Skipping warnings blame since pipelines do not have an SCM link.%n
[linux-jdk7-m3.2.x_build] [TASKS] Computing warning deltas based on reference build #43
[Pipeline] [linux-jdk11-m3.5.x_build] }
[linux-jdk11-m3.5.x_build] [withMaven] artifactsPublisher - Archive artifact linux-jdk11-m3.5.x_build/pom.xml under org/apache/maven/plugins/maven-assembly-plugin/3.1.1-SNAPSHOT/maven-assembly-plugin-3.1.1-SNAPSHOT.pom
[linux-jdk11-m3.5.x_build] [withMaven] artifactsPublisher - Archive artifact linux-jdk11-m3.5.x_build/target/maven-assembly-plugin-3.1.1-SNAPSHOT.jar under org/apache/maven/plugins/maven-assembly-plugin/3.1.1-SNAPSHOT/maven-assembly-plugin-3.1.1-SNAPSHOT.jar
[linux-jdk11-m3.5.x_build] [withMaven] invokerPublisher - Archive invoker results for Maven artifact MavenArtifact{org.apache.maven.plugins:maven-assembly-plugin::3.1.1-SNAPSHOT(version: 3.1.1-SNAPSHOT, snapshot:false) } generated by PluginInvocation{org.apache.maven.plugins:maven-invoker-plugin:3.1.0@integration-test  integration-test}: linux-jdk11-m3.5.x_build/target/invoker-reports/*.xml
[linux-jdk11-m3.5.x_build] [withMaven] junitPublisher - Archive test results for Maven artifact org.apache.maven.plugins:maven-assembly-plugin:3.1.1-SNAPSHOT generated by maven-surefire-plugin:test (default-test): linux-jdk11-m3.5.x_build/target/surefire-reports/*.xml
[linux-jdk11-m3.5.x_build] Recording test results
[linux-jdk11-m3.5.x_build] [withMaven] openTasksPublisher - Scan Tasks for Maven artifact org.apache.maven.plugins:maven-assembly-plugin:3.1.1-SNAPSHOT in source directory linux-jdk11-m3.5.x_build/src/main/java
[linux-jdk11-m3.5.x_build] [TASKS] Scanning folder '/home/jenkins/jenkins-slave/workspace/aven-assembly-plugin_master-SP4DXUL4GVN3Q5KJHI5ED6WPWUEC2L2PUW2RCT2SFVGTCXHUIFDQ@2' for files matching the pattern 'linux-jdk11-m3.5.x_build/src/main/java/**/*' - excludes: null
[linux-jdk11-m3.5.x_build] [TASKS] Found 71 files to scan for tasks
[linux-jdk11-m3.5.x_build] [TASKS] Found 14 open tasks.
[linux-jdk11-m3.5.x_build] Skipping warnings blame since pipelines do not have an SCM link.%n
[linux-jdk11-m3.5.x_build] [TASKS] Computing warning deltas based on reference build #43
[Pipeline] [windows-jdk11-m3.5.x_build] }
[windows-jdk11-m3.5.x_build] [withMaven] artifactsPublisher - Archive artifact windows-jdk11-m3.5.x_build\pom.xml under org\apache\maven\plugins\maven-assembly-plugin\3.1.1-SNAPSHOT\maven-assembly-plugin-3.1.1-SNAPSHOT.pom
[windows-jdk11-m3.5.x_build] [withMaven] artifactsPublisher - Archive artifact windows-jdk11-m3.5.x_build\target\maven-assembly-plugin-3.1.1-SNAPSHOT.jar under org\apache\maven\plugins\maven-assembly-plugin\3.1.1-SNAPSHOT\maven-assembly-plugin-3.1.1-SNAPSHOT.jar
[windows-jdk11-m3.5.x_build] [withMaven] invokerPublisher - Archive invoker results for Maven artifact MavenArtifact{org.apache.maven.plugins:maven-assembly-plugin::3.1.1-SNAPSHOT(version: 3.1.1-SNAPSHOT, snapshot:false) } generated by PluginInvocation{org.apache.maven.plugins:maven-invoker-plugin:3.1.0@integration-test  integration-test}: windows-jdk11-m3.5.x_build\target\invoker-reports\*.xml
[windows-jdk11-m3.5.x_build] [withMaven] junitPublisher - Archive test results for Maven artifact org.apache.maven.plugins:maven-assembly-plugin:3.1.1-SNAPSHOT generated by maven-surefire-plugin:test (default-test): windows-jdk11-m3.5.x_build\target\surefire-reports\*.xml
[windows-jdk11-m3.5.x_build] Recording test results
[windows-jdk11-m3.5.x_build] [withMaven] openTasksPublisher - Scan Tasks for Maven artifact org.apache.maven.plugins:maven-assembly-plugin:3.1.1-SNAPSHOT in source directory windows-jdk11-m3.5.x_build\src\main\java
[windows-jdk11-m3.5.x_build] [TASKS] Scanning folder 'C:\Users\jenkins\AppData\Local\Temp\2\jenkins-maven-box-maven-assembly-plugin-master-46' for files matching the pattern 'windows-jdk11-m3.5.x_build\src\main\java\**\*' - excludes: null
[windows-jdk11-m3.5.x_build] [TASKS] Found 71 files to scan for tasks
[windows-jdk11-m3.5.x_build] [TASKS] Found 14 open tasks.
[windows-jdk11-m3.5.x_build] Skipping warnings blame since pipelines do not have an SCM link.%n
[windows-jdk11-m3.5.x_build] [TASKS] Computing warning deltas based on reference build #43
[Pipeline] [linux-jdk7-m3.3.x_build] // withMaven
[Pipeline] [linux-jdk7-m3.5.x_build] // withMaven
[Pipeline] [linux-jdk7-m3.2.x_build] // withMaven
[Pipeline] [linux-jdk11-m3.5.x_build] // withMaven
[Pipeline] [windows-jdk11-m3.5.x_build] // withMaven
[Pipeline] [linux-jdk7-m3.3.x_build] cleanWs
[linux-jdk7-m3.3.x_build] [WS-CLEANUP] Deleting project workspace...[WS-CLEANUP] done
[Pipeline] [linux-jdk7-m3.5.x_build] cleanWs
[Pipeline] [linux-jdk7-m3.2.x_build] cleanWs
[Pipeline] [linux-jdk8-m3.5.x_build] }
[Pipeline] [linux-jdk11-m3.5.x_build] cleanWs
[Pipeline] [windows-jdk11-m3.5.x_build] cleanWs
[Pipeline] [windows-jdk8-m3.5.x_build] }
[Pipeline] [windows-jdk7-m3.2.x_build] }
[Pipeline] [windows-jdk7-m3.3.x_build] }
[Pipeline] [windows-jdk7-m3.5.x_build] }
[Pipeline] [linux-jdk8-m3.5.x_build] // stage
[Pipeline] [windows-jdk8-m3.5.x_build] // dir
[Pipeline] [windows-jdk7-m3.2.x_build] // dir
[Pipeline] [windows-jdk7-m3.3.x_build] // dir
[Pipeline] [windows-jdk7-m3.5.x_build] // dir
[linux-jdk7-m3.5.x_build] [WS-CLEANUP] Deleting project workspace...[WS-CLEANUP] done
[linux-jdk7-m3.2.x_build] [WS-CLEANUP] Deleting project workspace...[WS-CLEANUP] done
[linux-jdk11-m3.5.x_build] [WS-CLEANUP] Deleting project workspace...[WS-CLEANUP] done
[windows-jdk11-m3.5.x_build] [WS-CLEANUP] Deleting project workspace...Cannot delete workspace :remote file operation failed: C:\Users\jenkins\AppData\Local\Temp\2/jenkins-maven-box-maven-assembly-plugin-master-46 at hudson.remoting.Channel@398d98d3:JNLP4-connect connection from ec2-34-228-168-168.compute-1.amazonaws.com/34.228.168.168:51626: java.nio.file.AccessDeniedException: C:\Users\jenkins\AppData\Local\Temp\2\jenkins-maven-box-maven-assembly-plugin-master-46 -> C:\Users\jenkins\AppData\Local\Temp\2\jenkins-maven-box-maven-assembly-plugin-master-46_ws-cleanup_1546036871980
[Pipeline] [linux-jdk8-m3.5.x_build] }
[Pipeline] [linux-jdk7-m3.3.x_build] }
[Pipeline] [windows-jdk8-m3.5.x_build] }
[windows-jdk8-m3.5.x_build] [withMaven] artifactsPublisher - Archive artifact windows-jdk8-m3.5.x_build\pom.xml under org\apache\maven\plugins\maven-assembly-plugin\3.1.1-SNAPSHOT\maven-assembly-plugin-3.1.1-SNAPSHOT.pom
[windows-jdk8-m3.5.x_build] [withMaven] artifactsPublisher - Archive artifact windows-jdk8-m3.5.x_build\target\maven-assembly-plugin-3.1.1-SNAPSHOT.jar under org\apache\maven\plugins\maven-assembly-plugin\3.1.1-SNAPSHOT\maven-assembly-plugin-3.1.1-SNAPSHOT.jar
[windows-jdk8-m3.5.x_build] [withMaven] invokerPublisher - Archive invoker results for Maven artifact MavenArtifact{org.apache.maven.plugins:maven-assembly-plugin::3.1.1-SNAPSHOT(version: 3.1.1-SNAPSHOT, snapshot:false) } generated by PluginInvocation{org.apache.maven.plugins:maven-invoker-plugin:3.1.0@integration-test  integration-test}: windows-jdk8-m3.5.x_build\target\invoker-reports\*.xml
[windows-jdk8-m3.5.x_build] [withMaven] junitPublisher - Archive test results for Maven artifact org.apache.maven.plugins:maven-assembly-plugin:3.1.1-SNAPSHOT generated by maven-surefire-plugin:test (default-test): windows-jdk8-m3.5.x_build\target\surefire-reports\*.xml
[windows-jdk8-m3.5.x_build] Recording test results
[windows-jdk8-m3.5.x_build] [withMaven] openTasksPublisher - Scan Tasks for Maven artifact org.apache.maven.plugins:maven-assembly-plugin:3.1.1-SNAPSHOT in source directory windows-jdk8-m3.5.x_build\src\main\java
[windows-jdk8-m3.5.x_build] [TASKS] Scanning folder 'C:\Users\jenkins\AppData\Local\Temp\2\jenkins-maven-box-maven-assembly-plugin-master-46' for files matching the pattern 'windows-jdk8-m3.5.x_build\src\main\java\**\*' - excludes: null
[windows-jdk8-m3.5.x_build] [TASKS] Found 71 files to scan for tasks
[windows-jdk8-m3.5.x_build] [TASKS] Found 14 open tasks.
[windows-jdk8-m3.5.x_build] Skipping warnings blame since pipelines do not have an SCM link.%n
[windows-jdk8-m3.5.x_build] [TASKS] Computing warning deltas based on reference build #43
[Pipeline] [windows-jdk7-m3.2.x_build] }
[windows-jdk7-m3.2.x_build] [withMaven] artifactsPublisher - Archive artifact windows-jdk7-m3.2.x_build\pom.xml under org\apache\maven\plugins\maven-assembly-plugin\3.1.1-SNAPSHOT\maven-assembly-plugin-3.1.1-SNAPSHOT.pom
[windows-jdk7-m3.2.x_build] [withMaven] artifactsPublisher - Archive artifact windows-jdk7-m3.2.x_build\target\maven-assembly-plugin-3.1.1-SNAPSHOT.jar under org\apache\maven\plugins\maven-assembly-plugin\3.1.1-SNAPSHOT\maven-assembly-plugin-3.1.1-SNAPSHOT.jar
[windows-jdk7-m3.2.x_build] [withMaven] invokerPublisher - Archive invoker results for Maven artifact MavenArtifact{org.apache.maven.plugins:maven-assembly-plugin::3.1.1-SNAPSHOT(version: 3.1.1-SNAPSHOT, snapshot:false) } generated by PluginInvocation{org.apache.maven.plugins:maven-invoker-plugin:3.1.0@integration-test  integration-test}: windows-jdk7-m3.2.x_build\target\invoker-reports\*.xml
[windows-jdk7-m3.2.x_build] [withMaven] junitPublisher - Archive test results for Maven artifact org.apache.maven.plugins:maven-assembly-plugin:3.1.1-SNAPSHOT generated by maven-surefire-plugin:test (default-test): windows-jdk7-m3.2.x_build\target\surefire-reports\*.xml
[windows-jdk7-m3.2.x_build] Recording test results
[windows-jdk7-m3.2.x_build] [withMaven] openTasksPublisher - Scan Tasks for Maven artifact org.apache.maven.plugins:maven-assembly-plugin:3.1.1-SNAPSHOT in source directory windows-jdk7-m3.2.x_build\src\main\java
[windows-jdk7-m3.2.x_build] [TASKS] Scanning folder 'C:\Users\jenkins\AppData\Local\Temp\2\jenkins-maven-box-maven-assembly-plugin-master-46' for files matching the pattern 'windows-jdk7-m3.2.x_build\src\main\java\**\*' - excludes: null
[windows-jdk7-m3.2.x_build] [TASKS] Found 71 files to scan for tasks
[windows-jdk7-m3.2.x_build] [TASKS] Found 14 open tasks.
[windows-jdk7-m3.2.x_build] Skipping warnings blame since pipelines do not have an SCM link.%n
[windows-jdk7-m3.2.x_build] [TASKS] Computing warning deltas based on reference build #43
[Pipeline] [windows-jdk7-m3.3.x_build] }
[windows-jdk7-m3.3.x_build] [withMaven] artifactsPublisher - Archive artifact windows-jdk7-m3.3.x_build\pom.xml under org\apache\maven\plugins\maven-assembly-plugin\3.1.1-SNAPSHOT\maven-assembly-plugin-3.1.1-SNAPSHOT.pom
[windows-jdk7-m3.3.x_build] [withMaven] artifactsPublisher - Archive artifact windows-jdk7-m3.3.x_build\target\maven-assembly-plugin-3.1.1-SNAPSHOT.jar under org\apache\maven\plugins\maven-assembly-plugin\3.1.1-SNAPSHOT\maven-assembly-plugin-3.1.1-SNAPSHOT.jar
[windows-jdk7-m3.3.x_build] [withMaven] invokerPublisher - Archive invoker results for Maven artifact MavenArtifact{org.apache.maven.plugins:maven-assembly-plugin::3.1.1-SNAPSHOT(version: 3.1.1-SNAPSHOT, snapshot:false) } generated by PluginInvocation{org.apache.maven.plugins:maven-invoker-plugin:3.1.0@integration-test  integration-test}: windows-jdk7-m3.3.x_build\target\invoker-reports\*.xml
[windows-jdk7-m3.3.x_build] [withMaven] junitPublisher - Archive test results for Maven artifact org.apache.maven.plugins:maven-assembly-plugin:3.1.1-SNAPSHOT generated by maven-surefire-plugin:test (default-test): windows-jdk7-m3.3.x_build\target\surefire-reports\*.xml
[windows-jdk7-m3.3.x_build] Recording test results
[windows-jdk7-m3.3.x_build] [withMaven] openTasksPublisher - Scan Tasks for Maven artifact org.apache.maven.plugins:maven-assembly-plugin:3.1.1-SNAPSHOT in source directory windows-jdk7-m3.3.x_build\src\main\java
[windows-jdk7-m3.3.x_build] [TASKS] Scanning folder 'C:\Users\jenkins\AppData\Local\Temp\2\jenkins-maven-box-maven-assembly-plugin-master-46' for files matching the pattern 'windows-jdk7-m3.3.x_build\src\main\java\**\*' - excludes: null
[windows-jdk7-m3.3.x_build] [TASKS] Found 71 files to scan for tasks
[windows-jdk7-m3.3.x_build] [TASKS] Found 14 open tasks.
[windows-jdk7-m3.3.x_build] Skipping warnings blame since pipelines do not have an SCM link.%n
[windows-jdk7-m3.3.x_build] [TASKS] Computing warning deltas based on reference build #43
[Pipeline] [windows-jdk7-m3.5.x_build] }
[windows-jdk7-m3.5.x_build] [withMaven] artifactsPublisher - Archive artifact windows-jdk7-m3.5.x_build\pom.xml under org\apache\maven\plugins\maven-assembly-plugin\3.1.1-SNAPSHOT\maven-assembly-plugin-3.1.1-SNAPSHOT.pom
[windows-jdk7-m3.5.x_build] [withMaven] artifactsPublisher - Archive artifact windows-jdk7-m3.5.x_build\target\maven-assembly-plugin-3.1.1-SNAPSHOT.jar under org\apache\maven\plugins\maven-assembly-plugin\3.1.1-SNAPSHOT\maven-assembly-plugin-3.1.1-SNAPSHOT.jar
[windows-jdk7-m3.5.x_build] [withMaven] invokerPublisher - Archive invoker results for Maven artifact MavenArtifact{org.apache.maven.plugins:maven-assembly-plugin::3.1.1-SNAPSHOT(version: 3.1.1-SNAPSHOT, snapshot:false) } generated by PluginInvocation{org.apache.maven.plugins:maven-invoker-plugin:3.1.0@integration-test  integration-test}: windows-jdk7-m3.5.x_build\target\invoker-reports\*.xml
[windows-jdk7-m3.5.x_build] [withMaven] junitPublisher - Archive test results for Maven artifact org.apache.maven.plugins:maven-assembly-plugin:3.1.1-SNAPSHOT generated by maven-surefire-plugin:test (default-test): windows-jdk7-m3.5.x_build\target\surefire-reports\*.xml
[windows-jdk7-m3.5.x_build] Recording test results
[windows-jdk7-m3.5.x_build] [withMaven] openTasksPublisher - Scan Tasks for Maven artifact org.apache.maven.plugins:maven-assembly-plugin:3.1.1-SNAPSHOT in source directory windows-jdk7-m3.5.x_build\src\main\java
[windows-jdk7-m3.5.x_build] [TASKS] Scanning folder 'C:\Users\jenkins\AppData\Local\Temp\2\jenkins-maven-box-maven-assembly-plugin-master-46@2' for files matching the pattern 'windows-jdk7-m3.5.x_build\src\main\java\**\*' - excludes: null
[windows-jdk7-m3.5.x_build] [TASKS] Found 71 files to scan for tasks
[windows-jdk7-m3.5.x_build] [TASKS] Found 14 open tasks.
[windows-jdk7-m3.5.x_build] Skipping warnings blame since pipelines do not have an SCM link.%n
[windows-jdk7-m3.5.x_build] [TASKS] Computing warning deltas based on reference build #43
[Pipeline] [linux-jdk8-m3.5.x_build] // ws
[Pipeline] [linux-jdk7-m3.3.x_build] // stage
[Pipeline] [windows-jdk8-m3.5.x_build] // withMaven
[Pipeline] [windows-jdk7-m3.2.x_build] // withMaven
[Pipeline] [windows-jdk7-m3.3.x_build] // withMaven
[Pipeline] [windows-jdk7-m3.5.x_build] // withMaven
[Pipeline] [linux-jdk8-m3.5.x_build] }
[Pipeline] [linux-jdk7-m3.3.x_build] }
[Pipeline] [linux-jdk7-m3.5.x_build] }
[Pipeline] [linux-jdk7-m3.2.x_build] }
[Pipeline] [linux-jdk11-m3.5.x_build] }
[Pipeline] [windows-jdk11-m3.5.x_build] }
[Pipeline] [windows-jdk8-m3.5.x_build] cleanWs
[Pipeline] [windows-jdk7-m3.2.x_build] cleanWs
[Pipeline] [windows-jdk7-m3.3.x_build] cleanWs
[Pipeline] [windows-jdk7-m3.5.x_build] cleanWs
[Pipeline] [linux-jdk8-m3.5.x_build] // node
[windows-jdk8-m3.5.x_build] [WS-CLEANUP] Deleting project workspace...Cannot delete workspace :remote file operation failed: C:\Users\jenkins\AppData\Local\Temp\2/jenkins-maven-box-maven-assembly-plugin-master-46 at hudson.remoting.Channel@41afa848:JNLP4-connect connection from 37.48.69.226/37.48.69.226:49574: java.nio.file.AccessDeniedException: C:\Users\jenkins\AppData\Local\Temp\2\jenkins-maven-box-maven-assembly-plugin-master-46 -> C:\Users\jenkins\AppData\Local\Temp\2\jenkins-maven-box-maven-assembly-plugin-master-46_ws-cleanup_1546037409263
[Pipeline] [linux-jdk7-m3.3.x_build] // ws
[windows-jdk7-m3.2.x_build] [WS-CLEANUP] Deleting project workspace...Cannot delete workspace :remote file operation failed: C:\Users\jenkins\AppData\Local\Temp\2/jenkins-maven-box-maven-assembly-plugin-master-46 at hudson.remoting.Channel@121270d5:JNLP4-connect connection from 37.48.69.226/37.48.69.226:54213: java.nio.file.AccessDeniedException: C:\Users\jenkins\AppData\Local\Temp\2\jenkins-maven-box-maven-assembly-plugin-master-46 -> C:\Users\jenkins\AppData\Local\Temp\2\jenkins-maven-box-maven-assembly-plugin-master-46_ws-cleanup_1546037409285
[windows-jdk7-m3.3.x_build] [WS-CLEANUP] Deleting project workspace...Cannot delete workspace :remote file operation failed: C:\Users\jenkins\AppData\Local\Temp\2/jenkins-maven-box-maven-assembly-plugin-master-46 at hudson.remoting.Channel@7f96cc69:JNLP4-connect connection from 37.48.69.226/37.48.69.226:63010: java.nio.file.AccessDeniedException: C:\Users\jenkins\AppData\Local\Temp\2\jenkins-maven-box-maven-assembly-plugin-master-46 -> C:\Users\jenkins\AppData\Local\Temp\2\jenkins-maven-box-maven-assembly-plugin-master-46_ws-cleanup_1546037409273
[windows-jdk7-m3.5.x_build] [WS-CLEANUP] Deleting project workspace...Cannot delete workspace :remote file operation failed: C:\Users\jenkins\AppData\Local\Temp\2/jenkins-maven-box-maven-assembly-plugin-master-46@2 at hudson.remoting.Channel@7f96cc69:JNLP4-connect connection from 37.48.69.226/37.48.69.226:63010: java.nio.file.AccessDeniedException: C:\Users\jenkins\AppData\Local\Temp\2\jenkins-maven-box-maven-assembly-plugin-master-46@2 -> C:\Users\jenkins\AppData\Local\Temp\2\jenkins-maven-box-maven-assembly-plugin-master-46@2_ws-cleanup_1546037409276
[Pipeline] [linux-jdk7-m3.5.x_build] // stage
[Pipeline] [linux-jdk7-m3.2.x_build] // stage
[Pipeline] [linux-jdk11-m3.5.x_build] // stage
[Pipeline] [windows-jdk11-m3.5.x_build] // stage
[Pipeline] [linux-jdk8-m3.5.x_build] }
[Pipeline] [linux-jdk7-m3.3.x_build] }
[Pipeline] [linux-jdk7-m3.2.x_build] }
[Pipeline] [linux-jdk7-m3.5.x_build] }
[Pipeline] [linux-jdk11-m3.5.x_build] }
[Pipeline] [windows-jdk11-m3.5.x_build] }
[Pipeline] [windows-jdk8-m3.5.x_build] }
[Pipeline] [windows-jdk7-m3.2.x_build] }
[Pipeline] [windows-jdk7-m3.3.x_build] }
[Pipeline] [windows-jdk7-m3.5.x_build] }
[Pipeline] [linux-jdk7-m3.3.x_build] // node
[Pipeline] [linux-jdk7-m3.2.x_build] // ws
[Pipeline] [linux-jdk7-m3.5.x_build] // ws
[Pipeline] [linux-jdk11-m3.5.x_build] // ws
[Pipeline] [windows-jdk11-m3.5.x_build] // ws
[Pipeline] [linux-jdk7-m3.3.x_build] }
[Pipeline] [linux-jdk7-m3.2.x_build] }
[Pipeline] [linux-jdk7-m3.5.x_build] }
[Pipeline] [linux-jdk11-m3.5.x_build] }
[Pipeline] [windows-jdk11-m3.5.x_build] }
[Pipeline] [windows-jdk8-m3.5.x_build] // stage
[Pipeline] [windows-jdk8-m3.5.x_build] }
[Pipeline] [windows-jdk7-m3.2.x_build] // stage
[Pipeline] [windows-jdk7-m3.3.x_build] // stage
[Pipeline] [windows-jdk7-m3.5.x_build] // stage
[Pipeline] [windows-jdk7-m3.2.x_build] }
[Pipeline] [windows-jdk7-m3.3.x_build] }
[Pipeline] [windows-jdk7-m3.5.x_build] }
[Pipeline] [linux-jdk7-m3.2.x_build] // node
[Pipeline] [linux-jdk7-m3.5.x_build] // node
[Pipeline] [linux-jdk11-m3.5.x_build] // node
[Pipeline] [windows-jdk11-m3.5.x_build] // node
[Pipeline] [linux-jdk7-m3.2.x_build] }
[Pipeline] [linux-jdk7-m3.5.x_build] }
[Pipeline] [linux-jdk11-m3.5.x_build] }
[Pipeline] [windows-jdk11-m3.5.x_build] }
[windows-jdk11-m3.5.x_build] Failed in branch windows-jdk11-m3.5.x_build
[Pipeline] [windows-jdk8-m3.5.x_build] // ws
[Pipeline] [windows-jdk8-m3.5.x_build] }
[Pipeline] [windows-jdk7-m3.2.x_build] // ws
[Pipeline] [windows-jdk7-m3.3.x_build] // ws
[Pipeline] [windows-jdk7-m3.5.x_build] // ws
[Pipeline] [windows-jdk7-m3.2.x_build] }
[Pipeline] [windows-jdk7-m3.3.x_build] }
[Pipeline] [windows-jdk7-m3.5.x_build] }
[Pipeline] [windows-jdk8-m3.5.x_build] // node
[Pipeline] [windows-jdk8-m3.5.x_build] }
[windows-jdk8-m3.5.x_build] Failed in branch windows-jdk8-m3.5.x_build
[Pipeline] [windows-jdk7-m3.2.x_build] // node
[Pipeline] [windows-jdk7-m3.3.x_build] // node
[Pipeline] [windows-jdk7-m3.5.x_build] // node
[Pipeline] [windows-jdk7-m3.2.x_build] }
[windows-jdk7-m3.2.x_build] Failed in branch windows-jdk7-m3.2.x_build
[Pipeline] [windows-jdk7-m3.3.x_build] }
[windows-jdk7-m3.3.x_build] Failed in branch windows-jdk7-m3.3.x_build
[Pipeline] [windows-jdk7-m3.5.x_build] }
[windows-jdk7-m3.5.x_build] Failed in branch windows-jdk7-m3.5.x_build
[Pipeline] // parallel
[Pipeline] stage
[Pipeline] { (Notifications)
[Pipeline] echo
Build result: FAILURE
[Pipeline] jiraIssueSelector
[Pipeline] emailext
Reply | Threaded
Open this post in threaded view
|

Build failed in Jenkins: Maven TLP » maven-assembly-plugin » master #47

Apache Jenkins Server-2
See https://builds.apache.org/job/maven-box/job/maven-assembly-plugin/job/master/47/

Changes:

* [INFRA-17514] avoid tmpWs, shouldn't be needed anymore
* [INFRA-17514] avoid tmpWs, shouldn't be needed anymore
* [INFRA-17514] avoid tmpWs, shouldn't be needed anymore
* [INFRA-17514] avoid tmpWs, shouldn't be needed anymore
* [INFRA-17514] avoid tmpWs, shouldn't be needed anymore
* [INFRA-17514] avoid tmpWs, shouldn't be needed anymore
* [INFRA-17514] avoid tmpWs, shouldn't be needed anymore
* [INFRA-17514] avoid tmpWs, shouldn't be needed anymore
* [INFRA-17514] avoid tmpWs, shouldn't be needed anymore
* [INFRA-17514] avoid tmpWs, shouldn't be needed anymore

All tests passed

Build log:
[...truncated 4.05 MB...]
[windows-jdk11-m3.5.x_build] [INFO] Downloading from central: https://repo.maven.apache.org/maven2/commons-lang/commons-lang/2.1/commons-lang-2.1.jar
[windows-jdk11-m3.5.x_build] [INFO] Downloaded from central: https://repo.maven.apache.org/maven2/commons-cli/commons-cli/1.3.1/commons-cli-1.3.1.jar (53 kB at 197 kB/s)
[windows-jdk11-m3.5.x_build] [INFO] Downloading from central: https://repo.maven.apache.org/maven2/javax/xml/bind/jaxb-api/2.3.0/jaxb-api-2.3.0.jar
[windows-jdk11-m3.5.x_build] [INFO] Downloaded from central: https://repo.maven.apache.org/maven2/org/codehaus/plexus/plexus-resources/1.1.0/plexus-resources-1.1.0.jar (23 kB at 73 kB/s)
[windows-jdk11-m3.5.x_build] [INFO] Downloaded from central: https://repo.maven.apache.org/maven2/commons-lang/commons-lang/2.1/commons-lang-2.1.jar (208 kB at 624 kB/s)
[windows-jdk11-m3.5.x_build] [INFO] Downloaded from central: https://repo.maven.apache.org/maven2/javax/xml/bind/jaxb-api/2.3.0/jaxb-api-2.3.0.jar (126 kB at 358 kB/s)
[windows-jdk11-m3.5.x_build] [INFO] Downloaded from central: https://repo.maven.apache.org/maven2/org/apache/maven/doxia/doxia-integration-tools/1.6/doxia-integration-tools-1.6.jar (45 kB at 117 kB/s)
[windows-jdk11-m3.5.x_build] [INFO] Downloaded from central: https://repo.maven.apache.org/maven2/com/google/guava/guava/19.0/guava-19.0.jar (2.3 MB at 5.8 MB/s)
[windows-jdk11-m3.5.x_build] [INFO] There are 2 errors reported by Checkstyle 6.18 with config/maven_checks.xml ruleset.
[windows-jdk11-m3.5.x_build] [INFO] Ignored 2 errors, 0 violation remaining.
[windows-jdk11-m3.5.x_build] [INFO]
[windows-jdk11-m3.5.x_build] [INFO] --- maven-invoker-plugin:3.1.0:verify (integration-test) @ maven-assembly-plugin ---
[windows-jdk11-m3.5.x_build] [INFO] -------------------------------------------------
[windows-jdk11-m3.5.x_build] [INFO] Build Summary:
[windows-jdk11-m3.5.x_build] [INFO]   Passed: 135, Failed: 0, Errors: 0, Skipped: 2
[windows-jdk11-m3.5.x_build] [INFO] -------------------------------------------------
[windows-jdk11-m3.5.x_build] [INFO] ------------------------------------------------------------------------
[windows-jdk11-m3.5.x_build] [INFO] BUILD SUCCESS
[windows-jdk11-m3.5.x_build] [INFO] ------------------------------------------------------------------------
[windows-jdk11-m3.5.x_build] [INFO] Total time: 21:33 min
[windows-jdk11-m3.5.x_build] [INFO] Finished at: 2018-12-28T15:29:26-08:00
[windows-jdk11-m3.5.x_build] [INFO] Final Memory: 51M/177M
[windows-jdk11-m3.5.x_build] [INFO] ------------------------------------------------------------------------
[windows-jdk11-m3.5.x_build] [INFO] [jenkins-event-spy] Generated F:\jenkins\jenkins-slave\workspace\aven-assembly-plugin_master-SP4DXUL4GVN3Q5KJHI5ED6WPWUEC2L2PUW2RCT2SFVGTCXHUIFDQ@2@tmp\withMaven46106f2b\maven-spy-20181228-150752-2477082510680332063649.log
[Pipeline] [linux-jdk7-m3.3.x_build] }
[linux-jdk7-m3.3.x_build] [withMaven] artifactsPublisher - Archive artifact linux-jdk7-m3.3.x_build/pom.xml under org/apache/maven/plugins/maven-assembly-plugin/3.1.1-SNAPSHOT/maven-assembly-plugin-3.1.1-SNAPSHOT.pom
[linux-jdk7-m3.3.x_build] [withMaven] artifactsPublisher - Archive artifact linux-jdk7-m3.3.x_build/target/maven-assembly-plugin-3.1.1-SNAPSHOT.jar under org/apache/maven/plugins/maven-assembly-plugin/3.1.1-SNAPSHOT/maven-assembly-plugin-3.1.1-SNAPSHOT.jar
[linux-jdk7-m3.3.x_build] [withMaven] invokerPublisher - Archive invoker results for Maven artifact MavenArtifact{org.apache.maven.plugins:maven-assembly-plugin::3.1.1-SNAPSHOT(version: 3.1.1-SNAPSHOT, snapshot:false) } generated by PluginInvocation{org.apache.maven.plugins:maven-invoker-plugin:3.1.0@integration-test  integration-test}: linux-jdk7-m3.3.x_build/target/invoker-reports/*.xml
[linux-jdk7-m3.3.x_build] [withMaven] junitPublisher - Archive test results for Maven artifact org.apache.maven.plugins:maven-assembly-plugin:3.1.1-SNAPSHOT generated by maven-surefire-plugin:test (default-test): linux-jdk7-m3.3.x_build/target/surefire-reports/*.xml
[linux-jdk7-m3.3.x_build] Recording test results
[linux-jdk7-m3.3.x_build] [withMaven] openTasksPublisher - Scan Tasks for Maven artifact org.apache.maven.plugins:maven-assembly-plugin:3.1.1-SNAPSHOT in source directory linux-jdk7-m3.3.x_build/src/main/java
[linux-jdk7-m3.3.x_build] [TASKS] Scanning folder '/home/jenkins/jenkins-slave/workspace/aven-assembly-plugin_master-SP4DXUL4GVN3Q5KJHI5ED6WPWUEC2L2PUW2RCT2SFVGTCXHUIFDQ@2' for files matching the pattern 'linux-jdk7-m3.3.x_build/src/main/java/**/*' - excludes: null
[linux-jdk7-m3.3.x_build] [TASKS] Found 71 files to scan for tasks
[linux-jdk7-m3.3.x_build] [TASKS] Found 14 open tasks.
[linux-jdk7-m3.3.x_build] Skipping warnings blame since pipelines do not have an SCM link.%n
[linux-jdk7-m3.3.x_build] [TASKS] Computing warning deltas based on reference build #43
[Pipeline] [linux-jdk7-m3.2.x_build] }
[linux-jdk7-m3.2.x_build] [withMaven] artifactsPublisher - Archive artifact linux-jdk7-m3.2.x_build/pom.xml under org/apache/maven/plugins/maven-assembly-plugin/3.1.1-SNAPSHOT/maven-assembly-plugin-3.1.1-SNAPSHOT.pom
[linux-jdk7-m3.2.x_build] [withMaven] artifactsPublisher - Archive artifact linux-jdk7-m3.2.x_build/target/maven-assembly-plugin-3.1.1-SNAPSHOT.jar under org/apache/maven/plugins/maven-assembly-plugin/3.1.1-SNAPSHOT/maven-assembly-plugin-3.1.1-SNAPSHOT.jar
[linux-jdk7-m3.2.x_build] [withMaven] invokerPublisher - Archive invoker results for Maven artifact MavenArtifact{org.apache.maven.plugins:maven-assembly-plugin::3.1.1-SNAPSHOT(version: 3.1.1-SNAPSHOT, snapshot:false) } generated by PluginInvocation{org.apache.maven.plugins:maven-invoker-plugin:3.1.0@integration-test  integration-test}: linux-jdk7-m3.2.x_build/target/invoker-reports/*.xml
[linux-jdk7-m3.2.x_build] [withMaven] junitPublisher - Archive test results for Maven artifact org.apache.maven.plugins:maven-assembly-plugin:3.1.1-SNAPSHOT generated by maven-surefire-plugin:test (default-test): linux-jdk7-m3.2.x_build/target/surefire-reports/*.xml
[linux-jdk7-m3.2.x_build] Recording test results
[linux-jdk7-m3.2.x_build] [withMaven] openTasksPublisher - Scan Tasks for Maven artifact org.apache.maven.plugins:maven-assembly-plugin:3.1.1-SNAPSHOT in source directory linux-jdk7-m3.2.x_build/src/main/java
[linux-jdk7-m3.2.x_build] [TASKS] Scanning folder '/home/jenkins/jenkins-slave/workspace/aven-assembly-plugin_master-SP4DXUL4GVN3Q5KJHI5ED6WPWUEC2L2PUW2RCT2SFVGTCXHUIFDQ@2' for files matching the pattern 'linux-jdk7-m3.2.x_build/src/main/java/**/*' - excludes: null
[linux-jdk7-m3.2.x_build] [TASKS] Found 71 files to scan for tasks
[linux-jdk7-m3.2.x_build] [TASKS] Found 14 open tasks.
[linux-jdk7-m3.2.x_build] Skipping warnings blame since pipelines do not have an SCM link.%n
[linux-jdk7-m3.2.x_build] [TASKS] Computing warning deltas based on reference build #43
[Pipeline] [linux-jdk11-m3.5.x_build] }
[linux-jdk11-m3.5.x_build] [withMaven] artifactsPublisher - Archive artifact linux-jdk11-m3.5.x_build/pom.xml under org/apache/maven/plugins/maven-assembly-plugin/3.1.1-SNAPSHOT/maven-assembly-plugin-3.1.1-SNAPSHOT.pom
[linux-jdk11-m3.5.x_build] [withMaven] artifactsPublisher - Archive artifact linux-jdk11-m3.5.x_build/target/maven-assembly-plugin-3.1.1-SNAPSHOT.jar under org/apache/maven/plugins/maven-assembly-plugin/3.1.1-SNAPSHOT/maven-assembly-plugin-3.1.1-SNAPSHOT.jar
[linux-jdk11-m3.5.x_build] [withMaven] invokerPublisher - Archive invoker results for Maven artifact MavenArtifact{org.apache.maven.plugins:maven-assembly-plugin::3.1.1-SNAPSHOT(version: 3.1.1-SNAPSHOT, snapshot:false) } generated by PluginInvocation{org.apache.maven.plugins:maven-invoker-plugin:3.1.0@integration-test  integration-test}: linux-jdk11-m3.5.x_build/target/invoker-reports/*.xml
[linux-jdk11-m3.5.x_build] [withMaven] junitPublisher - Archive test results for Maven artifact org.apache.maven.plugins:maven-assembly-plugin:3.1.1-SNAPSHOT generated by maven-surefire-plugin:test (default-test): linux-jdk11-m3.5.x_build/target/surefire-reports/*.xml
[linux-jdk11-m3.5.x_build] Recording test results
[linux-jdk11-m3.5.x_build] [withMaven] openTasksPublisher - Scan Tasks for Maven artifact org.apache.maven.plugins:maven-assembly-plugin:3.1.1-SNAPSHOT in source directory linux-jdk11-m3.5.x_build/src/main/java
[linux-jdk11-m3.5.x_build] [TASKS] Scanning folder '/home/jenkins/jenkins-slave/workspace/aven-assembly-plugin_master-SP4DXUL4GVN3Q5KJHI5ED6WPWUEC2L2PUW2RCT2SFVGTCXHUIFDQ@2' for files matching the pattern 'linux-jdk11-m3.5.x_build/src/main/java/**/*' - excludes: null
[linux-jdk11-m3.5.x_build] [TASKS] Found 71 files to scan for tasks
[linux-jdk11-m3.5.x_build] [TASKS] Found 14 open tasks.
[linux-jdk11-m3.5.x_build] Skipping warnings blame since pipelines do not have an SCM link.%n
[linux-jdk11-m3.5.x_build] [TASKS] Computing warning deltas based on reference build #43
[Pipeline] [windows-jdk7-m3.2.x_build] }
[windows-jdk7-m3.2.x_build] [withMaven] artifactsPublisher - Archive artifact windows-jdk7-m3.2.x_build\pom.xml under org\apache\maven\plugins\maven-assembly-plugin\3.1.1-SNAPSHOT\maven-assembly-plugin-3.1.1-SNAPSHOT.pom
[windows-jdk7-m3.2.x_build] [withMaven] artifactsPublisher - Archive artifact windows-jdk7-m3.2.x_build\target\maven-assembly-plugin-3.1.1-SNAPSHOT.jar under org\apache\maven\plugins\maven-assembly-plugin\3.1.1-SNAPSHOT\maven-assembly-plugin-3.1.1-SNAPSHOT.jar
[windows-jdk7-m3.2.x_build] [withMaven] invokerPublisher - Archive invoker results for Maven artifact MavenArtifact{org.apache.maven.plugins:maven-assembly-plugin::3.1.1-SNAPSHOT(version: 3.1.1-SNAPSHOT, snapshot:false) } generated by PluginInvocation{org.apache.maven.plugins:maven-invoker-plugin:3.1.0@integration-test  integration-test}: windows-jdk7-m3.2.x_build\target\invoker-reports\*.xml
[windows-jdk7-m3.2.x_build] [withMaven] junitPublisher - Archive test results for Maven artifact org.apache.maven.plugins:maven-assembly-plugin:3.1.1-SNAPSHOT generated by maven-surefire-plugin:test (default-test): windows-jdk7-m3.2.x_build\target\surefire-reports\*.xml
[windows-jdk7-m3.2.x_build] Recording test results
[windows-jdk7-m3.2.x_build] [withMaven] openTasksPublisher - Scan Tasks for Maven artifact org.apache.maven.plugins:maven-assembly-plugin:3.1.1-SNAPSHOT in source directory windows-jdk7-m3.2.x_build\src\main\java
[windows-jdk7-m3.2.x_build] [TASKS] Scanning folder 'f:\jenkins\jenkins-slave\workspace\aven-assembly-plugin_master-SP4DXUL4GVN3Q5KJHI5ED6WPWUEC2L2PUW2RCT2SFVGTCXHUIFDQ@3' for files matching the pattern 'windows-jdk7-m3.2.x_build\src\main\java\**\*' - excludes: null
[windows-jdk7-m3.2.x_build] [TASKS] Found 71 files to scan for tasks
[windows-jdk7-m3.2.x_build] [TASKS] Found 14 open tasks.
[windows-jdk7-m3.2.x_build] Skipping warnings blame since pipelines do not have an SCM link.%n
[windows-jdk7-m3.2.x_build] [TASKS] Computing warning deltas based on reference build #43
[Pipeline] [windows-jdk7-m3.5.x_build] }
[windows-jdk7-m3.5.x_build] [withMaven] artifactsPublisher - Archive artifact windows-jdk7-m3.5.x_build\pom.xml under org\apache\maven\plugins\maven-assembly-plugin\3.1.1-SNAPSHOT\maven-assembly-plugin-3.1.1-SNAPSHOT.pom
[windows-jdk7-m3.5.x_build] [withMaven] artifactsPublisher - Archive artifact windows-jdk7-m3.5.x_build\target\maven-assembly-plugin-3.1.1-SNAPSHOT.jar under org\apache\maven\plugins\maven-assembly-plugin\3.1.1-SNAPSHOT\maven-assembly-plugin-3.1.1-SNAPSHOT.jar
[windows-jdk7-m3.5.x_build] [withMaven] invokerPublisher - Archive invoker results for Maven artifact MavenArtifact{org.apache.maven.plugins:maven-assembly-plugin::3.1.1-SNAPSHOT(version: 3.1.1-SNAPSHOT, snapshot:false) } generated by PluginInvocation{org.apache.maven.plugins:maven-invoker-plugin:3.1.0@integration-test  integration-test}: windows-jdk7-m3.5.x_build\target\invoker-reports\*.xml
[windows-jdk7-m3.5.x_build] [withMaven] junitPublisher - Archive test results for Maven artifact org.apache.maven.plugins:maven-assembly-plugin:3.1.1-SNAPSHOT generated by maven-surefire-plugin:test (default-test): windows-jdk7-m3.5.x_build\target\surefire-reports\*.xml
[windows-jdk7-m3.5.x_build] Recording test results
[windows-jdk7-m3.5.x_build] [withMaven] openTasksPublisher - Scan Tasks for Maven artifact org.apache.maven.plugins:maven-assembly-plugin:3.1.1-SNAPSHOT in source directory windows-jdk7-m3.5.x_build\src\main\java
[windows-jdk7-m3.5.x_build] [TASKS] Scanning folder 'f:\jenkins\jenkins-slave\workspace\aven-assembly-plugin_master-SP4DXUL4GVN3Q5KJHI5ED6WPWUEC2L2PUW2RCT2SFVGTCXHUIFDQ@2@2' for files matching the pattern 'windows-jdk7-m3.5.x_build\src\main\java\**\*' - excludes: null
[windows-jdk7-m3.5.x_build] [TASKS] Found 71 files to scan for tasks
[windows-jdk7-m3.5.x_build] [TASKS] Found 14 open tasks.
[windows-jdk7-m3.5.x_build] Skipping warnings blame since pipelines do not have an SCM link.%n
[windows-jdk7-m3.5.x_build] [TASKS] Computing warning deltas based on reference build #43
[Pipeline] [linux-jdk7-m3.3.x_build] // withMaven
[Pipeline] [linux-jdk7-m3.2.x_build] // withMaven
[Pipeline] [linux-jdk11-m3.5.x_build] // withMaven
[Pipeline] [windows-jdk7-m3.2.x_build] // withMaven
[Pipeline] [windows-jdk7-m3.5.x_build] // withMaven
[Pipeline] [linux-jdk7-m3.5.x_build] }
[Pipeline] [linux-jdk7-m3.3.x_build] cleanWs
[Pipeline] [linux-jdk7-m3.2.x_build] cleanWs
[Pipeline] [linux-jdk8-m3.5.x_build] }
[Pipeline] [linux-jdk11-m3.5.x_build] cleanWs
[Pipeline] [windows-jdk8-m3.5.x_build] }
[Pipeline] [windows-jdk7-m3.2.x_build] cleanWs
[Pipeline] [windows-jdk7-m3.5.x_build] cleanWs
[Pipeline] [windows-jdk7-m3.3.x_build] }
[Pipeline] [windows-jdk11-m3.5.x_build] }
[Pipeline] [linux-jdk7-m3.5.x_build] // dir
[Pipeline] [linux-jdk8-m3.5.x_build] // stage
[Pipeline] [windows-jdk8-m3.5.x_build] // dir
[Pipeline] [windows-jdk7-m3.3.x_build] // dir
[Pipeline] [windows-jdk11-m3.5.x_build] // dir
[linux-jdk7-m3.3.x_build] [WS-CLEANUP] Deleting project workspace...[WS-CLEANUP] done
[linux-jdk7-m3.2.x_build] [WS-CLEANUP] Deleting project workspace...[WS-CLEANUP] done
[linux-jdk11-m3.5.x_build] [WS-CLEANUP] Deleting project workspace...[WS-CLEANUP] done
[windows-jdk7-m3.2.x_build] [WS-CLEANUP] Deleting project workspace...Cannot delete workspace :remote file operation failed: f:\jenkins\jenkins-slave\workspace\aven-assembly-plugin_master-SP4DXUL4GVN3Q5KJHI5ED6WPWUEC2L2PUW2RCT2SFVGTCXHUIFDQ@3 at hudson.remoting.Channel@398d98d3:JNLP4-connect connection from ec2-34-228-168-168.compute-1.amazonaws.com/34.228.168.168:51626: java.nio.file.AccessDeniedException: f:\jenkins\jenkins-slave\workspace\aven-assembly-plugin_master-SP4DXUL4GVN3Q5KJHI5ED6WPWUEC2L2PUW2RCT2SFVGTCXHUIFDQ@3 -> f:\jenkins\jenkins-slave\workspace\aven-assembly-plugin_master-SP4DXUL4GVN3Q5KJHI5ED6WPWUEC2L2PUW2RCT2SFVGTCXHUIFDQ@3_ws-cleanup_1546040237948
[windows-jdk7-m3.5.x_build] [WS-CLEANUP] Deleting project workspace...Cannot delete workspace :remote file operation failed: f:\jenkins\jenkins-slave\workspace\aven-assembly-plugin_master-SP4DXUL4GVN3Q5KJHI5ED6WPWUEC2L2PUW2RCT2SFVGTCXHUIFDQ@2@2 at hudson.remoting.Channel@398d98d3:JNLP4-connect connection from ec2-34-228-168-168.compute-1.amazonaws.com/34.228.168.168:51626: java.nio.file.AccessDeniedException: f:\jenkins\jenkins-slave\workspace\aven-assembly-plugin_master-SP4DXUL4GVN3Q5KJHI5ED6WPWUEC2L2PUW2RCT2SFVGTCXHUIFDQ@2@2 -> f:\jenkins\jenkins-slave\workspace\aven-assembly-plugin_master-SP4DXUL4GVN3Q5KJHI5ED6WPWUEC2L2PUW2RCT2SFVGTCXHUIFDQ@2@2_ws-cleanup_1546040237952
[Pipeline] [linux-jdk8-m3.5.x_build] }
[Pipeline] [linux-jdk7-m3.5.x_build] }
[linux-jdk7-m3.5.x_build] [withMaven] artifactsPublisher - Archive artifact linux-jdk7-m3.5.x_build/pom.xml under org/apache/maven/plugins/maven-assembly-plugin/3.1.1-SNAPSHOT/maven-assembly-plugin-3.1.1-SNAPSHOT.pom
[linux-jdk7-m3.5.x_build] [withMaven] artifactsPublisher - Archive artifact linux-jdk7-m3.5.x_build/target/maven-assembly-plugin-3.1.1-SNAPSHOT.jar under org/apache/maven/plugins/maven-assembly-plugin/3.1.1-SNAPSHOT/maven-assembly-plugin-3.1.1-SNAPSHOT.jar
[linux-jdk7-m3.5.x_build] [withMaven] invokerPublisher - Archive invoker results for Maven artifact MavenArtifact{org.apache.maven.plugins:maven-assembly-plugin::3.1.1-SNAPSHOT(version: 3.1.1-SNAPSHOT, snapshot:false) } generated by PluginInvocation{org.apache.maven.plugins:maven-invoker-plugin:3.1.0@integration-test  integration-test}: linux-jdk7-m3.5.x_build/target/invoker-reports/*.xml
[linux-jdk7-m3.5.x_build] [withMaven] junitPublisher - Archive test results for Maven artifact org.apache.maven.plugins:maven-assembly-plugin:3.1.1-SNAPSHOT generated by maven-surefire-plugin:test (default-test): linux-jdk7-m3.5.x_build/target/surefire-reports/*.xml
[linux-jdk7-m3.5.x_build] Recording test results
[linux-jdk7-m3.5.x_build] [withMaven] openTasksPublisher - Scan Tasks for Maven artifact org.apache.maven.plugins:maven-assembly-plugin:3.1.1-SNAPSHOT in source directory linux-jdk7-m3.5.x_build/src/main/java
[linux-jdk7-m3.5.x_build] [TASKS] Scanning folder '/home/jenkins/jenkins-slave/workspace/aven-assembly-plugin_master-SP4DXUL4GVN3Q5KJHI5ED6WPWUEC2L2PUW2RCT2SFVGTCXHUIFDQ@2' for files matching the pattern 'linux-jdk7-m3.5.x_build/src/main/java/**/*' - excludes: null
[linux-jdk7-m3.5.x_build] [TASKS] Found 71 files to scan for tasks
[linux-jdk7-m3.5.x_build] [TASKS] Found 14 open tasks.
[linux-jdk7-m3.5.x_build] Skipping warnings blame since pipelines do not have an SCM link.%n
[linux-jdk7-m3.5.x_build] [TASKS] Computing warning deltas based on reference build #43
[Pipeline] [windows-jdk8-m3.5.x_build] }
[windows-jdk8-m3.5.x_build] [withMaven] artifactsPublisher - Archive artifact windows-jdk8-m3.5.x_build\pom.xml under org\apache\maven\plugins\maven-assembly-plugin\3.1.1-SNAPSHOT\maven-assembly-plugin-3.1.1-SNAPSHOT.pom
[windows-jdk8-m3.5.x_build] [withMaven] artifactsPublisher - Archive artifact windows-jdk8-m3.5.x_build\target\maven-assembly-plugin-3.1.1-SNAPSHOT.jar under org\apache\maven\plugins\maven-assembly-plugin\3.1.1-SNAPSHOT\maven-assembly-plugin-3.1.1-SNAPSHOT.jar
[windows-jdk8-m3.5.x_build] [withMaven] invokerPublisher - Archive invoker results for Maven artifact MavenArtifact{org.apache.maven.plugins:maven-assembly-plugin::3.1.1-SNAPSHOT(version: 3.1.1-SNAPSHOT, snapshot:false) } generated by PluginInvocation{org.apache.maven.plugins:maven-invoker-plugin:3.1.0@integration-test  integration-test}: windows-jdk8-m3.5.x_build\target\invoker-reports\*.xml
[windows-jdk8-m3.5.x_build] [withMaven] junitPublisher - Archive test results for Maven artifact org.apache.maven.plugins:maven-assembly-plugin:3.1.1-SNAPSHOT generated by maven-surefire-plugin:test (default-test): windows-jdk8-m3.5.x_build\target\surefire-reports\*.xml
[windows-jdk8-m3.5.x_build] Recording test results
[windows-jdk8-m3.5.x_build] [withMaven] openTasksPublisher - Scan Tasks for Maven artifact org.apache.maven.plugins:maven-assembly-plugin:3.1.1-SNAPSHOT in source directory windows-jdk8-m3.5.x_build\src\main\java
[windows-jdk8-m3.5.x_build] [TASKS] Scanning folder 'f:\jenkins\jenkins-slave\workspace\aven-assembly-plugin_master-SP4DXUL4GVN3Q5KJHI5ED6WPWUEC2L2PUW2RCT2SFVGTCXHUIFDQ@2' for files matching the pattern 'windows-jdk8-m3.5.x_build\src\main\java\**\*' - excludes: null
[windows-jdk8-m3.5.x_build] [TASKS] Found 71 files to scan for tasks
[windows-jdk8-m3.5.x_build] [TASKS] Found 14 open tasks.
[windows-jdk8-m3.5.x_build] Skipping warnings blame since pipelines do not have an SCM link.%n
[windows-jdk8-m3.5.x_build] [TASKS] Computing warning deltas based on reference build #43
[Pipeline] [windows-jdk7-m3.3.x_build] }
[windows-jdk7-m3.3.x_build] [withMaven] artifactsPublisher - Archive artifact windows-jdk7-m3.3.x_build\pom.xml under org\apache\maven\plugins\maven-assembly-plugin\3.1.1-SNAPSHOT\maven-assembly-plugin-3.1.1-SNAPSHOT.pom
[windows-jdk7-m3.3.x_build] [withMaven] artifactsPublisher - Archive artifact windows-jdk7-m3.3.x_build\target\maven-assembly-plugin-3.1.1-SNAPSHOT.jar under org\apache\maven\plugins\maven-assembly-plugin\3.1.1-SNAPSHOT\maven-assembly-plugin-3.1.1-SNAPSHOT.jar
[windows-jdk7-m3.3.x_build] [withMaven] invokerPublisher - Archive invoker results for Maven artifact MavenArtifact{org.apache.maven.plugins:maven-assembly-plugin::3.1.1-SNAPSHOT(version: 3.1.1-SNAPSHOT, snapshot:false) } generated by PluginInvocation{org.apache.maven.plugins:maven-invoker-plugin:3.1.0@integration-test  integration-test}: windows-jdk7-m3.3.x_build\target\invoker-reports\*.xml
[windows-jdk7-m3.3.x_build] [withMaven] junitPublisher - Archive test results for Maven artifact org.apache.maven.plugins:maven-assembly-plugin:3.1.1-SNAPSHOT generated by maven-surefire-plugin:test (default-test): windows-jdk7-m3.3.x_build\target\surefire-reports\*.xml
[windows-jdk7-m3.3.x_build] Recording test results
[windows-jdk7-m3.3.x_build] [withMaven] openTasksPublisher - Scan Tasks for Maven artifact org.apache.maven.plugins:maven-assembly-plugin:3.1.1-SNAPSHOT in source directory windows-jdk7-m3.3.x_build\src\main\java
[windows-jdk7-m3.3.x_build] [TASKS] Scanning folder 'f:\jenkins\jenkins-slave\workspace\aven-assembly-plugin_master-SP4DXUL4GVN3Q5KJHI5ED6WPWUEC2L2PUW2RCT2SFVGTCXHUIFDQ@2' for files matching the pattern 'windows-jdk7-m3.3.x_build\src\main\java\**\*' - excludes: null
[windows-jdk7-m3.3.x_build] [TASKS] Found 71 files to scan for tasks
[windows-jdk7-m3.3.x_build] [TASKS] Found 14 open tasks.
[windows-jdk7-m3.3.x_build] Skipping warnings blame since pipelines do not have an SCM link.%n
[windows-jdk7-m3.3.x_build] [TASKS] Computing warning deltas based on reference build #43
[Pipeline] [windows-jdk11-m3.5.x_build] }
[windows-jdk11-m3.5.x_build] [withMaven] artifactsPublisher - Archive artifact windows-jdk11-m3.5.x_build\pom.xml under org\apache\maven\plugins\maven-assembly-plugin\3.1.1-SNAPSHOT\maven-assembly-plugin-3.1.1-SNAPSHOT.pom
[windows-jdk11-m3.5.x_build] [withMaven] artifactsPublisher - Archive artifact windows-jdk11-m3.5.x_build\target\maven-assembly-plugin-3.1.1-SNAPSHOT.jar under org\apache\maven\plugins\maven-assembly-plugin\3.1.1-SNAPSHOT\maven-assembly-plugin-3.1.1-SNAPSHOT.jar
[windows-jdk11-m3.5.x_build] [withMaven] invokerPublisher - Archive invoker results for Maven artifact MavenArtifact{org.apache.maven.plugins:maven-assembly-plugin::3.1.1-SNAPSHOT(version: 3.1.1-SNAPSHOT, snapshot:false) } generated by PluginInvocation{org.apache.maven.plugins:maven-invoker-plugin:3.1.0@integration-test  integration-test}: windows-jdk11-m3.5.x_build\target\invoker-reports\*.xml
[windows-jdk11-m3.5.x_build] [withMaven] junitPublisher - Archive test results for Maven artifact org.apache.maven.plugins:maven-assembly-plugin:3.1.1-SNAPSHOT generated by maven-surefire-plugin:test (default-test): windows-jdk11-m3.5.x_build\target\surefire-reports\*.xml
[windows-jdk11-m3.5.x_build] Recording test results
[windows-jdk11-m3.5.x_build] [withMaven] openTasksPublisher - Scan Tasks for Maven artifact org.apache.maven.plugins:maven-assembly-plugin:3.1.1-SNAPSHOT in source directory windows-jdk11-m3.5.x_build\src\main\java
[windows-jdk11-m3.5.x_build] [TASKS] Scanning folder 'f:\jenkins\jenkins-slave\workspace\aven-assembly-plugin_master-SP4DXUL4GVN3Q5KJHI5ED6WPWUEC2L2PUW2RCT2SFVGTCXHUIFDQ@2' for files matching the pattern 'windows-jdk11-m3.5.x_build\src\main\java\**\*' - excludes: null
[windows-jdk11-m3.5.x_build] [TASKS] Found 71 files to scan for tasks
[windows-jdk11-m3.5.x_build] [TASKS] Found 14 open tasks.
[windows-jdk11-m3.5.x_build] Skipping warnings blame since pipelines do not have an SCM link.%n
[windows-jdk11-m3.5.x_build] [TASKS] Computing warning deltas based on reference build #43
[Pipeline] [linux-jdk8-m3.5.x_build] // ws
[Pipeline] [linux-jdk7-m3.5.x_build] // withMaven
[Pipeline] [windows-jdk8-m3.5.x_build] // withMaven
[Pipeline] [windows-jdk7-m3.3.x_build] // withMaven
[Pipeline] [windows-jdk11-m3.5.x_build] // withMaven
[Pipeline] [linux-jdk8-m3.5.x_build] }
[Pipeline] [linux-jdk7-m3.5.x_build] cleanWs
[Pipeline] [linux-jdk7-m3.3.x_build] }
[Pipeline] [linux-jdk7-m3.2.x_build] }
[Pipeline] [linux-jdk11-m3.5.x_build] }
[Pipeline] [windows-jdk8-m3.5.x_build] cleanWs
[Pipeline] [windows-jdk7-m3.2.x_build] }
[Pipeline] [windows-jdk7-m3.5.x_build] }
[Pipeline] [windows-jdk7-m3.3.x_build] cleanWs
[Pipeline] [windows-jdk11-m3.5.x_build] cleanWs
[linux-jdk7-m3.5.x_build] [WS-CLEANUP] Deleting project workspace...[WS-CLEANUP] done
[Pipeline] [linux-jdk8-m3.5.x_build] // node
[windows-jdk8-m3.5.x_build] [WS-CLEANUP] Deleting project workspace...Cannot delete workspace :remote file operation failed: f:\jenkins\jenkins-slave\workspace\aven-assembly-plugin_master-SP4DXUL4GVN3Q5KJHI5ED6WPWUEC2L2PUW2RCT2SFVGTCXHUIFDQ@2 at hudson.remoting.Channel@41afa848:JNLP4-connect connection from 37.48.69.226/37.48.69.226:49574: java.nio.file.AccessDeniedException: f:\jenkins\jenkins-slave\workspace\aven-assembly-plugin_master-SP4DXUL4GVN3Q5KJHI5ED6WPWUEC2L2PUW2RCT2SFVGTCXHUIFDQ@2 -> f:\jenkins\jenkins-slave\workspace\aven-assembly-plugin_master-SP4DXUL4GVN3Q5KJHI5ED6WPWUEC2L2PUW2RCT2SFVGTCXHUIFDQ@2_ws-cleanup_1546040630717
[Pipeline] [linux-jdk7-m3.3.x_build] // stage
[Pipeline] [linux-jdk7-m3.2.x_build] // stage
[windows-jdk7-m3.3.x_build] [WS-CLEANUP] Deleting project workspace...Cannot delete workspace :remote file operation failed: f:\jenkins\jenkins-slave\workspace\aven-assembly-plugin_master-SP4DXUL4GVN3Q5KJHI5ED6WPWUEC2L2PUW2RCT2SFVGTCXHUIFDQ@2 at hudson.remoting.Channel@7f96cc69:JNLP4-connect connection from 37.48.69.226/37.48.69.226:63010: java.nio.file.AccessDeniedException: f:\jenkins\jenkins-slave\workspace\aven-assembly-plugin_master-SP4DXUL4GVN3Q5KJHI5ED6WPWUEC2L2PUW2RCT2SFVGTCXHUIFDQ@2 -> f:\jenkins\jenkins-slave\workspace\aven-assembly-plugin_master-SP4DXUL4GVN3Q5KJHI5ED6WPWUEC2L2PUW2RCT2SFVGTCXHUIFDQ@2_ws-cleanup_1546040630735
[windows-jdk11-m3.5.x_build] [WS-CLEANUP] Deleting project workspace...Cannot delete workspace :remote file operation failed: f:\jenkins\jenkins-slave\workspace\aven-assembly-plugin_master-SP4DXUL4GVN3Q5KJHI5ED6WPWUEC2L2PUW2RCT2SFVGTCXHUIFDQ@2 at hudson.remoting.Channel@6cb8ec07:JNLP4-connect connection from 37.48.69.226/37.48.69.226:60168: java.nio.file.AccessDeniedException: f:\jenkins\jenkins-slave\workspace\aven-assembly-plugin_master-SP4DXUL4GVN3Q5KJHI5ED6WPWUEC2L2PUW2RCT2SFVGTCXHUIFDQ@2 -> f:\jenkins\jenkins-slave\workspace\aven-assembly-plugin_master-SP4DXUL4GVN3Q5KJHI5ED6WPWUEC2L2PUW2RCT2SFVGTCXHUIFDQ@2_ws-cleanup_1546040630741
[Pipeline] [linux-jdk11-m3.5.x_build] // stage
[Pipeline] [windows-jdk7-m3.2.x_build] // stage
[Pipeline] [windows-jdk7-m3.5.x_build] // stage
[Pipeline] [linux-jdk8-m3.5.x_build] }
[Pipeline] [linux-jdk7-m3.2.x_build] }
[Pipeline] [linux-jdk7-m3.3.x_build] }
[Pipeline] [linux-jdk11-m3.5.x_build] }
[Pipeline] [windows-jdk7-m3.2.x_build] }
[Pipeline] [windows-jdk7-m3.5.x_build] }
[Pipeline] [linux-jdk7-m3.5.x_build] }
[Pipeline] [windows-jdk8-m3.5.x_build] }
[Pipeline] [windows-jdk7-m3.3.x_build] }
[Pipeline] [windows-jdk11-m3.5.x_build] }
[Pipeline] [linux-jdk7-m3.2.x_build] // ws
[Pipeline] [linux-jdk7-m3.3.x_build] // ws
[Pipeline] [linux-jdk11-m3.5.x_build] // ws
[Pipeline] [windows-jdk7-m3.2.x_build] // ws
[Pipeline] [windows-jdk7-m3.5.x_build] // ws
[Pipeline] [linux-jdk7-m3.5.x_build] // stage
[Pipeline] [linux-jdk7-m3.2.x_build] }
[Pipeline] [linux-jdk7-m3.3.x_build] }
[Pipeline] [linux-jdk11-m3.5.x_build] }
[Pipeline] [windows-jdk7-m3.2.x_build] }
[Pipeline] [windows-jdk7-m3.5.x_build] }
[Pipeline] [linux-jdk7-m3.5.x_build] }
[Pipeline] [windows-jdk8-m3.5.x_build] // stage
[Pipeline] [windows-jdk8-m3.5.x_build] }
[Pipeline] [windows-jdk7-m3.3.x_build] // stage
[Pipeline] [windows-jdk11-m3.5.x_build] // stage
[Pipeline] [windows-jdk7-m3.3.x_build] }
[Pipeline] [windows-jdk11-m3.5.x_build] }
[Pipeline] [linux-jdk7-m3.2.x_build] // node
[Pipeline] [linux-jdk7-m3.3.x_build] // node
[Pipeline] [linux-jdk11-m3.5.x_build] // node
[Pipeline] [windows-jdk7-m3.2.x_build] // node
[Pipeline] [windows-jdk7-m3.5.x_build] // node
[Pipeline] [linux-jdk7-m3.5.x_build] // ws
[Pipeline] [linux-jdk7-m3.2.x_build] }
[Pipeline] [linux-jdk7-m3.3.x_build] }
[Pipeline] [linux-jdk11-m3.5.x_build] }
[Pipeline] [windows-jdk7-m3.2.x_build] }
[windows-jdk7-m3.2.x_build] Failed in branch windows-jdk7-m3.2.x_build
[Pipeline] [windows-jdk7-m3.5.x_build] }
[windows-jdk7-m3.5.x_build] Failed in branch windows-jdk7-m3.5.x_build
[Pipeline] [linux-jdk7-m3.5.x_build] }
[Pipeline] [windows-jdk8-m3.5.x_build] // ws
[Pipeline] [windows-jdk8-m3.5.x_build] }
[Pipeline] [windows-jdk7-m3.3.x_build] // ws
[Pipeline] [windows-jdk11-m3.5.x_build] // ws
[Pipeline] [windows-jdk7-m3.3.x_build] }
[Pipeline] [windows-jdk11-m3.5.x_build] }
[Pipeline] [linux-jdk7-m3.5.x_build] // node
[Pipeline] [linux-jdk7-m3.5.x_build] }
[Pipeline] [windows-jdk8-m3.5.x_build] // node
[Pipeline] [windows-jdk8-m3.5.x_build] }
[windows-jdk8-m3.5.x_build] Failed in branch windows-jdk8-m3.5.x_build
[Pipeline] [windows-jdk7-m3.3.x_build] // node
[Pipeline] [windows-jdk11-m3.5.x_build] // node
[Pipeline] [windows-jdk7-m3.3.x_build] }
[windows-jdk7-m3.3.x_build] Failed in branch windows-jdk7-m3.3.x_build
[Pipeline] [windows-jdk11-m3.5.x_build] }
[windows-jdk11-m3.5.x_build] Failed in branch windows-jdk11-m3.5.x_build
[Pipeline] // parallel
[Pipeline] stage
[Pipeline] { (Notifications)
[Pipeline] echo
Build result: FAILURE
[Pipeline] jiraIssueSelector
[Pipeline] emailext
Reply | Threaded
Open this post in threaded view
|

Build failed in Jenkins: Maven TLP » maven-assembly-plugin » master #48

Apache Jenkins Server-2
See https://builds.apache.org/job/maven-box/job/maven-assembly-plugin/job/master/48/

Changes:

* use publisherStrategy: 'EXPLICIT' to avoid non used publishers
* [INFRA-17514] Fix file separator + add other locations for workspaces
* fix indent
* [MASSEMBLY-901] Fix trivial javadocs HTML errors
* [MASSEMBLY-901] Fix trivial javadocs HTML errors
* [MASSEMBLY-901] Fix trivial javadocs HTML errors
* [MASSEMBLY-901] Fix trivial javadocs HTML errors
* [MASSEMBLY-901] Fix trivial javadocs HTML errors
* [MASSEMBLY-901] Fix trivial javadocs HTML errors
* [MASSEMBLY-901] Fix trivial javadocs HTML errors
* [MASSEMBLY-901] Fix trivial javadocs HTML errors

All tests passed

Build log:
[...truncated 4.05 MB...]
[windows-jdk7-m3.2.x_build] [INFO] Downloading: https://repo.maven.apache.org/maven2/commons-beanutils/commons-beanutils/1.9.2/commons-beanutils-1.9.2.pom
[windows-jdk7-m3.2.x_build] [INFO] Downloaded: https://repo.maven.apache.org/maven2/commons-beanutils/commons-beanutils/1.9.2/commons-beanutils-1.9.2.pom (14 KB at 285.1 KB/sec)
[windows-jdk7-m3.2.x_build] [INFO] Downloading: https://repo.maven.apache.org/maven2/org/apache/commons/commons-parent/33/commons-parent-33.pom
[windows-jdk7-m3.2.x_build] [INFO] Downloaded: https://repo.maven.apache.org/maven2/org/apache/commons/commons-parent/33/commons-parent-33.pom (52 KB at 797.6 KB/sec)
[windows-jdk7-m3.2.x_build] [INFO] Downloading: https://repo.maven.apache.org/maven2/commons-cli/commons-cli/1.3.1/commons-cli-1.3.1.pom
[windows-jdk7-m3.2.x_build] [INFO] Downloaded: https://repo.maven.apache.org/maven2/commons-cli/commons-cli/1.3.1/commons-cli-1.3.1.pom (11 KB at 191.5 KB/sec)
[windows-jdk7-m3.2.x_build] [INFO] Downloading: https://repo.maven.apache.org/maven2/com/google/guava/guava/19.0/guava-19.0.pom
[windows-jdk7-m3.2.x_build] [INFO] Downloaded: https://repo.maven.apache.org/maven2/com/google/guava/guava/19.0/guava-19.0.pom (7 KB at 141.1 KB/sec)
[windows-jdk7-m3.2.x_build] [INFO] Downloading: https://repo.maven.apache.org/maven2/com/google/guava/guava-parent/19.0/guava-parent-19.0.pom
[windows-jdk7-m3.2.x_build] [INFO] Downloaded: https://repo.maven.apache.org/maven2/com/google/guava/guava-parent/19.0/guava-parent-19.0.pom (10 KB at 192.9 KB/sec)
[windows-jdk7-m3.2.x_build] [INFO] Downloading: https://repo.maven.apache.org/maven2/org/sonatype/oss/oss-parent/7/oss-parent-7.pom
[windows-jdk7-m3.2.x_build] [INFO] Downloaded: https://repo.maven.apache.org/maven2/org/sonatype/oss/oss-parent/7/oss-parent-7.pom (5 KB at 88.9 KB/sec)
[windows-jdk7-m3.2.x_build] [INFO] Downloading: https://repo.maven.apache.org/maven2/org/apache/maven/shared/maven-shared-resources/2/maven-shared-resources-2.jar
[windows-jdk7-m3.2.x_build] [INFO] Downloading: https://repo.maven.apache.org/maven2/org/apache/maven/doxia/doxia-core/1.2/doxia-core-1.2.jar
[windows-jdk7-m3.2.x_build] [INFO] Downloading: https://repo.maven.apache.org/maven2/commons-digester/commons-digester/1.6/commons-digester-1.6.jar
[windows-jdk7-m3.2.x_build] [INFO] Downloading: https://repo.maven.apache.org/maven2/org/apache/maven/doxia/doxia-integration-tools/1.6/doxia-integration-tools-1.6.jar
[windows-jdk7-m3.2.x_build] [INFO] Downloading: https://repo.maven.apache.org/maven2/commons-logging/commons-logging/1.0.4/commons-logging-1.0.4.jar
[windows-jdk7-m3.2.x_build] [INFO] Downloaded: https://repo.maven.apache.org/maven2/org/apache/maven/doxia/doxia-core/1.2/doxia-core-1.2.jar (151 KB at 2150.1 KB/sec)
[windows-jdk7-m3.2.x_build] [INFO] Downloading: https://repo.maven.apache.org/maven2/commons-io/commons-io/1.4/commons-io-1.4.jar
[windows-jdk7-m3.2.x_build] [INFO] Downloaded: https://repo.maven.apache.org/maven2/commons-logging/commons-logging/1.0.4/commons-logging-1.0.4.jar (38 KB at 378.8 KB/sec)
[windows-jdk7-m3.2.x_build] [INFO] Downloading: https://repo.maven.apache.org/maven2/org/codehaus/plexus/plexus-resources/1.1.0/plexus-resources-1.1.0.jar
[windows-jdk7-m3.2.x_build] [INFO] Downloaded: https://repo.maven.apache.org/maven2/commons-digester/commons-digester/1.6/commons-digester-1.6.jar (165 KB at 1326.6 KB/sec)
[windows-jdk7-m3.2.x_build] [INFO] Downloading: https://repo.maven.apache.org/maven2/com/puppycrawl/tools/checkstyle/6.18/checkstyle-6.18.jar
[windows-jdk7-m3.2.x_build] [INFO] Downloaded: https://repo.maven.apache.org/maven2/commons-io/commons-io/1.4/commons-io-1.4.jar (107 KB at 812.9 KB/sec)
[windows-jdk7-m3.2.x_build] [INFO] Downloading: https://repo.maven.apache.org/maven2/antlr/antlr/2.7.7/antlr-2.7.7.jar
[windows-jdk7-m3.2.x_build] [INFO] Downloaded: https://repo.maven.apache.org/maven2/org/apache/maven/shared/maven-shared-resources/2/maven-shared-resources-2.jar (13 KB at 79.7 KB/sec)
[windows-jdk7-m3.2.x_build] [INFO] Downloading: https://repo.maven.apache.org/maven2/org/antlr/antlr4-runtime/4.5.3/antlr4-runtime-4.5.3.jar
[windows-jdk7-m3.2.x_build] [INFO] Downloaded: https://repo.maven.apache.org/maven2/antlr/antlr/2.7.7/antlr-2.7.7.jar (435 KB at 2264.9 KB/sec)
[windows-jdk7-m3.2.x_build] [INFO] Downloading: https://repo.maven.apache.org/maven2/commons-beanutils/commons-beanutils/1.9.2/commons-beanutils-1.9.2.jar
[windows-jdk7-m3.2.x_build] [INFO] Downloaded: https://repo.maven.apache.org/maven2/org/antlr/antlr4-runtime/4.5.3/antlr4-runtime-4.5.3.jar (296 KB at 1385.7 KB/sec)
[windows-jdk7-m3.2.x_build] [INFO] Downloading: https://repo.maven.apache.org/maven2/commons-cli/commons-cli/1.3.1/commons-cli-1.3.1.jar
[windows-jdk7-m3.2.x_build] [INFO] Downloaded: https://repo.maven.apache.org/maven2/com/puppycrawl/tools/checkstyle/6.18/checkstyle-6.18.jar (1132 KB at 5165.1 KB/sec)
[windows-jdk7-m3.2.x_build] [INFO] Downloading: https://repo.maven.apache.org/maven2/com/google/guava/guava/19.0/guava-19.0.jar
[windows-jdk7-m3.2.x_build] [INFO] Downloaded: https://repo.maven.apache.org/maven2/commons-beanutils/commons-beanutils/1.9.2/commons-beanutils-1.9.2.jar (229 KB at 871.7 KB/sec)
[windows-jdk7-m3.2.x_build] [INFO] Downloading: https://repo.maven.apache.org/maven2/commons-lang/commons-lang/2.1/commons-lang-2.1.jar
[windows-jdk7-m3.2.x_build] [INFO] Downloaded: https://repo.maven.apache.org/maven2/commons-cli/commons-cli/1.3.1/commons-cli-1.3.1.jar (52 KB at 188.2 KB/sec)
[windows-jdk7-m3.2.x_build] [INFO] Downloaded: https://repo.maven.apache.org/maven2/org/codehaus/plexus/plexus-resources/1.1.0/plexus-resources-1.1.0.jar (23 KB at 74.1 KB/sec)
[windows-jdk7-m3.2.x_build] [INFO] Downloaded: https://repo.maven.apache.org/maven2/commons-lang/commons-lang/2.1/commons-lang-2.1.jar (203 KB at 628.0 KB/sec)
[windows-jdk7-m3.2.x_build] [INFO] Downloaded: https://repo.maven.apache.org/maven2/com/google/guava/guava/19.0/guava-19.0.jar (2255 KB at 6553.5 KB/sec)
[windows-jdk7-m3.2.x_build] [INFO] Downloaded: https://repo.maven.apache.org/maven2/org/apache/maven/doxia/doxia-integration-tools/1.6/doxia-integration-tools-1.6.jar (44 KB at 123.5 KB/sec)
[windows-jdk7-m3.2.x_build] [INFO] There are 2 errors reported by Checkstyle 6.18 with config/maven_checks.xml ruleset.
[windows-jdk7-m3.2.x_build] [INFO] Ignored 2 errors, 0 violation remaining.
[windows-jdk7-m3.2.x_build] [INFO]
[windows-jdk7-m3.2.x_build] [INFO] --- maven-invoker-plugin:3.1.0:verify (integration-test) @ maven-assembly-plugin ---
[windows-jdk7-m3.2.x_build] [INFO] -------------------------------------------------
[windows-jdk7-m3.2.x_build] [INFO] Build Summary:
[windows-jdk7-m3.2.x_build] [INFO]   Passed: 134, Failed: 0, Errors: 0, Skipped: 3
[windows-jdk7-m3.2.x_build] [INFO] -------------------------------------------------
[windows-jdk7-m3.2.x_build] [INFO] ------------------------------------------------------------------------
[windows-jdk7-m3.2.x_build] [INFO] BUILD SUCCESS
[windows-jdk7-m3.2.x_build] [INFO] ------------------------------------------------------------------------
[windows-jdk7-m3.2.x_build] [INFO] Total time: 23:18 min
[windows-jdk7-m3.2.x_build] [INFO] Finished at: 2018-12-29T01:06:17-08:00
[windows-jdk7-m3.2.x_build] [INFO] Final Memory: 47M/282M
[windows-jdk7-m3.2.x_build] [INFO] ------------------------------------------------------------------------
[windows-jdk7-m3.2.x_build] [INFO] [jenkins-event-spy] Generated F:\jenkins\jenkins-slave\workspace\aven-assembly-plugin_master-SP4DXUL4GVN3Q5KJHI5ED6WPWUEC2L2PUW2RCT2SFVGTCXHUIFDQ@2@tmp\withMaven38a0d671\maven-spy-20181229-004258-3894356134548924292796.log
[windows-jdk7-m3.2.x_build] Picked up JAVA_TOOL_OPTIONS: -Dmaven.ext.class.path="f:\jenkins\jenkins-slave\workspace\aven-assembly-plugin_master-SP4DXUL4GVN3Q5KJHI5ED6WPWUEC2L2PUW2RCT2SFVGTCXHUIFDQ@2@tmp\withMaven38a0d671\pipeline-maven-spy.jar" -Dorg.jenkinsci.plugins.pipeline.maven.reportsFolder="f:\jenkins\jenkins-slave\workspace\aven-assembly-plugin_master-SP4DXUL4GVN3Q5KJHI5ED6WPWUEC2L2PUW2RCT2SFVGTCXHUIFDQ@2@tmp\withMaven38a0d671"
[Pipeline] [linux-jdk11-m3.5.x_build] }
[Pipeline] [linux-jdk7-m3.5.x_build] }
[linux-jdk7-m3.5.x_build] [withMaven] artifactsPublisher - Archive artifact linux-jdk7-m3.5.x_build/pom.xml under org/apache/maven/plugins/maven-assembly-plugin/3.1.1-SNAPSHOT/maven-assembly-plugin-3.1.1-SNAPSHOT.pom
[linux-jdk7-m3.5.x_build] [withMaven] artifactsPublisher - Archive artifact linux-jdk7-m3.5.x_build/target/maven-assembly-plugin-3.1.1-SNAPSHOT.jar under org/apache/maven/plugins/maven-assembly-plugin/3.1.1-SNAPSHOT/maven-assembly-plugin-3.1.1-SNAPSHOT.jar
[linux-jdk7-m3.5.x_build] [withMaven] junitPublisher - Archive test results for Maven artifact org.apache.maven.plugins:maven-assembly-plugin:3.1.1-SNAPSHOT generated by maven-surefire-plugin:test (default-test): linux-jdk7-m3.5.x_build/target/surefire-reports/*.xml
[linux-jdk7-m3.5.x_build] Recording test results
[linux-jdk7-m3.5.x_build] [withMaven] openTasksPublisher - Scan Tasks for Maven artifact org.apache.maven.plugins:maven-assembly-plugin:3.1.1-SNAPSHOT in source directory linux-jdk7-m3.5.x_build/src/main/java
[linux-jdk7-m3.5.x_build] [TASKS] Scanning folder '/home/jenkins/jenkins-slave/workspace/aven-assembly-plugin_master-SP4DXUL4GVN3Q5KJHI5ED6WPWUEC2L2PUW2RCT2SFVGTCXHUIFDQ@3' for files matching the pattern 'linux-jdk7-m3.5.x_build/src/main/java/**/*' - excludes: null
[linux-jdk7-m3.5.x_build] [TASKS] Found 71 files to scan for tasks
[linux-jdk7-m3.5.x_build] [TASKS] Found 14 open tasks.
[linux-jdk7-m3.5.x_build] Skipping warnings blame since pipelines do not have an SCM link.%n
[linux-jdk7-m3.5.x_build] [TASKS] Computing warning deltas based on reference build #43
[linux-jdk7-m3.5.x_build] [withMaven] invokerPublisher - Archive invoker results for Maven artifact MavenArtifact{org.apache.maven.plugins:maven-assembly-plugin::3.1.1-SNAPSHOT(version: 3.1.1-SNAPSHOT, snapshot:false) } generated by PluginInvocation{org.apache.maven.plugins:maven-invoker-plugin:3.1.0@integration-test  integration-test}: linux-jdk7-m3.5.x_build/target/invoker-reports/*.xml
[Pipeline] [linux-jdk8-m3.5.x_build] }
[linux-jdk8-m3.5.x_build] [withMaven] artifactsPublisher - Archive artifact linux-jdk8-m3.5.x_build/pom.xml under org/apache/maven/plugins/maven-assembly-plugin/3.1.1-SNAPSHOT/maven-assembly-plugin-3.1.1-SNAPSHOT.pom
[linux-jdk8-m3.5.x_build] [withMaven] artifactsPublisher - Archive artifact linux-jdk8-m3.5.x_build/target/maven-assembly-plugin-3.1.1-SNAPSHOT.jar under org/apache/maven/plugins/maven-assembly-plugin/3.1.1-SNAPSHOT/maven-assembly-plugin-3.1.1-SNAPSHOT.jar
[linux-jdk8-m3.5.x_build] [withMaven] junitPublisher - Archive test results for Maven artifact org.apache.maven.plugins:maven-assembly-plugin:3.1.1-SNAPSHOT generated by maven-surefire-plugin:test (default-test): linux-jdk8-m3.5.x_build/target/surefire-reports/*.xml
[linux-jdk8-m3.5.x_build] Recording test results
[linux-jdk8-m3.5.x_build] [withMaven] openTasksPublisher - Scan Tasks for Maven artifact org.apache.maven.plugins:maven-assembly-plugin:3.1.1-SNAPSHOT in source directory linux-jdk8-m3.5.x_build/src/main/java
[linux-jdk8-m3.5.x_build] [TASKS] Scanning folder '/home/jenkins/jenkins-slave/workspace/aven-assembly-plugin_master-SP4DXUL4GVN3Q5KJHI5ED6WPWUEC2L2PUW2RCT2SFVGTCXHUIFDQ@2@2' for files matching the pattern 'linux-jdk8-m3.5.x_build/src/main/java/**/*' - excludes: null
[linux-jdk8-m3.5.x_build] [TASKS] Found 71 files to scan for tasks
[linux-jdk8-m3.5.x_build] [TASKS] Found 14 open tasks.
[linux-jdk8-m3.5.x_build] Skipping warnings blame since pipelines do not have an SCM link.%n
[linux-jdk8-m3.5.x_build] [TASKS] Computing warning deltas based on reference build #43
[linux-jdk8-m3.5.x_build] [withMaven] invokerPublisher - Archive invoker results for Maven artifact MavenArtifact{org.apache.maven.plugins:maven-assembly-plugin::3.1.1-SNAPSHOT(version: 3.1.1-SNAPSHOT, snapshot:false) } generated by PluginInvocation{org.apache.maven.plugins:maven-invoker-plugin:3.1.0@integration-test  integration-test}: linux-jdk8-m3.5.x_build/target/invoker-reports/*.xml
[Pipeline] [windows-jdk7-m3.5.x_build] }
[windows-jdk7-m3.5.x_build] [withMaven] artifactsPublisher - Archive artifact windows-jdk7-m3.5.x_build\pom.xml under org\apache\maven\plugins\maven-assembly-plugin\3.1.1-SNAPSHOT\maven-assembly-plugin-3.1.1-SNAPSHOT.pom
[windows-jdk7-m3.5.x_build] [withMaven] artifactsPublisher - Archive artifact windows-jdk7-m3.5.x_build\target\maven-assembly-plugin-3.1.1-SNAPSHOT.jar under org\apache\maven\plugins\maven-assembly-plugin\3.1.1-SNAPSHOT\maven-assembly-plugin-3.1.1-SNAPSHOT.jar
[windows-jdk7-m3.5.x_build] [withMaven] junitPublisher - Archive test results for Maven artifact org.apache.maven.plugins:maven-assembly-plugin:3.1.1-SNAPSHOT generated by maven-surefire-plugin:test (default-test): windows-jdk7-m3.5.x_build\target\surefire-reports\*.xml
[windows-jdk7-m3.5.x_build] Recording test results
[windows-jdk7-m3.5.x_build] [withMaven] openTasksPublisher - Scan Tasks for Maven artifact org.apache.maven.plugins:maven-assembly-plugin:3.1.1-SNAPSHOT in source directory windows-jdk7-m3.5.x_build\src\main\java
[windows-jdk7-m3.5.x_build] [TASKS] Scanning folder 'f:\jenkins\jenkins-slave\workspace\aven-assembly-plugin_master-SP4DXUL4GVN3Q5KJHI5ED6WPWUEC2L2PUW2RCT2SFVGTCXHUIFDQ@3' for files matching the pattern 'windows-jdk7-m3.5.x_build\src\main\java\**\*' - excludes: null
[windows-jdk7-m3.5.x_build] [TASKS] Found 71 files to scan for tasks
[windows-jdk7-m3.5.x_build] [TASKS] Found 14 open tasks.
[windows-jdk7-m3.5.x_build] Skipping warnings blame since pipelines do not have an SCM link.%n
[windows-jdk7-m3.5.x_build] [TASKS] Computing warning deltas based on reference build #43
[windows-jdk7-m3.5.x_build] [withMaven] invokerPublisher - Archive invoker results for Maven artifact MavenArtifact{org.apache.maven.plugins:maven-assembly-plugin::3.1.1-SNAPSHOT(version: 3.1.1-SNAPSHOT, snapshot:false) } generated by PluginInvocation{org.apache.maven.plugins:maven-invoker-plugin:3.1.0@integration-test  integration-test}: windows-jdk7-m3.5.x_build\target\invoker-reports\*.xml
[Pipeline] [windows-jdk11-m3.5.x_build] }
[windows-jdk11-m3.5.x_build] [withMaven] artifactsPublisher - Archive artifact windows-jdk11-m3.5.x_build\pom.xml under org\apache\maven\plugins\maven-assembly-plugin\3.1.1-SNAPSHOT\maven-assembly-plugin-3.1.1-SNAPSHOT.pom
[windows-jdk11-m3.5.x_build] [withMaven] artifactsPublisher - Archive artifact windows-jdk11-m3.5.x_build\target\maven-assembly-plugin-3.1.1-SNAPSHOT.jar under org\apache\maven\plugins\maven-assembly-plugin\3.1.1-SNAPSHOT\maven-assembly-plugin-3.1.1-SNAPSHOT.jar
[windows-jdk11-m3.5.x_build] [withMaven] junitPublisher - Archive test results for Maven artifact org.apache.maven.plugins:maven-assembly-plugin:3.1.1-SNAPSHOT generated by maven-surefire-plugin:test (default-test): windows-jdk11-m3.5.x_build\target\surefire-reports\*.xml
[windows-jdk11-m3.5.x_build] Recording test results
[windows-jdk11-m3.5.x_build] [withMaven] openTasksPublisher - Scan Tasks for Maven artifact org.apache.maven.plugins:maven-assembly-plugin:3.1.1-SNAPSHOT in source directory windows-jdk11-m3.5.x_build\src\main\java
[windows-jdk11-m3.5.x_build] [TASKS] Scanning folder 'f:\jenkins\jenkins-slave\workspace\aven-assembly-plugin_master-SP4DXUL4GVN3Q5KJHI5ED6WPWUEC2L2PUW2RCT2SFVGTCXHUIFDQ@2@2' for files matching the pattern 'windows-jdk11-m3.5.x_build\src\main\java\**\*' - excludes: null
[windows-jdk11-m3.5.x_build] [TASKS] Found 71 files to scan for tasks
[windows-jdk11-m3.5.x_build] [TASKS] Found 14 open tasks.
[windows-jdk11-m3.5.x_build] Skipping warnings blame since pipelines do not have an SCM link.%n
[windows-jdk11-m3.5.x_build] [TASKS] Computing warning deltas based on reference build #43
[windows-jdk11-m3.5.x_build] [withMaven] invokerPublisher - Archive invoker results for Maven artifact MavenArtifact{org.apache.maven.plugins:maven-assembly-plugin::3.1.1-SNAPSHOT(version: 3.1.1-SNAPSHOT, snapshot:false) } generated by PluginInvocation{org.apache.maven.plugins:maven-invoker-plugin:3.1.0@integration-test  integration-test}: windows-jdk11-m3.5.x_build\target\invoker-reports\*.xml
[Pipeline] [linux-jdk11-m3.5.x_build] // ws
[Pipeline] [linux-jdk7-m3.5.x_build] // withMaven
[Pipeline] [linux-jdk8-m3.5.x_build] // withMaven
[Pipeline] [windows-jdk7-m3.5.x_build] // withMaven
[Pipeline] [windows-jdk11-m3.5.x_build] // withMaven
[Pipeline] [linux-jdk11-m3.5.x_build] }
[Pipeline] [linux-jdk7-m3.5.x_build] cleanWs
[linux-jdk7-m3.5.x_build] [WS-CLEANUP] Deleting project workspace...[WS-CLEANUP] done
[Pipeline] [linux-jdk8-m3.5.x_build] cleanWs
[linux-jdk8-m3.5.x_build] [WS-CLEANUP] Deleting project workspace...[WS-CLEANUP] done
[Pipeline] [linux-jdk7-m3.2.x_build] }
[Pipeline] [linux-jdk7-m3.3.x_build] }
[Pipeline] [windows-jdk7-m3.5.x_build] cleanWs
[Pipeline] [windows-jdk11-m3.5.x_build] cleanWs
[Pipeline] [windows-jdk7-m3.3.x_build] }
[Pipeline] [windows-jdk8-m3.5.x_build] }
[Pipeline] [windows-jdk7-m3.2.x_build] }
[Pipeline] [linux-jdk11-m3.5.x_build] // node
[Pipeline] [linux-jdk7-m3.2.x_build] // stage
[Pipeline] [linux-jdk7-m3.3.x_build] // stage
[Pipeline] [windows-jdk7-m3.3.x_build] // dir
[Pipeline] [windows-jdk8-m3.5.x_build] // dir
[Pipeline] [windows-jdk7-m3.2.x_build] // dir
[windows-jdk7-m3.5.x_build] [WS-CLEANUP] Deleting project workspace...Cannot delete workspace :remote file operation failed: f:\jenkins\jenkins-slave\workspace\aven-assembly-plugin_master-SP4DXUL4GVN3Q5KJHI5ED6WPWUEC2L2PUW2RCT2SFVGTCXHUIFDQ@3 at hudson.remoting.Channel@398d98d3:JNLP4-connect connection from ec2-34-228-168-168.compute-1.amazonaws.com/34.228.168.168:51626: java.nio.file.AccessDeniedException: f:\jenkins\jenkins-slave\workspace\aven-assembly-plugin_master-SP4DXUL4GVN3Q5KJHI5ED6WPWUEC2L2PUW2RCT2SFVGTCXHUIFDQ@3 -> f:\jenkins\jenkins-slave\workspace\aven-assembly-plugin_master-SP4DXUL4GVN3Q5KJHI5ED6WPWUEC2L2PUW2RCT2SFVGTCXHUIFDQ@3_ws-cleanup_1546074830991
[windows-jdk11-m3.5.x_build] [WS-CLEANUP] Deleting project workspace...Cannot delete workspace :remote file operation failed: f:\jenkins\jenkins-slave\workspace\aven-assembly-plugin_master-SP4DXUL4GVN3Q5KJHI5ED6WPWUEC2L2PUW2RCT2SFVGTCXHUIFDQ@2@2 at hudson.remoting.Channel@398d98d3:JNLP4-connect connection from ec2-34-228-168-168.compute-1.amazonaws.com/34.228.168.168:51626: java.nio.file.AccessDeniedException: f:\jenkins\jenkins-slave\workspace\aven-assembly-plugin_master-SP4DXUL4GVN3Q5KJHI5ED6WPWUEC2L2PUW2RCT2SFVGTCXHUIFDQ@2@2 -> f:\jenkins\jenkins-slave\workspace\aven-assembly-plugin_master-SP4DXUL4GVN3Q5KJHI5ED6WPWUEC2L2PUW2RCT2SFVGTCXHUIFDQ@2@2_ws-cleanup_1546074831000
[Pipeline] [linux-jdk11-m3.5.x_build] }
[Pipeline] [linux-jdk7-m3.2.x_build] }
[Pipeline] [linux-jdk7-m3.3.x_build] }
[Pipeline] [linux-jdk7-m3.5.x_build] }
[Pipeline] [linux-jdk8-m3.5.x_build] }
[Pipeline] [windows-jdk7-m3.3.x_build] }
[windows-jdk7-m3.3.x_build] [withMaven] artifactsPublisher - Archive artifact windows-jdk7-m3.3.x_build\pom.xml under org\apache\maven\plugins\maven-assembly-plugin\3.1.1-SNAPSHOT\maven-assembly-plugin-3.1.1-SNAPSHOT.pom
[windows-jdk7-m3.3.x_build] [withMaven] artifactsPublisher - Archive artifact windows-jdk7-m3.3.x_build\target\maven-assembly-plugin-3.1.1-SNAPSHOT.jar under org\apache\maven\plugins\maven-assembly-plugin\3.1.1-SNAPSHOT\maven-assembly-plugin-3.1.1-SNAPSHOT.jar
[windows-jdk7-m3.3.x_build] [withMaven] junitPublisher - Archive test results for Maven artifact org.apache.maven.plugins:maven-assembly-plugin:3.1.1-SNAPSHOT generated by maven-surefire-plugin:test (default-test): windows-jdk7-m3.3.x_build\target\surefire-reports\*.xml
[windows-jdk7-m3.3.x_build] Recording test results
[windows-jdk7-m3.3.x_build] [withMaven] openTasksPublisher - Scan Tasks for Maven artifact org.apache.maven.plugins:maven-assembly-plugin:3.1.1-SNAPSHOT in source directory windows-jdk7-m3.3.x_build\src\main\java
[windows-jdk7-m3.3.x_build] [TASKS] Scanning folder 'f:\jenkins\jenkins-slave\workspace\aven-assembly-plugin_master-SP4DXUL4GVN3Q5KJHI5ED6WPWUEC2L2PUW2RCT2SFVGTCXHUIFDQ@3' for files matching the pattern 'windows-jdk7-m3.3.x_build\src\main\java\**\*' - excludes: null
[windows-jdk7-m3.3.x_build] [TASKS] Found 71 files to scan for tasks
[windows-jdk7-m3.3.x_build] [TASKS] Found 14 open tasks.
[windows-jdk7-m3.3.x_build] Skipping warnings blame since pipelines do not have an SCM link.%n
[windows-jdk7-m3.3.x_build] [TASKS] Computing warning deltas based on reference build #43
[windows-jdk7-m3.3.x_build] [withMaven] invokerPublisher - Archive invoker results for Maven artifact MavenArtifact{org.apache.maven.plugins:maven-assembly-plugin::3.1.1-SNAPSHOT(version: 3.1.1-SNAPSHOT, snapshot:false) } generated by PluginInvocation{org.apache.maven.plugins:maven-invoker-plugin:3.1.0@integration-test  integration-test}: windows-jdk7-m3.3.x_build\target\invoker-reports\*.xml
[Pipeline] [windows-jdk8-m3.5.x_build] }
[windows-jdk8-m3.5.x_build] [withMaven] artifactsPublisher - Archive artifact windows-jdk8-m3.5.x_build\pom.xml under org\apache\maven\plugins\maven-assembly-plugin\3.1.1-SNAPSHOT\maven-assembly-plugin-3.1.1-SNAPSHOT.pom
[windows-jdk8-m3.5.x_build] [withMaven] artifactsPublisher - Archive artifact windows-jdk8-m3.5.x_build\target\maven-assembly-plugin-3.1.1-SNAPSHOT.jar under org\apache\maven\plugins\maven-assembly-plugin\3.1.1-SNAPSHOT\maven-assembly-plugin-3.1.1-SNAPSHOT.jar
[windows-jdk8-m3.5.x_build] [withMaven] junitPublisher - Archive test results for Maven artifact org.apache.maven.plugins:maven-assembly-plugin:3.1.1-SNAPSHOT generated by maven-surefire-plugin:test (default-test): windows-jdk8-m3.5.x_build\target\surefire-reports\*.xml
[windows-jdk8-m3.5.x_build] Recording test results
[windows-jdk8-m3.5.x_build] [withMaven] openTasksPublisher - Scan Tasks for Maven artifact org.apache.maven.plugins:maven-assembly-plugin:3.1.1-SNAPSHOT in source directory windows-jdk8-m3.5.x_build\src\main\java
[windows-jdk8-m3.5.x_build] [TASKS] Scanning folder 'f:\jenkins\jenkins-slave\workspace\aven-assembly-plugin_master-SP4DXUL4GVN3Q5KJHI5ED6WPWUEC2L2PUW2RCT2SFVGTCXHUIFDQ@2@2' for files matching the pattern 'windows-jdk8-m3.5.x_build\src\main\java\**\*' - excludes: null
[windows-jdk8-m3.5.x_build] [TASKS] Found 71 files to scan for tasks
[windows-jdk8-m3.5.x_build] [TASKS] Found 14 open tasks.
[windows-jdk8-m3.5.x_build] Skipping warnings blame since pipelines do not have an SCM link.%n
[windows-jdk8-m3.5.x_build] [TASKS] Computing warning deltas based on reference build #43
[windows-jdk8-m3.5.x_build] [withMaven] invokerPublisher - Archive invoker results for Maven artifact MavenArtifact{org.apache.maven.plugins:maven-assembly-plugin::3.1.1-SNAPSHOT(version: 3.1.1-SNAPSHOT, snapshot:false) } generated by PluginInvocation{org.apache.maven.plugins:maven-invoker-plugin:3.1.0@integration-test  integration-test}: windows-jdk8-m3.5.x_build\target\invoker-reports\*.xml
[Pipeline] [windows-jdk7-m3.2.x_build] }
[windows-jdk7-m3.2.x_build] [withMaven] artifactsPublisher - Archive artifact windows-jdk7-m3.2.x_build\pom.xml under org\apache\maven\plugins\maven-assembly-plugin\3.1.1-SNAPSHOT\maven-assembly-plugin-3.1.1-SNAPSHOT.pom
[windows-jdk7-m3.2.x_build] [withMaven] artifactsPublisher - Archive artifact windows-jdk7-m3.2.x_build\target\maven-assembly-plugin-3.1.1-SNAPSHOT.jar under org\apache\maven\plugins\maven-assembly-plugin\3.1.1-SNAPSHOT\maven-assembly-plugin-3.1.1-SNAPSHOT.jar
[windows-jdk7-m3.2.x_build] [withMaven] junitPublisher - Archive test results for Maven artifact org.apache.maven.plugins:maven-assembly-plugin:3.1.1-SNAPSHOT generated by maven-surefire-plugin:test (default-test): windows-jdk7-m3.2.x_build\target\surefire-reports\*.xml
[windows-jdk7-m3.2.x_build] Recording test results
[windows-jdk7-m3.2.x_build] [withMaven] openTasksPublisher - Scan Tasks for Maven artifact org.apache.maven.plugins:maven-assembly-plugin:3.1.1-SNAPSHOT in source directory windows-jdk7-m3.2.x_build\src\main\java
[windows-jdk7-m3.2.x_build] [TASKS] Scanning folder 'f:\jenkins\jenkins-slave\workspace\aven-assembly-plugin_master-SP4DXUL4GVN3Q5KJHI5ED6WPWUEC2L2PUW2RCT2SFVGTCXHUIFDQ@2' for files matching the pattern 'windows-jdk7-m3.2.x_build\src\main\java\**\*' - excludes: null
[windows-jdk7-m3.2.x_build] [TASKS] Found 71 files to scan for tasks
[windows-jdk7-m3.2.x_build] [TASKS] Found 14 open tasks.
[windows-jdk7-m3.2.x_build] Skipping warnings blame since pipelines do not have an SCM link.%n
[windows-jdk7-m3.2.x_build] [TASKS] Computing warning deltas based on reference build #43
[windows-jdk7-m3.2.x_build] [withMaven] invokerPublisher - Archive invoker results for Maven artifact MavenArtifact{org.apache.maven.plugins:maven-assembly-plugin::3.1.1-SNAPSHOT(version: 3.1.1-SNAPSHOT, snapshot:false) } generated by PluginInvocation{org.apache.maven.plugins:maven-invoker-plugin:3.1.0@integration-test  integration-test}: windows-jdk7-m3.2.x_build\target\invoker-reports\*.xml
[Pipeline] [linux-jdk7-m3.2.x_build] // ws
[Pipeline] [linux-jdk7-m3.3.x_build] // ws
[Pipeline] [linux-jdk7-m3.5.x_build] // stage
[Pipeline] [linux-jdk8-m3.5.x_build] // stage
[Pipeline] [windows-jdk7-m3.3.x_build] // withMaven
[Pipeline] [windows-jdk8-m3.5.x_build] // withMaven
[Pipeline] [windows-jdk7-m3.2.x_build] // withMaven
[Pipeline] [linux-jdk7-m3.2.x_build] }
[Pipeline] [linux-jdk7-m3.3.x_build] }
[Pipeline] [linux-jdk7-m3.5.x_build] }
[Pipeline] [linux-jdk8-m3.5.x_build] }
[Pipeline] [windows-jdk7-m3.5.x_build] }
[Pipeline] [windows-jdk11-m3.5.x_build] }
[Pipeline] [windows-jdk7-m3.3.x_build] cleanWs
[Pipeline] [windows-jdk8-m3.5.x_build] cleanWs
[Pipeline] [windows-jdk7-m3.2.x_build] cleanWs
[Pipeline] [linux-jdk7-m3.2.x_build] // node
[Pipeline] [linux-jdk7-m3.3.x_build] // node
[windows-jdk7-m3.3.x_build] [WS-CLEANUP] Deleting project workspace...Cannot delete workspace :remote file operation failed: f:\jenkins\jenkins-slave\workspace\aven-assembly-plugin_master-SP4DXUL4GVN3Q5KJHI5ED6WPWUEC2L2PUW2RCT2SFVGTCXHUIFDQ@3 at hudson.remoting.Channel@7f96cc69:JNLP4-connect connection from 37.48.69.226/37.48.69.226:63010: java.nio.file.AccessDeniedException: f:\jenkins\jenkins-slave\workspace\aven-assembly-plugin_master-SP4DXUL4GVN3Q5KJHI5ED6WPWUEC2L2PUW2RCT2SFVGTCXHUIFDQ@3 -> f:\jenkins\jenkins-slave\workspace\aven-assembly-plugin_master-SP4DXUL4GVN3Q5KJHI5ED6WPWUEC2L2PUW2RCT2SFVGTCXHUIFDQ@3_ws-cleanup_1546075153486
[windows-jdk8-m3.5.x_build] [WS-CLEANUP] Deleting project workspace...Cannot delete workspace :remote file operation failed: f:\jenkins\jenkins-slave\workspace\aven-assembly-plugin_master-SP4DXUL4GVN3Q5KJHI5ED6WPWUEC2L2PUW2RCT2SFVGTCXHUIFDQ@2@2 at hudson.remoting.Channel@7f96cc69:JNLP4-connect connection from 37.48.69.226/37.48.69.226:63010: java.nio.file.AccessDeniedException: f:\jenkins\jenkins-slave\workspace\aven-assembly-plugin_master-SP4DXUL4GVN3Q5KJHI5ED6WPWUEC2L2PUW2RCT2SFVGTCXHUIFDQ@2@2 -> f:\jenkins\jenkins-slave\workspace\aven-assembly-plugin_master-SP4DXUL4GVN3Q5KJHI5ED6WPWUEC2L2PUW2RCT2SFVGTCXHUIFDQ@2@2_ws-cleanup_1546075153489
[windows-jdk7-m3.2.x_build] [WS-CLEANUP] Deleting project workspace...Cannot delete workspace :remote file operation failed: f:\jenkins\jenkins-slave\workspace\aven-assembly-plugin_master-SP4DXUL4GVN3Q5KJHI5ED6WPWUEC2L2PUW2RCT2SFVGTCXHUIFDQ@2 at hudson.remoting.Channel@121270d5:JNLP4-connect connection from 37.48.69.226/37.48.69.226:54213: java.nio.file.AccessDeniedException: f:\jenkins\jenkins-slave\workspace\aven-assembly-plugin_master-SP4DXUL4GVN3Q5KJHI5ED6WPWUEC2L2PUW2RCT2SFVGTCXHUIFDQ@2 -> f:\jenkins\jenkins-slave\workspace\aven-assembly-plugin_master-SP4DXUL4GVN3Q5KJHI5ED6WPWUEC2L2PUW2RCT2SFVGTCXHUIFDQ@2_ws-cleanup_1546075153498
[Pipeline] [linux-jdk7-m3.5.x_build] // ws
[Pipeline] [linux-jdk8-m3.5.x_build] // ws
[Pipeline] [windows-jdk7-m3.5.x_build] // stage
[Pipeline] [windows-jdk11-m3.5.x_build] // stage
[Pipeline] [linux-jdk7-m3.2.x_build] }
[Pipeline] [linux-jdk7-m3.3.x_build] }
[Pipeline] [linux-jdk7-m3.5.x_build] }
[Pipeline] [linux-jdk8-m3.5.x_build] }
[Pipeline] [windows-jdk7-m3.5.x_build] }
[Pipeline] [windows-jdk11-m3.5.x_build] }
[Pipeline] [windows-jdk7-m3.3.x_build] }
[Pipeline] [windows-jdk8-m3.5.x_build] }
[Pipeline] [windows-jdk7-m3.2.x_build] }
[Pipeline] [linux-jdk7-m3.5.x_build] // node
[Pipeline] [linux-jdk8-m3.5.x_build] // node
[Pipeline] [windows-jdk7-m3.5.x_build] // ws
[Pipeline] [windows-jdk11-m3.5.x_build] // ws
[Pipeline] [linux-jdk7-m3.5.x_build] }
[Pipeline] [linux-jdk8-m3.5.x_build] }
[Pipeline] [windows-jdk7-m3.5.x_build] }
[Pipeline] [windows-jdk11-m3.5.x_build] }
[Pipeline] [windows-jdk7-m3.3.x_build] // stage
[Pipeline] [windows-jdk8-m3.5.x_build] // stage
[Pipeline] [windows-jdk7-m3.2.x_build] // stage
[Pipeline] [windows-jdk7-m3.2.x_build] }
[Pipeline] [windows-jdk7-m3.3.x_build] }
[Pipeline] [windows-jdk8-m3.5.x_build] }
[Pipeline] [windows-jdk7-m3.5.x_build] // node
[Pipeline] [windows-jdk11-m3.5.x_build] // node
[Pipeline] [windows-jdk7-m3.5.x_build] }
[windows-jdk7-m3.5.x_build] Failed in branch windows-jdk7-m3.5.x_build
[Pipeline] [windows-jdk11-m3.5.x_build] }
[windows-jdk11-m3.5.x_build] Failed in branch windows-jdk11-m3.5.x_build
[Pipeline] [windows-jdk7-m3.2.x_build] // ws
[Pipeline] [windows-jdk7-m3.3.x_build] // ws
[Pipeline] [windows-jdk8-m3.5.x_build] // ws
[Pipeline] [windows-jdk7-m3.2.x_build] }
[Pipeline] [windows-jdk7-m3.3.x_build] }
[Pipeline] [windows-jdk8-m3.5.x_build] }
[Pipeline] [windows-jdk7-m3.2.x_build] // node
[Pipeline] [windows-jdk7-m3.3.x_build] // node
[Pipeline] [windows-jdk8-m3.5.x_build] // node
[Pipeline] [windows-jdk7-m3.2.x_build] }
[windows-jdk7-m3.2.x_build] Failed in branch windows-jdk7-m3.2.x_build
[Pipeline] [windows-jdk7-m3.3.x_build] }
[windows-jdk7-m3.3.x_build] Failed in branch windows-jdk7-m3.3.x_build
[Pipeline] [windows-jdk8-m3.5.x_build] }
[windows-jdk8-m3.5.x_build] Failed in branch windows-jdk8-m3.5.x_build
[Pipeline] // parallel
[Pipeline] stage
[Pipeline] { (Notifications)
[Pipeline] echo
Build result: FAILURE
[Pipeline] jiraIssueSelector
[Pipeline] jiraComment
[Pipeline] emailext
Reply | Threaded
Open this post in threaded view
|

Build failed in Jenkins: Maven TLP » maven-assembly-plugin » master #49

Apache Jenkins Server-2
See https://builds.apache.org/job/maven-box/job/maven-assembly-plugin/job/master/49/

Changes:

* [maven-release-plugin] prepare release maven-assembly-plugin-3.1.1
* [maven-release-plugin] prepare release maven-assembly-plugin-3.1.1
* [maven-release-plugin] prepare release maven-assembly-plugin-3.1.1
* [maven-release-plugin] prepare release maven-assembly-plugin-3.1.1
* [maven-release-plugin] prepare release maven-assembly-plugin-3.1.1
* [maven-release-plugin] prepare release maven-assembly-plugin-3.1.1
* [maven-release-plugin] prepare release maven-assembly-plugin-3.1.1
* [maven-release-plugin] prepare release maven-assembly-plugin-3.1.1
* [maven-release-plugin] prepare release maven-assembly-plugin-3.1.1
* [maven-release-plugin] prepare release maven-assembly-plugin-3.1.1

All tests passed

Build log:
[...truncated 4.05 MB...]
[windows-jdk8-m3.5.x_build] [INFO] Finished at: 2018-12-29T01:42:19-08:00
[windows-jdk7-m3.3.x_build] [INFO] There are 2 errors reported by Checkstyle 6.18 with config/maven_checks.xml ruleset.
[windows-jdk7-m3.3.x_build] [INFO] Ignored 2 errors, 0 violation remaining.
[windows-jdk7-m3.3.x_build] [INFO]
[windows-jdk7-m3.3.x_build] [INFO] --- maven-invoker-plugin:3.1.0:verify (integration-test) @ maven-assembly-plugin ---
[windows-jdk7-m3.3.x_build] [INFO] -------------------------------------------------
[windows-jdk7-m3.3.x_build] [INFO] Build Summary:
[windows-jdk7-m3.3.x_build] [INFO]   Passed: 134, Failed: 0, Errors: 0, Skipped: 3
[windows-jdk7-m3.3.x_build] [INFO] -------------------------------------------------
[windows-jdk7-m3.3.x_build] [INFO] ------------------------------------------------------------------------
[windows-jdk7-m3.3.x_build] [INFO] BUILD SUCCESS
[windows-jdk7-m3.3.x_build] [INFO] ------------------------------------------------------------------------
[windows-jdk7-m3.3.x_build] [INFO] Total time: 24:57 min
[windows-jdk7-m3.3.x_build] [INFO] Finished at: 2018-12-29T01:42:20-08:00
[windows-jdk8-m3.5.x_build] [INFO] Final Memory: 57M/724M
[windows-jdk8-m3.5.x_build] [INFO] ------------------------------------------------------------------------
[windows-jdk8-m3.5.x_build] [INFO] [jenkins-event-spy] Generated F:\jenkins\jenkins-slave\workspace\aven-assembly-plugin_master-SP4DXUL4GVN3Q5KJHI5ED6WPWUEC2L2PUW2RCT2SFVGTCXHUIFDQ@2@2@tmp\withMaven8f86b095\maven-spy-20181229-011719-9074740818227662095446.log
[windows-jdk8-m3.5.x_build] Picked up JAVA_TOOL_OPTIONS: -Dmaven.ext.class.path="f:\jenkins\jenkins-slave\workspace\aven-assembly-plugin_master-SP4DXUL4GVN3Q5KJHI5ED6WPWUEC2L2PUW2RCT2SFVGTCXHUIFDQ@2@2@tmp\withMaven8f86b095\pipeline-maven-spy.jar" -Dorg.jenkinsci.plugins.pipeline.maven.reportsFolder="f:\jenkins\jenkins-slave\workspace\aven-assembly-plugin_master-SP4DXUL4GVN3Q5KJHI5ED6WPWUEC2L2PUW2RCT2SFVGTCXHUIFDQ@2@2@tmp\withMaven8f86b095"
[windows-jdk7-m3.3.x_build] [INFO] Final Memory: 56M/919M
[windows-jdk7-m3.3.x_build] [INFO] ------------------------------------------------------------------------
[windows-jdk7-m3.3.x_build] [INFO] [jenkins-event-spy] Generated F:\jenkins\jenkins-slave\workspace\aven-assembly-plugin_master-SP4DXUL4GVN3Q5KJHI5ED6WPWUEC2L2PUW2RCT2SFVGTCXHUIFDQ@3@tmp\withMaven9da44c11\maven-spy-20181229-011722-534036104297511131032.log
[windows-jdk7-m3.3.x_build] Picked up JAVA_TOOL_OPTIONS: -Dmaven.ext.class.path="f:\jenkins\jenkins-slave\workspace\aven-assembly-plugin_master-SP4DXUL4GVN3Q5KJHI5ED6WPWUEC2L2PUW2RCT2SFVGTCXHUIFDQ@3@tmp\withMaven9da44c11\pipeline-maven-spy.jar" -Dorg.jenkinsci.plugins.pipeline.maven.reportsFolder="f:\jenkins\jenkins-slave\workspace\aven-assembly-plugin_master-SP4DXUL4GVN3Q5KJHI5ED6WPWUEC2L2PUW2RCT2SFVGTCXHUIFDQ@3@tmp\withMaven9da44c11"
[Pipeline] [linux-jdk8-m3.5.x_build] }
[linux-jdk8-m3.5.x_build] [withMaven] artifactsPublisher - Archive artifact linux-jdk8-m3.5.x_build/pom.xml under org/apache/maven/plugins/maven-assembly-plugin/3.1.1/maven-assembly-plugin-3.1.1.pom
[linux-jdk8-m3.5.x_build] [withMaven] artifactsPublisher - Archive artifact linux-jdk8-m3.5.x_build/target/maven-assembly-plugin-3.1.1.jar under org/apache/maven/plugins/maven-assembly-plugin/3.1.1/maven-assembly-plugin-3.1.1.jar
[linux-jdk8-m3.5.x_build] [withMaven] junitPublisher - Archive test results for Maven artifact org.apache.maven.plugins:maven-assembly-plugin:3.1.1 generated by maven-surefire-plugin:test (default-test): linux-jdk8-m3.5.x_build/target/surefire-reports/*.xml
[linux-jdk8-m3.5.x_build] Recording test results
[linux-jdk8-m3.5.x_build] [withMaven] openTasksPublisher - Scan Tasks for Maven artifact org.apache.maven.plugins:maven-assembly-plugin:3.1.1 in source directory linux-jdk8-m3.5.x_build/src/main/java
[linux-jdk8-m3.5.x_build] [TASKS] Scanning folder '/home/jenkins/jenkins-slave/workspace/aven-assembly-plugin_master-SP4DXUL4GVN3Q5KJHI5ED6WPWUEC2L2PUW2RCT2SFVGTCXHUIFDQ@3' for files matching the pattern 'linux-jdk8-m3.5.x_build/src/main/java/**/*' - excludes: null
[linux-jdk8-m3.5.x_build] [TASKS] Found 71 files to scan for tasks
[linux-jdk8-m3.5.x_build] [TASKS] Found 14 open tasks.
[linux-jdk8-m3.5.x_build] Skipping warnings blame since pipelines do not have an SCM link.%n
[linux-jdk8-m3.5.x_build] [TASKS] Computing warning deltas based on reference build #43
[linux-jdk8-m3.5.x_build] [withMaven] invokerPublisher - Archive invoker results for Maven artifact MavenArtifact{org.apache.maven.plugins:maven-assembly-plugin::3.1.1(version: 3.1.1, snapshot:false) } generated by PluginInvocation{org.apache.maven.plugins:maven-invoker-plugin:3.1.0@integration-test  integration-test}: linux-jdk8-m3.5.x_build/target/invoker-reports/*.xml
[Pipeline] [linux-jdk7-m3.5.x_build] }
[linux-jdk7-m3.5.x_build] [withMaven] artifactsPublisher - Archive artifact linux-jdk7-m3.5.x_build/pom.xml under org/apache/maven/plugins/maven-assembly-plugin/3.1.1/maven-assembly-plugin-3.1.1.pom
[linux-jdk7-m3.5.x_build] [withMaven] artifactsPublisher - Archive artifact linux-jdk7-m3.5.x_build/target/maven-assembly-plugin-3.1.1.jar under org/apache/maven/plugins/maven-assembly-plugin/3.1.1/maven-assembly-plugin-3.1.1.jar
[linux-jdk7-m3.5.x_build] [withMaven] junitPublisher - Archive test results for Maven artifact org.apache.maven.plugins:maven-assembly-plugin:3.1.1 generated by maven-surefire-plugin:test (default-test): linux-jdk7-m3.5.x_build/target/surefire-reports/*.xml
[linux-jdk7-m3.5.x_build] Recording test results
[linux-jdk7-m3.5.x_build] [withMaven] openTasksPublisher - Scan Tasks for Maven artifact org.apache.maven.plugins:maven-assembly-plugin:3.1.1 in source directory linux-jdk7-m3.5.x_build/src/main/java
[linux-jdk7-m3.5.x_build] [TASKS] Scanning folder '/home/jenkins/jenkins-slave/workspace/aven-assembly-plugin_master-SP4DXUL4GVN3Q5KJHI5ED6WPWUEC2L2PUW2RCT2SFVGTCXHUIFDQ@2' for files matching the pattern 'linux-jdk7-m3.5.x_build/src/main/java/**/*' - excludes: null
[linux-jdk7-m3.5.x_build] [TASKS] Found 71 files to scan for tasks
[linux-jdk7-m3.5.x_build] [TASKS] Found 14 open tasks.
[linux-jdk7-m3.5.x_build] Skipping warnings blame since pipelines do not have an SCM link.%n
[linux-jdk7-m3.5.x_build] [TASKS] Computing warning deltas based on reference build #43
[linux-jdk7-m3.5.x_build] [withMaven] invokerPublisher - Archive invoker results for Maven artifact MavenArtifact{org.apache.maven.plugins:maven-assembly-plugin::3.1.1(version: 3.1.1, snapshot:false) } generated by PluginInvocation{org.apache.maven.plugins:maven-invoker-plugin:3.1.0@integration-test  integration-test}: linux-jdk7-m3.5.x_build/target/invoker-reports/*.xml
[Pipeline] [linux-jdk11-m3.5.x_build] }
[linux-jdk11-m3.5.x_build] [withMaven] artifactsPublisher - Archive artifact linux-jdk11-m3.5.x_build/pom.xml under org/apache/maven/plugins/maven-assembly-plugin/3.1.1/maven-assembly-plugin-3.1.1.pom
[linux-jdk11-m3.5.x_build] [withMaven] artifactsPublisher - Archive artifact linux-jdk11-m3.5.x_build/target/maven-assembly-plugin-3.1.1.jar under org/apache/maven/plugins/maven-assembly-plugin/3.1.1/maven-assembly-plugin-3.1.1.jar
[linux-jdk11-m3.5.x_build] [withMaven] junitPublisher - Archive test results for Maven artifact org.apache.maven.plugins:maven-assembly-plugin:3.1.1 generated by maven-surefire-plugin:test (default-test): linux-jdk11-m3.5.x_build/target/surefire-reports/*.xml
[linux-jdk11-m3.5.x_build] Recording test results
[linux-jdk11-m3.5.x_build] [withMaven] openTasksPublisher - Scan Tasks for Maven artifact org.apache.maven.plugins:maven-assembly-plugin:3.1.1 in source directory linux-jdk11-m3.5.x_build/src/main/java
[linux-jdk11-m3.5.x_build] [TASKS] Scanning folder '/home/jenkins/jenkins-slave/workspace/aven-assembly-plugin_master-SP4DXUL4GVN3Q5KJHI5ED6WPWUEC2L2PUW2RCT2SFVGTCXHUIFDQ@2@2' for files matching the pattern 'linux-jdk11-m3.5.x_build/src/main/java/**/*' - excludes: null
[linux-jdk11-m3.5.x_build] [TASKS] Found 71 files to scan for tasks
[linux-jdk11-m3.5.x_build] [TASKS] Found 14 open tasks.
[linux-jdk11-m3.5.x_build] Skipping warnings blame since pipelines do not have an SCM link.%n
[linux-jdk11-m3.5.x_build] [TASKS] Computing warning deltas based on reference build #43
[linux-jdk11-m3.5.x_build] [withMaven] invokerPublisher - Archive invoker results for Maven artifact MavenArtifact{org.apache.maven.plugins:maven-assembly-plugin::3.1.1(version: 3.1.1, snapshot:false) } generated by PluginInvocation{org.apache.maven.plugins:maven-invoker-plugin:3.1.0@integration-test  integration-test}: linux-jdk11-m3.5.x_build/target/invoker-reports/*.xml
[Pipeline] [linux-jdk7-m3.3.x_build] }
[linux-jdk7-m3.3.x_build] [withMaven] artifactsPublisher - Archive artifact linux-jdk7-m3.3.x_build/pom.xml under org/apache/maven/plugins/maven-assembly-plugin/3.1.1/maven-assembly-plugin-3.1.1.pom
[linux-jdk7-m3.3.x_build] [withMaven] artifactsPublisher - Archive artifact linux-jdk7-m3.3.x_build/target/maven-assembly-plugin-3.1.1.jar under org/apache/maven/plugins/maven-assembly-plugin/3.1.1/maven-assembly-plugin-3.1.1.jar
[linux-jdk7-m3.3.x_build] [withMaven] junitPublisher - Archive test results for Maven artifact org.apache.maven.plugins:maven-assembly-plugin:3.1.1 generated by maven-surefire-plugin:test (default-test): linux-jdk7-m3.3.x_build/target/surefire-reports/*.xml
[linux-jdk7-m3.3.x_build] Recording test results
[linux-jdk7-m3.3.x_build] [withMaven] openTasksPublisher - Scan Tasks for Maven artifact org.apache.maven.plugins:maven-assembly-plugin:3.1.1 in source directory linux-jdk7-m3.3.x_build/src/main/java
[linux-jdk7-m3.3.x_build] [TASKS] Scanning folder '/home/jenkins/jenkins-slave/workspace/aven-assembly-plugin_master-SP4DXUL4GVN3Q5KJHI5ED6WPWUEC2L2PUW2RCT2SFVGTCXHUIFDQ@2' for files matching the pattern 'linux-jdk7-m3.3.x_build/src/main/java/**/*' - excludes: null
[linux-jdk7-m3.3.x_build] [TASKS] Found 71 files to scan for tasks
[linux-jdk7-m3.3.x_build] [TASKS] Found 14 open tasks.
[linux-jdk7-m3.3.x_build] Skipping warnings blame since pipelines do not have an SCM link.%n
[linux-jdk7-m3.3.x_build] [TASKS] Computing warning deltas based on reference build #43
[linux-jdk7-m3.3.x_build] [withMaven] invokerPublisher - Archive invoker results for Maven artifact MavenArtifact{org.apache.maven.plugins:maven-assembly-plugin::3.1.1(version: 3.1.1, snapshot:false) } generated by PluginInvocation{org.apache.maven.plugins:maven-invoker-plugin:3.1.0@integration-test  integration-test}: linux-jdk7-m3.3.x_build/target/invoker-reports/*.xml
[Pipeline] [linux-jdk8-m3.5.x_build] // withMaven
[Pipeline] [linux-jdk7-m3.5.x_build] // withMaven
[Pipeline] [linux-jdk11-m3.5.x_build] // withMaven
[Pipeline] [linux-jdk7-m3.3.x_build] // withMaven
[Pipeline] [linux-jdk8-m3.5.x_build] cleanWs
[Pipeline] [linux-jdk7-m3.5.x_build] cleanWs
[Pipeline] [linux-jdk11-m3.5.x_build] cleanWs
[Pipeline] [linux-jdk7-m3.3.x_build] cleanWs
[Pipeline] [linux-jdk7-m3.2.x_build] }
[Pipeline] [windows-jdk7-m3.2.x_build] }
[Pipeline] [windows-jdk7-m3.5.x_build] }
[Pipeline] [windows-jdk7-m3.3.x_build] }
[Pipeline] [windows-jdk8-m3.5.x_build] }
[Pipeline] [windows-jdk11-m3.5.x_build] }
[Pipeline] [linux-jdk7-m3.2.x_build] // stage
[Pipeline] [windows-jdk7-m3.2.x_build] // dir
[Pipeline] [windows-jdk7-m3.5.x_build] // dir
[Pipeline] [windows-jdk7-m3.3.x_build] // dir
[Pipeline] [windows-jdk8-m3.5.x_build] // dir
[Pipeline] [windows-jdk11-m3.5.x_build] // dir
[linux-jdk8-m3.5.x_build] [WS-CLEANUP] Deleting project workspace...[WS-CLEANUP] done
[linux-jdk7-m3.5.x_build] [WS-CLEANUP] Deleting project workspace...[WS-CLEANUP] done
[linux-jdk11-m3.5.x_build] [WS-CLEANUP] Deleting project workspace...[WS-CLEANUP] done
[linux-jdk7-m3.3.x_build] [WS-CLEANUP] Deleting project workspace...[WS-CLEANUP] done
[Pipeline] [linux-jdk7-m3.2.x_build] }
[Pipeline] [windows-jdk7-m3.2.x_build] }
[windows-jdk7-m3.2.x_build] [withMaven] artifactsPublisher - Archive artifact windows-jdk7-m3.2.x_build\pom.xml under org\apache\maven\plugins\maven-assembly-plugin\3.1.1\maven-assembly-plugin-3.1.1.pom
[windows-jdk7-m3.2.x_build] [withMaven] artifactsPublisher - Archive artifact windows-jdk7-m3.2.x_build\target\maven-assembly-plugin-3.1.1.jar under org\apache\maven\plugins\maven-assembly-plugin\3.1.1\maven-assembly-plugin-3.1.1.jar
[windows-jdk7-m3.2.x_build] [withMaven] junitPublisher - Archive test results for Maven artifact org.apache.maven.plugins:maven-assembly-plugin:3.1.1 generated by maven-surefire-plugin:test (default-test): windows-jdk7-m3.2.x_build\target\surefire-reports\*.xml
[windows-jdk7-m3.2.x_build] Recording test results
[windows-jdk7-m3.2.x_build] [withMaven] openTasksPublisher - Scan Tasks for Maven artifact org.apache.maven.plugins:maven-assembly-plugin:3.1.1 in source directory windows-jdk7-m3.2.x_build\src\main\java
[windows-jdk7-m3.2.x_build] [TASKS] Scanning folder 'f:\jenkins\jenkins-slave\workspace\aven-assembly-plugin_master-SP4DXUL4GVN3Q5KJHI5ED6WPWUEC2L2PUW2RCT2SFVGTCXHUIFDQ@3' for files matching the pattern 'windows-jdk7-m3.2.x_build\src\main\java\**\*' - excludes: null
[windows-jdk7-m3.2.x_build] [TASKS] Found 71 files to scan for tasks
[windows-jdk7-m3.2.x_build] [TASKS] Found 14 open tasks.
[windows-jdk7-m3.2.x_build] Skipping warnings blame since pipelines do not have an SCM link.%n
[windows-jdk7-m3.2.x_build] [TASKS] Computing warning deltas based on reference build #43
[windows-jdk7-m3.2.x_build] [withMaven] invokerPublisher - Archive invoker results for Maven artifact MavenArtifact{org.apache.maven.plugins:maven-assembly-plugin::3.1.1(version: 3.1.1, snapshot:false) } generated by PluginInvocation{org.apache.maven.plugins:maven-invoker-plugin:3.1.0@integration-test  integration-test}: windows-jdk7-m3.2.x_build\target\invoker-reports\*.xml
[Pipeline] [windows-jdk7-m3.5.x_build] }
[windows-jdk7-m3.5.x_build] [withMaven] artifactsPublisher - Archive artifact windows-jdk7-m3.5.x_build\pom.xml under org\apache\maven\plugins\maven-assembly-plugin\3.1.1\maven-assembly-plugin-3.1.1.pom
[windows-jdk7-m3.5.x_build] [withMaven] artifactsPublisher - Archive artifact windows-jdk7-m3.5.x_build\target\maven-assembly-plugin-3.1.1.jar under org\apache\maven\plugins\maven-assembly-plugin\3.1.1\maven-assembly-plugin-3.1.1.jar
[windows-jdk7-m3.5.x_build] [withMaven] junitPublisher - Archive test results for Maven artifact org.apache.maven.plugins:maven-assembly-plugin:3.1.1 generated by maven-surefire-plugin:test (default-test): windows-jdk7-m3.5.x_build\target\surefire-reports\*.xml
[windows-jdk7-m3.5.x_build] Recording test results
[windows-jdk7-m3.5.x_build] [withMaven] openTasksPublisher - Scan Tasks for Maven artifact org.apache.maven.plugins:maven-assembly-plugin:3.1.1 in source directory windows-jdk7-m3.5.x_build\src\main\java
[windows-jdk7-m3.5.x_build] [TASKS] Scanning folder 'f:\jenkins\jenkins-slave\workspace\aven-assembly-plugin_master-SP4DXUL4GVN3Q5KJHI5ED6WPWUEC2L2PUW2RCT2SFVGTCXHUIFDQ@2@2' for files matching the pattern 'windows-jdk7-m3.5.x_build\src\main\java\**\*' - excludes: null
[windows-jdk7-m3.5.x_build] [TASKS] Found 71 files to scan for tasks
[windows-jdk7-m3.5.x_build] [TASKS] Found 14 open tasks.
[windows-jdk7-m3.5.x_build] Skipping warnings blame since pipelines do not have an SCM link.%n
[windows-jdk7-m3.5.x_build] [TASKS] Computing warning deltas based on reference build #43
[windows-jdk7-m3.5.x_build] [withMaven] invokerPublisher - Archive invoker results for Maven artifact MavenArtifact{org.apache.maven.plugins:maven-assembly-plugin::3.1.1(version: 3.1.1, snapshot:false) } generated by PluginInvocation{org.apache.maven.plugins:maven-invoker-plugin:3.1.0@integration-test  integration-test}: windows-jdk7-m3.5.x_build\target\invoker-reports\*.xml
[Pipeline] [windows-jdk7-m3.3.x_build] }
[windows-jdk7-m3.3.x_build] [withMaven] artifactsPublisher - Archive artifact windows-jdk7-m3.3.x_build\pom.xml under org\apache\maven\plugins\maven-assembly-plugin\3.1.1\maven-assembly-plugin-3.1.1.pom
[windows-jdk7-m3.3.x_build] [withMaven] artifactsPublisher - Archive artifact windows-jdk7-m3.3.x_build\target\maven-assembly-plugin-3.1.1.jar under org\apache\maven\plugins\maven-assembly-plugin\3.1.1\maven-assembly-plugin-3.1.1.jar
[windows-jdk7-m3.3.x_build] [withMaven] junitPublisher - Archive test results for Maven artifact org.apache.maven.plugins:maven-assembly-plugin:3.1.1 generated by maven-surefire-plugin:test (default-test): windows-jdk7-m3.3.x_build\target\surefire-reports\*.xml
[windows-jdk7-m3.3.x_build] Recording test results
[windows-jdk7-m3.3.x_build] [withMaven] openTasksPublisher - Scan Tasks for Maven artifact org.apache.maven.plugins:maven-assembly-plugin:3.1.1 in source directory windows-jdk7-m3.3.x_build\src\main\java
[windows-jdk7-m3.3.x_build] [TASKS] Scanning folder 'f:\jenkins\jenkins-slave\workspace\aven-assembly-plugin_master-SP4DXUL4GVN3Q5KJHI5ED6WPWUEC2L2PUW2RCT2SFVGTCXHUIFDQ@3' for files matching the pattern 'windows-jdk7-m3.3.x_build\src\main\java\**\*' - excludes: null
[windows-jdk7-m3.3.x_build] [TASKS] Found 71 files to scan for tasks
[windows-jdk7-m3.3.x_build] [TASKS] Found 14 open tasks.
[windows-jdk7-m3.3.x_build] Skipping warnings blame since pipelines do not have an SCM link.%n
[windows-jdk7-m3.3.x_build] [TASKS] Computing warning deltas based on reference build #43
[windows-jdk7-m3.3.x_build] [withMaven] invokerPublisher - Archive invoker results for Maven artifact MavenArtifact{org.apache.maven.plugins:maven-assembly-plugin::3.1.1(version: 3.1.1, snapshot:false) } generated by PluginInvocation{org.apache.maven.plugins:maven-invoker-plugin:3.1.0@integration-test  integration-test}: windows-jdk7-m3.3.x_build\target\invoker-reports\*.xml
[Pipeline] [windows-jdk8-m3.5.x_build] }
[windows-jdk8-m3.5.x_build] [withMaven] artifactsPublisher - Archive artifact windows-jdk8-m3.5.x_build\pom.xml under org\apache\maven\plugins\maven-assembly-plugin\3.1.1\maven-assembly-plugin-3.1.1.pom
[windows-jdk8-m3.5.x_build] [withMaven] artifactsPublisher - Archive artifact windows-jdk8-m3.5.x_build\target\maven-assembly-plugin-3.1.1.jar under org\apache\maven\plugins\maven-assembly-plugin\3.1.1\maven-assembly-plugin-3.1.1.jar
[windows-jdk8-m3.5.x_build] [withMaven] junitPublisher - Archive test results for Maven artifact org.apache.maven.plugins:maven-assembly-plugin:3.1.1 generated by maven-surefire-plugin:test (default-test): windows-jdk8-m3.5.x_build\target\surefire-reports\*.xml
[windows-jdk8-m3.5.x_build] Recording test results
[windows-jdk8-m3.5.x_build] [withMaven] openTasksPublisher - Scan Tasks for Maven artifact org.apache.maven.plugins:maven-assembly-plugin:3.1.1 in source directory windows-jdk8-m3.5.x_build\src\main\java
[windows-jdk8-m3.5.x_build] [TASKS] Scanning folder 'f:\jenkins\jenkins-slave\workspace\aven-assembly-plugin_master-SP4DXUL4GVN3Q5KJHI5ED6WPWUEC2L2PUW2RCT2SFVGTCXHUIFDQ@2@2' for files matching the pattern 'windows-jdk8-m3.5.x_build\src\main\java\**\*' - excludes: null
[windows-jdk8-m3.5.x_build] [TASKS] Found 71 files to scan for tasks
[windows-jdk8-m3.5.x_build] [TASKS] Found 14 open tasks.
[windows-jdk8-m3.5.x_build] Skipping warnings blame since pipelines do not have an SCM link.%n
[windows-jdk8-m3.5.x_build] [TASKS] Computing warning deltas based on reference build #43
[windows-jdk8-m3.5.x_build] [withMaven] invokerPublisher - Archive invoker results for Maven artifact MavenArtifact{org.apache.maven.plugins:maven-assembly-plugin::3.1.1(version: 3.1.1, snapshot:false) } generated by PluginInvocation{org.apache.maven.plugins:maven-invoker-plugin:3.1.0@integration-test  integration-test}: windows-jdk8-m3.5.x_build\target\invoker-reports\*.xml
[Pipeline] [windows-jdk11-m3.5.x_build] }
[windows-jdk11-m3.5.x_build] [withMaven] artifactsPublisher - Archive artifact windows-jdk11-m3.5.x_build\pom.xml under org\apache\maven\plugins\maven-assembly-plugin\3.1.1\maven-assembly-plugin-3.1.1.pom
[windows-jdk11-m3.5.x_build] [withMaven] artifactsPublisher - Archive artifact windows-jdk11-m3.5.x_build\target\maven-assembly-plugin-3.1.1.jar under org\apache\maven\plugins\maven-assembly-plugin\3.1.1\maven-assembly-plugin-3.1.1.jar
[windows-jdk11-m3.5.x_build] [withMaven] junitPublisher - Archive test results for Maven artifact org.apache.maven.plugins:maven-assembly-plugin:3.1.1 generated by maven-surefire-plugin:test (default-test): windows-jdk11-m3.5.x_build\target\surefire-reports\*.xml
[windows-jdk11-m3.5.x_build] Recording test results
[windows-jdk11-m3.5.x_build] [withMaven] openTasksPublisher - Scan Tasks for Maven artifact org.apache.maven.plugins:maven-assembly-plugin:3.1.1 in source directory windows-jdk11-m3.5.x_build\src\main\java
[windows-jdk11-m3.5.x_build] [TASKS] Scanning folder 'f:\jenkins\jenkins-slave\workspace\aven-assembly-plugin_master-SP4DXUL4GVN3Q5KJHI5ED6WPWUEC2L2PUW2RCT2SFVGTCXHUIFDQ@3@2' for files matching the pattern 'windows-jdk11-m3.5.x_build\src\main\java\**\*' - excludes: null
[windows-jdk11-m3.5.x_build] [TASKS] Found 71 files to scan for tasks
[windows-jdk11-m3.5.x_build] [TASKS] Found 14 open tasks.
[windows-jdk11-m3.5.x_build] Skipping warnings blame since pipelines do not have an SCM link.%n
[windows-jdk11-m3.5.x_build] [TASKS] Computing warning deltas based on reference build #43
[windows-jdk11-m3.5.x_build] [withMaven] invokerPublisher - Archive invoker results for Maven artifact MavenArtifact{org.apache.maven.plugins:maven-assembly-plugin::3.1.1(version: 3.1.1, snapshot:false) } generated by PluginInvocation{org.apache.maven.plugins:maven-invoker-plugin:3.1.0@integration-test  integration-test}: windows-jdk11-m3.5.x_build\target\invoker-reports\*.xml
[Pipeline] [linux-jdk7-m3.2.x_build] // ws
[Pipeline] [windows-jdk7-m3.2.x_build] // withMaven
[Pipeline] [windows-jdk7-m3.5.x_build] // withMaven
[Pipeline] [windows-jdk7-m3.3.x_build] // withMaven
[Pipeline] [windows-jdk8-m3.5.x_build] // withMaven
[Pipeline] [windows-jdk11-m3.5.x_build] // withMaven
[Pipeline] [linux-jdk7-m3.2.x_build] }
[Pipeline] [linux-jdk8-m3.5.x_build] }
[Pipeline] [linux-jdk7-m3.5.x_build] }
[Pipeline] [linux-jdk11-m3.5.x_build] }
[Pipeline] [linux-jdk7-m3.3.x_build] }
[Pipeline] [windows-jdk7-m3.2.x_build] cleanWs
[Pipeline] [windows-jdk7-m3.5.x_build] cleanWs
[Pipeline] [windows-jdk7-m3.3.x_build] cleanWs
[Pipeline] [windows-jdk8-m3.5.x_build] cleanWs
[Pipeline] [windows-jdk11-m3.5.x_build] cleanWs
[Pipeline] [linux-jdk7-m3.2.x_build] // node
[windows-jdk7-m3.2.x_build] [WS-CLEANUP] Deleting project workspace...Cannot delete workspace :remote file operation failed: f:\jenkins\jenkins-slave\workspace\aven-assembly-plugin_master-SP4DXUL4GVN3Q5KJHI5ED6WPWUEC2L2PUW2RCT2SFVGTCXHUIFDQ@3 at hudson.remoting.Channel@41afa848:JNLP4-connect connection from 37.48.69.226/37.48.69.226:49574: java.nio.file.AccessDeniedException: f:\jenkins\jenkins-slave\workspace\aven-assembly-plugin_master-SP4DXUL4GVN3Q5KJHI5ED6WPWUEC2L2PUW2RCT2SFVGTCXHUIFDQ@3 -> f:\jenkins\jenkins-slave\workspace\aven-assembly-plugin_master-SP4DXUL4GVN3Q5KJHI5ED6WPWUEC2L2PUW2RCT2SFVGTCXHUIFDQ@3_ws-cleanup_1546077336324
[windows-jdk7-m3.5.x_build] [WS-CLEANUP] Deleting project workspace...Cannot delete workspace :remote file operation failed: f:\jenkins\jenkins-slave\workspace\aven-assembly-plugin_master-SP4DXUL4GVN3Q5KJHI5ED6WPWUEC2L2PUW2RCT2SFVGTCXHUIFDQ@2@2 at hudson.remoting.Channel@41afa848:JNLP4-connect connection from 37.48.69.226/37.48.69.226:49574: java.nio.file.AccessDeniedException: f:\jenkins\jenkins-slave\workspace\aven-assembly-plugin_master-SP4DXUL4GVN3Q5KJHI5ED6WPWUEC2L2PUW2RCT2SFVGTCXHUIFDQ@2@2 -> f:\jenkins\jenkins-slave\workspace\aven-assembly-plugin_master-SP4DXUL4GVN3Q5KJHI5ED6WPWUEC2L2PUW2RCT2SFVGTCXHUIFDQ@2@2_ws-cleanup_1546077336330
[windows-jdk7-m3.3.x_build] [WS-CLEANUP] Deleting project workspace...Cannot delete workspace :remote file operation failed: f:\jenkins\jenkins-slave\workspace\aven-assembly-plugin_master-SP4DXUL4GVN3Q5KJHI5ED6WPWUEC2L2PUW2RCT2SFVGTCXHUIFDQ@3 at hudson.remoting.Channel@6cb8ec07:JNLP4-connect connection from 37.48.69.226/37.48.69.226:60168: java.nio.file.AccessDeniedException: f:\jenkins\jenkins-slave\workspace\aven-assembly-plugin_master-SP4DXUL4GVN3Q5KJHI5ED6WPWUEC2L2PUW2RCT2SFVGTCXHUIFDQ@3 -> f:\jenkins\jenkins-slave\workspace\aven-assembly-plugin_master-SP4DXUL4GVN3Q5KJHI5ED6WPWUEC2L2PUW2RCT2SFVGTCXHUIFDQ@3_ws-cleanup_1546077336336
[windows-jdk8-m3.5.x_build] [WS-CLEANUP] Deleting project workspace...Cannot delete workspace :remote file operation failed: f:\jenkins\jenkins-slave\workspace\aven-assembly-plugin_master-SP4DXUL4GVN3Q5KJHI5ED6WPWUEC2L2PUW2RCT2SFVGTCXHUIFDQ@2@2 at hudson.remoting.Channel@6cb8ec07:JNLP4-connect connection from 37.48.69.226/37.48.69.226:60168: java.nio.file.AccessDeniedException: f:\jenkins\jenkins-slave\workspace\aven-assembly-plugin_master-SP4DXUL4GVN3Q5KJHI5ED6WPWUEC2L2PUW2RCT2SFVGTCXHUIFDQ@2@2 -> f:\jenkins\jenkins-slave\workspace\aven-assembly-plugin_master-SP4DXUL4GVN3Q5KJHI5ED6WPWUEC2L2PUW2RCT2SFVGTCXHUIFDQ@2@2_ws-cleanup_1546077336340
[windows-jdk11-m3.5.x_build] [WS-CLEANUP] Deleting project workspace...Cannot delete workspace :remote file operation failed: f:\jenkins\jenkins-slave\workspace\aven-assembly-plugin_master-SP4DXUL4GVN3Q5KJHI5ED6WPWUEC2L2PUW2RCT2SFVGTCXHUIFDQ@3@2 at hudson.remoting.Channel@121270d5:JNLP4-connect connection from 37.48.69.226/37.48.69.226:54213: java.nio.file.AccessDeniedException: f:\jenkins\jenkins-slave\workspace\aven-assembly-plugin_master-SP4DXUL4GVN3Q5KJHI5ED6WPWUEC2L2PUW2RCT2SFVGTCXHUIFDQ@3@2 -> f:\jenkins\jenkins-slave\workspace\aven-assembly-plugin_master-SP4DXUL4GVN3Q5KJHI5ED6WPWUEC2L2PUW2RCT2SFVGTCXHUIFDQ@3@2_ws-cleanup_1546077336345
[Pipeline] [linux-jdk8-m3.5.x_build] // stage
[Pipeline] [linux-jdk7-m3.5.x_build] // stage
[Pipeline] [linux-jdk11-m3.5.x_build] // stage
[Pipeline] [linux-jdk7-m3.3.x_build] // stage
[Pipeline] [linux-jdk7-m3.2.x_build] }
[Pipeline] [linux-jdk7-m3.3.x_build] }
[Pipeline] [linux-jdk7-m3.5.x_build] }
[Pipeline] [linux-jdk8-m3.5.x_build] }
[Pipeline] [linux-jdk11-m3.5.x_build] }
[Pipeline] [windows-jdk7-m3.2.x_build] }
[Pipeline] [windows-jdk7-m3.5.x_build] }
[Pipeline] [windows-jdk7-m3.3.x_build] }
[Pipeline] [windows-jdk8-m3.5.x_build] }
[Pipeline] [windows-jdk11-m3.5.x_build] }
[Pipeline] [linux-jdk7-m3.3.x_build] // ws
[Pipeline] [linux-jdk7-m3.5.x_build] // ws
[Pipeline] [linux-jdk8-m3.5.x_build] // ws
[Pipeline] [linux-jdk11-m3.5.x_build] // ws
[Pipeline] [linux-jdk7-m3.3.x_build] }
[Pipeline] [linux-jdk7-m3.5.x_build] }
[Pipeline] [linux-jdk8-m3.5.x_build] }
[Pipeline] [linux-jdk11-m3.5.x_build] }
[Pipeline] [windows-jdk7-m3.2.x_build] // stage
[Pipeline] [windows-jdk7-m3.5.x_build] // stage
[Pipeline] [windows-jdk7-m3.3.x_build] // stage
[Pipeline] [windows-jdk8-m3.5.x_build] // stage
[Pipeline] [windows-jdk11-m3.5.x_build] // stage
[Pipeline] [windows-jdk7-m3.2.x_build] }
[Pipeline] [windows-jdk7-m3.3.x_build] }
[Pipeline] [windows-jdk7-m3.5.x_build] }
[Pipeline] [windows-jdk8-m3.5.x_build] }
[Pipeline] [windows-jdk11-m3.5.x_build] }
[Pipeline] [linux-jdk7-m3.3.x_build] // node
[Pipeline] [linux-jdk7-m3.5.x_build] // node
[Pipeline] [linux-jdk8-m3.5.x_build] // node
[Pipeline] [linux-jdk11-m3.5.x_build] // node
[Pipeline] [linux-jdk7-m3.3.x_build] }
[Pipeline] [linux-jdk7-m3.5.x_build] }
[Pipeline] [linux-jdk8-m3.5.x_build] }
[Pipeline] [linux-jdk11-m3.5.x_build] }
[Pipeline] [windows-jdk7-m3.2.x_build] // ws
[Pipeline] [windows-jdk7-m3.3.x_build] // ws
[Pipeline] [windows-jdk7-m3.5.x_build] // ws
[Pipeline] [windows-jdk8-m3.5.x_build] // ws
[Pipeline] [windows-jdk11-m3.5.x_build] // ws
[Pipeline] [windows-jdk7-m3.2.x_build] }
[Pipeline] [windows-jdk7-m3.3.x_build] }
[Pipeline] [windows-jdk7-m3.5.x_build] }
[Pipeline] [windows-jdk8-m3.5.x_build] }
[Pipeline] [windows-jdk11-m3.5.x_build] }
[Pipeline] [windows-jdk7-m3.2.x_build] // node
[Pipeline] [windows-jdk7-m3.3.x_build] // node
[Pipeline] [windows-jdk7-m3.5.x_build] // node
[Pipeline] [windows-jdk8-m3.5.x_build] // node
[Pipeline] [windows-jdk11-m3.5.x_build] // node
[Pipeline] [windows-jdk7-m3.2.x_build] }
[windows-jdk7-m3.2.x_build] Failed in branch windows-jdk7-m3.2.x_build
[Pipeline] [windows-jdk7-m3.3.x_build] }
[windows-jdk7-m3.3.x_build] Failed in branch windows-jdk7-m3.3.x_build
[Pipeline] [windows-jdk7-m3.5.x_build] }
[windows-jdk7-m3.5.x_build] Failed in branch windows-jdk7-m3.5.x_build
[Pipeline] [windows-jdk8-m3.5.x_build] }
[windows-jdk8-m3.5.x_build] Failed in branch windows-jdk8-m3.5.x_build
[Pipeline] [windows-jdk11-m3.5.x_build] }
[windows-jdk11-m3.5.x_build] Failed in branch windows-jdk11-m3.5.x_build
[Pipeline] // parallel
[Pipeline] stage
[Pipeline] { (Notifications)
[Pipeline] echo
Build result: FAILURE
[Pipeline] jiraIssueSelector
[Pipeline] emailext
Reply | Threaded
Open this post in threaded view
|

Build failed in Jenkins: Maven TLP » maven-assembly-plugin » master #50

Apache Jenkins Server-2
See https://builds.apache.org/job/maven-box/job/maven-assembly-plugin/job/master/50/

Changes:

* [maven-release-plugin] prepare for next development iteration
* [maven-release-plugin] prepare for next development iteration
* [maven-release-plugin] prepare for next development iteration
* [maven-release-plugin] prepare for next development iteration
* [maven-release-plugin] prepare for next development iteration
* [maven-release-plugin] prepare for next development iteration
* [maven-release-plugin] prepare for next development iteration

All tests passed

Build log:
[...truncated 4.05 MB...]
[windows-jdk7-m3.3.x_build] [INFO] Downloaded: https://repo.maven.apache.org/maven2/commons-lang/commons-lang/2.1/commons-lang-2.1.jar (203 KB at 934.8 KB/sec)
[windows-jdk7-m3.3.x_build] [INFO] Downloaded: https://repo.maven.apache.org/maven2/com/puppycrawl/tools/checkstyle/6.18/checkstyle-6.18.jar (1132 KB at 5118.4 KB/sec)
[windows-jdk7-m3.3.x_build] [INFO] Downloaded: https://repo.maven.apache.org/maven2/com/google/guava/guava/19.0/guava-19.0.jar (2255 KB at 8197.9 KB/sec)
[windows-jdk7-m3.3.x_build] [INFO] There are 2 errors reported by Checkstyle 6.18 with config/maven_checks.xml ruleset.
[windows-jdk7-m3.3.x_build] [INFO] Ignored 2 errors, 0 violation remaining.
[windows-jdk7-m3.3.x_build] [INFO]
[windows-jdk7-m3.3.x_build] [INFO] --- maven-invoker-plugin:3.1.0:verify (integration-test) @ maven-assembly-plugin ---
[windows-jdk7-m3.3.x_build] [INFO] -------------------------------------------------
[windows-jdk7-m3.3.x_build] [INFO] Build Summary:
[windows-jdk7-m3.3.x_build] [INFO]   Passed: 134, Failed: 0, Errors: 0, Skipped: 3
[windows-jdk7-m3.3.x_build] [INFO] -------------------------------------------------
[windows-jdk7-m3.3.x_build] [INFO] ------------------------------------------------------------------------
[windows-jdk7-m3.3.x_build] [INFO] BUILD SUCCESS
[windows-jdk7-m3.3.x_build] [INFO] ------------------------------------------------------------------------
[windows-jdk7-m3.3.x_build] [INFO] Total time: 21:58 min
[windows-jdk7-m3.3.x_build] [INFO] Finished at: 2018-12-29T09:39:38+00:00
[windows-jdk7-m3.3.x_build] [INFO] Final Memory: 56M/710M
[windows-jdk7-m3.3.x_build] [INFO] ------------------------------------------------------------------------
[windows-jdk7-m3.3.x_build] [INFO] [jenkins-event-spy] Generated F:\jenkins\jenkins-slave\workspace\aven-assembly-plugin_master-SP4DXUL4GVN3Q5KJHI5ED6WPWUEC2L2PUW2RCT2SFVGTCXHUIFDQ@2@2@tmp\withMavene1bbb3c1\maven-spy-20181229-091739-2526103501731171465290.log
[windows-jdk7-m3.3.x_build] Picked up JAVA_TOOL_OPTIONS: -Dmaven.ext.class.path="f:\jenkins\jenkins-slave\workspace\aven-assembly-plugin_master-SP4DXUL4GVN3Q5KJHI5ED6WPWUEC2L2PUW2RCT2SFVGTCXHUIFDQ@2@2@tmp\withMavene1bbb3c1\pipeline-maven-spy.jar" -Dorg.jenkinsci.plugins.pipeline.maven.reportsFolder="f:\jenkins\jenkins-slave\workspace\aven-assembly-plugin_master-SP4DXUL4GVN3Q5KJHI5ED6WPWUEC2L2PUW2RCT2SFVGTCXHUIFDQ@2@2@tmp\withMavene1bbb3c1"
[Pipeline] [linux-jdk7-m3.2.x_build] }
[linux-jdk7-m3.2.x_build] [withMaven] artifactsPublisher - Archive artifact linux-jdk7-m3.2.x_build/pom.xml under org/apache/maven/plugins/maven-assembly-plugin/3.1.2-SNAPSHOT/maven-assembly-plugin-3.1.2-SNAPSHOT.pom
[linux-jdk7-m3.2.x_build] [withMaven] artifactsPublisher - Archive artifact linux-jdk7-m3.2.x_build/target/maven-assembly-plugin-3.1.2-SNAPSHOT.jar under org/apache/maven/plugins/maven-assembly-plugin/3.1.2-SNAPSHOT/maven-assembly-plugin-3.1.2-SNAPSHOT.jar
[linux-jdk7-m3.2.x_build] [withMaven] junitPublisher - Archive test results for Maven artifact org.apache.maven.plugins:maven-assembly-plugin:3.1.2-SNAPSHOT generated by maven-surefire-plugin:test (default-test): linux-jdk7-m3.2.x_build/target/surefire-reports/*.xml
[linux-jdk7-m3.2.x_build] Recording test results
[linux-jdk7-m3.2.x_build] [withMaven] openTasksPublisher - Scan Tasks for Maven artifact org.apache.maven.plugins:maven-assembly-plugin:3.1.2-SNAPSHOT in source directory linux-jdk7-m3.2.x_build/src/main/java
[linux-jdk7-m3.2.x_build] [TASKS] Scanning folder '/home/jenkins/jenkins-slave/workspace/aven-assembly-plugin_master-SP4DXUL4GVN3Q5KJHI5ED6WPWUEC2L2PUW2RCT2SFVGTCXHUIFDQ@3@2' for files matching the pattern 'linux-jdk7-m3.2.x_build/src/main/java/**/*' - excludes: null
[linux-jdk7-m3.2.x_build] [TASKS] Found 71 files to scan for tasks
[linux-jdk7-m3.2.x_build] [TASKS] Found 14 open tasks.
[linux-jdk7-m3.2.x_build] Skipping warnings blame since pipelines do not have an SCM link.%n
[linux-jdk7-m3.2.x_build] [TASKS] Computing warning deltas based on reference build #43
[linux-jdk7-m3.2.x_build] [withMaven] invokerPublisher - Archive invoker results for Maven artifact MavenArtifact{org.apache.maven.plugins:maven-assembly-plugin::3.1.2-SNAPSHOT(version: 3.1.2-SNAPSHOT, snapshot:false) } generated by PluginInvocation{org.apache.maven.plugins:maven-invoker-plugin:3.1.0@integration-test  integration-test}: linux-jdk7-m3.2.x_build/target/invoker-reports/*.xml
[Pipeline] [linux-jdk7-m3.5.x_build] }
[linux-jdk7-m3.5.x_build] [withMaven] artifactsPublisher - Archive artifact linux-jdk7-m3.5.x_build/pom.xml under org/apache/maven/plugins/maven-assembly-plugin/3.1.2-SNAPSHOT/maven-assembly-plugin-3.1.2-SNAPSHOT.pom
[linux-jdk7-m3.5.x_build] [withMaven] artifactsPublisher - Archive artifact linux-jdk7-m3.5.x_build/target/maven-assembly-plugin-3.1.2-SNAPSHOT.jar under org/apache/maven/plugins/maven-assembly-plugin/3.1.2-SNAPSHOT/maven-assembly-plugin-3.1.2-SNAPSHOT.jar
[linux-jdk7-m3.5.x_build] [withMaven] junitPublisher - Archive test results for Maven artifact org.apache.maven.plugins:maven-assembly-plugin:3.1.2-SNAPSHOT generated by maven-surefire-plugin:test (default-test): linux-jdk7-m3.5.x_build/target/surefire-reports/*.xml
[linux-jdk7-m3.5.x_build] Recording test results
[linux-jdk7-m3.5.x_build] [withMaven] openTasksPublisher - Scan Tasks for Maven artifact org.apache.maven.plugins:maven-assembly-plugin:3.1.2-SNAPSHOT in source directory linux-jdk7-m3.5.x_build/src/main/java
[linux-jdk7-m3.5.x_build] [TASKS] Scanning folder '/home/jenkins/jenkins-slave/workspace/aven-assembly-plugin_master-SP4DXUL4GVN3Q5KJHI5ED6WPWUEC2L2PUW2RCT2SFVGTCXHUIFDQ@2' for files matching the pattern 'linux-jdk7-m3.5.x_build/src/main/java/**/*' - excludes: null
[linux-jdk7-m3.5.x_build] [TASKS] Found 71 files to scan for tasks
[linux-jdk7-m3.5.x_build] [TASKS] Found 14 open tasks.
[linux-jdk7-m3.5.x_build] Skipping warnings blame since pipelines do not have an SCM link.%n
[linux-jdk7-m3.5.x_build] [TASKS] Computing warning deltas based on reference build #43
[linux-jdk7-m3.5.x_build] [withMaven] invokerPublisher - Archive invoker results for Maven artifact MavenArtifact{org.apache.maven.plugins:maven-assembly-plugin::3.1.2-SNAPSHOT(version: 3.1.2-SNAPSHOT, snapshot:false) } generated by PluginInvocation{org.apache.maven.plugins:maven-invoker-plugin:3.1.0@integration-test  integration-test}: linux-jdk7-m3.5.x_build/target/invoker-reports/*.xml
[Pipeline] [linux-jdk11-m3.5.x_build] }
[linux-jdk11-m3.5.x_build] [withMaven] artifactsPublisher - Archive artifact linux-jdk11-m3.5.x_build/pom.xml under org/apache/maven/plugins/maven-assembly-plugin/3.1.2-SNAPSHOT/maven-assembly-plugin-3.1.2-SNAPSHOT.pom
[linux-jdk11-m3.5.x_build] [withMaven] artifactsPublisher - Archive artifact linux-jdk11-m3.5.x_build/target/maven-assembly-plugin-3.1.2-SNAPSHOT.jar under org/apache/maven/plugins/maven-assembly-plugin/3.1.2-SNAPSHOT/maven-assembly-plugin-3.1.2-SNAPSHOT.jar
[linux-jdk11-m3.5.x_build] [withMaven] junitPublisher - Archive test results for Maven artifact org.apache.maven.plugins:maven-assembly-plugin:3.1.2-SNAPSHOT generated by maven-surefire-plugin:test (default-test): linux-jdk11-m3.5.x_build/target/surefire-reports/*.xml
[linux-jdk11-m3.5.x_build] Recording test results
[linux-jdk11-m3.5.x_build] [withMaven] openTasksPublisher - Scan Tasks for Maven artifact org.apache.maven.plugins:maven-assembly-plugin:3.1.2-SNAPSHOT in source directory linux-jdk11-m3.5.x_build/src/main/java
[linux-jdk11-m3.5.x_build] [TASKS] Scanning folder '/home/jenkins/jenkins-slave/workspace/aven-assembly-plugin_master-SP4DXUL4GVN3Q5KJHI5ED6WPWUEC2L2PUW2RCT2SFVGTCXHUIFDQ@2' for files matching the pattern 'linux-jdk11-m3.5.x_build/src/main/java/**/*' - excludes: null
[linux-jdk11-m3.5.x_build] [TASKS] Found 71 files to scan for tasks
[linux-jdk11-m3.5.x_build] [TASKS] Found 14 open tasks.
[linux-jdk11-m3.5.x_build] Skipping warnings blame since pipelines do not have an SCM link.%n
[linux-jdk11-m3.5.x_build] [TASKS] Computing warning deltas based on reference build #43
[linux-jdk11-m3.5.x_build] [withMaven] invokerPublisher - Archive invoker results for Maven artifact MavenArtifact{org.apache.maven.plugins:maven-assembly-plugin::3.1.2-SNAPSHOT(version: 3.1.2-SNAPSHOT, snapshot:false) } generated by PluginInvocation{org.apache.maven.plugins:maven-invoker-plugin:3.1.0@integration-test  integration-test}: linux-jdk11-m3.5.x_build/target/invoker-reports/*.xml
[Pipeline] [linux-jdk7-m3.2.x_build] // withMaven
[Pipeline] [linux-jdk7-m3.5.x_build] // withMaven
[Pipeline] [linux-jdk11-m3.5.x_build] // withMaven
[Pipeline] [linux-jdk7-m3.2.x_build] cleanWs
[Pipeline] [linux-jdk7-m3.5.x_build] cleanWs
[Pipeline] [linux-jdk8-m3.5.x_build] }
[Pipeline] [linux-jdk11-m3.5.x_build] cleanWs
[Pipeline] [linux-jdk7-m3.3.x_build] }
[Pipeline] [windows-jdk7-m3.2.x_build] }
[Pipeline] [windows-jdk7-m3.3.x_build] }
[Pipeline] [windows-jdk7-m3.5.x_build] }
[Pipeline] [windows-jdk8-m3.5.x_build] }
[Pipeline] [windows-jdk11-m3.5.x_build] }
[Pipeline] [linux-jdk8-m3.5.x_build] // stage
[Pipeline] [linux-jdk7-m3.3.x_build] // dir
[Pipeline] [windows-jdk7-m3.2.x_build] // dir
[Pipeline] [windows-jdk7-m3.3.x_build] // dir
[Pipeline] [windows-jdk7-m3.5.x_build] // dir
[Pipeline] [windows-jdk8-m3.5.x_build] // dir
[Pipeline] [windows-jdk11-m3.5.x_build] // dir
[linux-jdk7-m3.2.x_build] [WS-CLEANUP] Deleting project workspace...[WS-CLEANUP] done
[linux-jdk7-m3.5.x_build] [WS-CLEANUP] Deleting project workspace...[WS-CLEANUP] done
[linux-jdk11-m3.5.x_build] [WS-CLEANUP] Deleting project workspace...[WS-CLEANUP] done
[Pipeline] [linux-jdk8-m3.5.x_build] }
[Pipeline] [linux-jdk7-m3.3.x_build] }
[linux-jdk7-m3.3.x_build] [withMaven] artifactsPublisher - Archive artifact linux-jdk7-m3.3.x_build/pom.xml under org/apache/maven/plugins/maven-assembly-plugin/3.1.2-SNAPSHOT/maven-assembly-plugin-3.1.2-SNAPSHOT.pom
[linux-jdk7-m3.3.x_build] [withMaven] artifactsPublisher - Archive artifact linux-jdk7-m3.3.x_build/target/maven-assembly-plugin-3.1.2-SNAPSHOT.jar under org/apache/maven/plugins/maven-assembly-plugin/3.1.2-SNAPSHOT/maven-assembly-plugin-3.1.2-SNAPSHOT.jar
[linux-jdk7-m3.3.x_build] [withMaven] junitPublisher - Archive test results for Maven artifact org.apache.maven.plugins:maven-assembly-plugin:3.1.2-SNAPSHOT generated by maven-surefire-plugin:test (default-test): linux-jdk7-m3.3.x_build/target/surefire-reports/*.xml
[linux-jdk7-m3.3.x_build] Recording test results
[linux-jdk7-m3.3.x_build] [withMaven] openTasksPublisher - Scan Tasks for Maven artifact org.apache.maven.plugins:maven-assembly-plugin:3.1.2-SNAPSHOT in source directory linux-jdk7-m3.3.x_build/src/main/java
[linux-jdk7-m3.3.x_build] [TASKS] Scanning folder '/home/jenkins/jenkins-slave/workspace/aven-assembly-plugin_master-SP4DXUL4GVN3Q5KJHI5ED6WPWUEC2L2PUW2RCT2SFVGTCXHUIFDQ@2' for files matching the pattern 'linux-jdk7-m3.3.x_build/src/main/java/**/*' - excludes: null
[linux-jdk7-m3.3.x_build] [TASKS] Found 71 files to scan for tasks
[linux-jdk7-m3.3.x_build] [TASKS] Found 14 open tasks.
[linux-jdk7-m3.3.x_build] Skipping warnings blame since pipelines do not have an SCM link.%n
[linux-jdk7-m3.3.x_build] [TASKS] Computing warning deltas based on reference build #43
[linux-jdk7-m3.3.x_build] [withMaven] invokerPublisher - Archive invoker results for Maven artifact MavenArtifact{org.apache.maven.plugins:maven-assembly-plugin::3.1.2-SNAPSHOT(version: 3.1.2-SNAPSHOT, snapshot:false) } generated by PluginInvocation{org.apache.maven.plugins:maven-invoker-plugin:3.1.0@integration-test  integration-test}: linux-jdk7-m3.3.x_build/target/invoker-reports/*.xml
[Pipeline] [windows-jdk7-m3.2.x_build] }
[windows-jdk7-m3.2.x_build] [withMaven] artifactsPublisher - Archive artifact windows-jdk7-m3.2.x_build\pom.xml under org\apache\maven\plugins\maven-assembly-plugin\3.1.2-SNAPSHOT\maven-assembly-plugin-3.1.2-SNAPSHOT.pom
[windows-jdk7-m3.2.x_build] [withMaven] artifactsPublisher - Archive artifact windows-jdk7-m3.2.x_build\target\maven-assembly-plugin-3.1.2-SNAPSHOT.jar under org\apache\maven\plugins\maven-assembly-plugin\3.1.2-SNAPSHOT\maven-assembly-plugin-3.1.2-SNAPSHOT.jar
[windows-jdk7-m3.2.x_build] [withMaven] junitPublisher - Archive test results for Maven artifact org.apache.maven.plugins:maven-assembly-plugin:3.1.2-SNAPSHOT generated by maven-surefire-plugin:test (default-test): windows-jdk7-m3.2.x_build\target\surefire-reports\*.xml
[windows-jdk7-m3.2.x_build] Recording test results
[windows-jdk7-m3.2.x_build] [withMaven] openTasksPublisher - Scan Tasks for Maven artifact org.apache.maven.plugins:maven-assembly-plugin:3.1.2-SNAPSHOT in source directory windows-jdk7-m3.2.x_build\src\main\java
[windows-jdk7-m3.2.x_build] [TASKS] Scanning folder 'f:\jenkins\jenkins-slave\workspace\aven-assembly-plugin_master-SP4DXUL4GVN3Q5KJHI5ED6WPWUEC2L2PUW2RCT2SFVGTCXHUIFDQ@3' for files matching the pattern 'windows-jdk7-m3.2.x_build\src\main\java\**\*' - excludes: null
[windows-jdk7-m3.2.x_build] [TASKS] Found 71 files to scan for tasks
[windows-jdk7-m3.2.x_build] [TASKS] Found 14 open tasks.
[windows-jdk7-m3.2.x_build] Skipping warnings blame since pipelines do not have an SCM link.%n
[windows-jdk7-m3.2.x_build] [TASKS] Computing warning deltas based on reference build #43
[windows-jdk7-m3.2.x_build] [withMaven] invokerPublisher - Archive invoker results for Maven artifact MavenArtifact{org.apache.maven.plugins:maven-assembly-plugin::3.1.2-SNAPSHOT(version: 3.1.2-SNAPSHOT, snapshot:false) } generated by PluginInvocation{org.apache.maven.plugins:maven-invoker-plugin:3.1.0@integration-test  integration-test}: windows-jdk7-m3.2.x_build\target\invoker-reports\*.xml
[Pipeline] [windows-jdk7-m3.3.x_build] }
[windows-jdk7-m3.3.x_build] [withMaven] artifactsPublisher - Archive artifact windows-jdk7-m3.3.x_build\pom.xml under org\apache\maven\plugins\maven-assembly-plugin\3.1.2-SNAPSHOT\maven-assembly-plugin-3.1.2-SNAPSHOT.pom
[windows-jdk7-m3.3.x_build] [withMaven] artifactsPublisher - Archive artifact windows-jdk7-m3.3.x_build\target\maven-assembly-plugin-3.1.2-SNAPSHOT.jar under org\apache\maven\plugins\maven-assembly-plugin\3.1.2-SNAPSHOT\maven-assembly-plugin-3.1.2-SNAPSHOT.jar
[windows-jdk7-m3.3.x_build] [withMaven] junitPublisher - Archive test results for Maven artifact org.apache.maven.plugins:maven-assembly-plugin:3.1.2-SNAPSHOT generated by maven-surefire-plugin:test (default-test): windows-jdk7-m3.3.x_build\target\surefire-reports\*.xml
[windows-jdk7-m3.3.x_build] Recording test results
[windows-jdk7-m3.3.x_build] [withMaven] openTasksPublisher - Scan Tasks for Maven artifact org.apache.maven.plugins:maven-assembly-plugin:3.1.2-SNAPSHOT in source directory windows-jdk7-m3.3.x_build\src\main\java
[windows-jdk7-m3.3.x_build] [TASKS] Scanning folder 'f:\jenkins\jenkins-slave\workspace\aven-assembly-plugin_master-SP4DXUL4GVN3Q5KJHI5ED6WPWUEC2L2PUW2RCT2SFVGTCXHUIFDQ@2@2' for files matching the pattern 'windows-jdk7-m3.3.x_build\src\main\java\**\*' - excludes: null
[windows-jdk7-m3.3.x_build] [TASKS] Found 71 files to scan for tasks
[windows-jdk7-m3.3.x_build] [TASKS] Found 14 open tasks.
[windows-jdk7-m3.3.x_build] Skipping warnings blame since pipelines do not have an SCM link.%n
[windows-jdk7-m3.3.x_build] [TASKS] Computing warning deltas based on reference build #43
[windows-jdk7-m3.3.x_build] [withMaven] invokerPublisher - Archive invoker results for Maven artifact MavenArtifact{org.apache.maven.plugins:maven-assembly-plugin::3.1.2-SNAPSHOT(version: 3.1.2-SNAPSHOT, snapshot:false) } generated by PluginInvocation{org.apache.maven.plugins:maven-invoker-plugin:3.1.0@integration-test  integration-test}: windows-jdk7-m3.3.x_build\target\invoker-reports\*.xml
[Pipeline] [windows-jdk7-m3.5.x_build] }
[windows-jdk7-m3.5.x_build] [withMaven] artifactsPublisher - Archive artifact windows-jdk7-m3.5.x_build\pom.xml under org\apache\maven\plugins\maven-assembly-plugin\3.1.2-SNAPSHOT\maven-assembly-plugin-3.1.2-SNAPSHOT.pom
[windows-jdk7-m3.5.x_build] [withMaven] artifactsPublisher - Archive artifact windows-jdk7-m3.5.x_build\target\maven-assembly-plugin-3.1.2-SNAPSHOT.jar under org\apache\maven\plugins\maven-assembly-plugin\3.1.2-SNAPSHOT\maven-assembly-plugin-3.1.2-SNAPSHOT.jar
[windows-jdk7-m3.5.x_build] [withMaven] junitPublisher - Archive test results for Maven artifact org.apache.maven.plugins:maven-assembly-plugin:3.1.2-SNAPSHOT generated by maven-surefire-plugin:test (default-test): windows-jdk7-m3.5.x_build\target\surefire-reports\*.xml
[windows-jdk7-m3.5.x_build] Recording test results
[windows-jdk7-m3.5.x_build] [withMaven] openTasksPublisher - Scan Tasks for Maven artifact org.apache.maven.plugins:maven-assembly-plugin:3.1.2-SNAPSHOT in source directory windows-jdk7-m3.5.x_build\src\main\java
[windows-jdk7-m3.5.x_build] [TASKS] Scanning folder 'f:\jenkins\jenkins-slave\workspace\aven-assembly-plugin_master-SP4DXUL4GVN3Q5KJHI5ED6WPWUEC2L2PUW2RCT2SFVGTCXHUIFDQ@2' for files matching the pattern 'windows-jdk7-m3.5.x_build\src\main\java\**\*' - excludes: null
[windows-jdk7-m3.5.x_build] [TASKS] Found 71 files to scan for tasks
[windows-jdk7-m3.5.x_build] [TASKS] Found 14 open tasks.
[windows-jdk7-m3.5.x_build] Skipping warnings blame since pipelines do not have an SCM link.%n
[windows-jdk7-m3.5.x_build] [TASKS] Computing warning deltas based on reference build #43
[windows-jdk7-m3.5.x_build] [withMaven] invokerPublisher - Archive invoker results for Maven artifact MavenArtifact{org.apache.maven.plugins:maven-assembly-plugin::3.1.2-SNAPSHOT(version: 3.1.2-SNAPSHOT, snapshot:false) } generated by PluginInvocation{org.apache.maven.plugins:maven-invoker-plugin:3.1.0@integration-test  integration-test}: windows-jdk7-m3.5.x_build\target\invoker-reports\*.xml
[Pipeline] [windows-jdk8-m3.5.x_build] }
[windows-jdk8-m3.5.x_build] [withMaven] artifactsPublisher - Archive artifact windows-jdk8-m3.5.x_build\pom.xml under org\apache\maven\plugins\maven-assembly-plugin\3.1.2-SNAPSHOT\maven-assembly-plugin-3.1.2-SNAPSHOT.pom
[windows-jdk8-m3.5.x_build] [withMaven] artifactsPublisher - Archive artifact windows-jdk8-m3.5.x_build\target\maven-assembly-plugin-3.1.2-SNAPSHOT.jar under org\apache\maven\plugins\maven-assembly-plugin\3.1.2-SNAPSHOT\maven-assembly-plugin-3.1.2-SNAPSHOT.jar
[windows-jdk8-m3.5.x_build] [withMaven] junitPublisher - Archive test results for Maven artifact org.apache.maven.plugins:maven-assembly-plugin:3.1.2-SNAPSHOT generated by maven-surefire-plugin:test (default-test): windows-jdk8-m3.5.x_build\target\surefire-reports\*.xml
[windows-jdk8-m3.5.x_build] Recording test results
[windows-jdk8-m3.5.x_build] [withMaven] openTasksPublisher - Scan Tasks for Maven artifact org.apache.maven.plugins:maven-assembly-plugin:3.1.2-SNAPSHOT in source directory windows-jdk8-m3.5.x_build\src\main\java
[windows-jdk8-m3.5.x_build] [TASKS] Scanning folder 'f:\jenkins\jenkins-slave\workspace\aven-assembly-plugin_master-SP4DXUL4GVN3Q5KJHI5ED6WPWUEC2L2PUW2RCT2SFVGTCXHUIFDQ@3@2' for files matching the pattern 'windows-jdk8-m3.5.x_build\src\main\java\**\*' - excludes: null
[windows-jdk8-m3.5.x_build] [TASKS] Found 71 files to scan for tasks
[windows-jdk8-m3.5.x_build] [TASKS] Found 14 open tasks.
[windows-jdk8-m3.5.x_build] Skipping warnings blame since pipelines do not have an SCM link.%n
[windows-jdk8-m3.5.x_build] [TASKS] Computing warning deltas based on reference build #43
[windows-jdk8-m3.5.x_build] [withMaven] invokerPublisher - Archive invoker results for Maven artifact MavenArtifact{org.apache.maven.plugins:maven-assembly-plugin::3.1.2-SNAPSHOT(version: 3.1.2-SNAPSHOT, snapshot:false) } generated by PluginInvocation{org.apache.maven.plugins:maven-invoker-plugin:3.1.0@integration-test  integration-test}: windows-jdk8-m3.5.x_build\target\invoker-reports\*.xml
[Pipeline] [windows-jdk11-m3.5.x_build] }
[windows-jdk11-m3.5.x_build] [withMaven] artifactsPublisher - Archive artifact windows-jdk11-m3.5.x_build\pom.xml under org\apache\maven\plugins\maven-assembly-plugin\3.1.2-SNAPSHOT\maven-assembly-plugin-3.1.2-SNAPSHOT.pom
[windows-jdk11-m3.5.x_build] [withMaven] artifactsPublisher - Archive artifact windows-jdk11-m3.5.x_build\target\maven-assembly-plugin-3.1.2-SNAPSHOT.jar under org\apache\maven\plugins\maven-assembly-plugin\3.1.2-SNAPSHOT\maven-assembly-plugin-3.1.2-SNAPSHOT.jar
[windows-jdk11-m3.5.x_build] [withMaven] junitPublisher - Archive test results for Maven artifact org.apache.maven.plugins:maven-assembly-plugin:3.1.2-SNAPSHOT generated by maven-surefire-plugin:test (default-test): windows-jdk11-m3.5.x_build\target\surefire-reports\*.xml
[windows-jdk11-m3.5.x_build] Recording test results
[windows-jdk11-m3.5.x_build] [withMaven] openTasksPublisher - Scan Tasks for Maven artifact org.apache.maven.plugins:maven-assembly-plugin:3.1.2-SNAPSHOT in source directory windows-jdk11-m3.5.x_build\src\main\java
[windows-jdk11-m3.5.x_build] [TASKS] Scanning folder 'f:\jenkins\jenkins-slave\workspace\aven-assembly-plugin_master-SP4DXUL4GVN3Q5KJHI5ED6WPWUEC2L2PUW2RCT2SFVGTCXHUIFDQ@2' for files matching the pattern 'windows-jdk11-m3.5.x_build\src\main\java\**\*' - excludes: null
[windows-jdk11-m3.5.x_build] [TASKS] Found 71 files to scan for tasks
[windows-jdk11-m3.5.x_build] [TASKS] Found 14 open tasks.
[windows-jdk11-m3.5.x_build] Skipping warnings blame since pipelines do not have an SCM link.%n
[windows-jdk11-m3.5.x_build] [TASKS] Computing warning deltas based on reference build #43
[windows-jdk11-m3.5.x_build] [withMaven] invokerPublisher - Archive invoker results for Maven artifact MavenArtifact{org.apache.maven.plugins:maven-assembly-plugin::3.1.2-SNAPSHOT(version: 3.1.2-SNAPSHOT, snapshot:false) } generated by PluginInvocation{org.apache.maven.plugins:maven-invoker-plugin:3.1.0@integration-test  integration-test}: windows-jdk11-m3.5.x_build\target\invoker-reports\*.xml
[Pipeline] [linux-jdk8-m3.5.x_build] // ws
[Pipeline] [linux-jdk7-m3.3.x_build] // withMaven
[Pipeline] [windows-jdk7-m3.2.x_build] // withMaven
[Pipeline] [windows-jdk7-m3.3.x_build] // withMaven
[Pipeline] [windows-jdk7-m3.5.x_build] // withMaven
[Pipeline] [windows-jdk8-m3.5.x_build] // withMaven
[Pipeline] [windows-jdk11-m3.5.x_build] // withMaven
[Pipeline] [linux-jdk8-m3.5.x_build] }
[Pipeline] [linux-jdk7-m3.2.x_build] }
[Pipeline] [linux-jdk7-m3.3.x_build] cleanWs
[Pipeline] [linux-jdk7-m3.5.x_build] }
[Pipeline] [linux-jdk11-m3.5.x_build] }
[Pipeline] [windows-jdk7-m3.2.x_build] cleanWs
[Pipeline] [windows-jdk7-m3.3.x_build] cleanWs
[Pipeline] [windows-jdk7-m3.5.x_build] cleanWs
[Pipeline] [windows-jdk8-m3.5.x_build] cleanWs
[Pipeline] [windows-jdk11-m3.5.x_build] cleanWs
[Pipeline] [linux-jdk8-m3.5.x_build] // node
[Pipeline] [linux-jdk7-m3.2.x_build] // stage
[Pipeline] [linux-jdk7-m3.5.x_build] // stage
[windows-jdk7-m3.2.x_build] [WS-CLEANUP] Deleting project workspace...Cannot delete workspace :remote file operation failed: f:\jenkins\jenkins-slave\workspace\aven-assembly-plugin_master-SP4DXUL4GVN3Q5KJHI5ED6WPWUEC2L2PUW2RCT2SFVGTCXHUIFDQ@3 at hudson.remoting.Channel@4ee2423:JNLP4-connect connection from 37.48.69.226/37.48.69.226:64887: java.nio.file.AccessDeniedException: f:\jenkins\jenkins-slave\workspace\aven-assembly-plugin_master-SP4DXUL4GVN3Q5KJHI5ED6WPWUEC2L2PUW2RCT2SFVGTCXHUIFDQ@3 -> f:\jenkins\jenkins-slave\workspace\aven-assembly-plugin_master-SP4DXUL4GVN3Q5KJHI5ED6WPWUEC2L2PUW2RCT2SFVGTCXHUIFDQ@3_ws-cleanup_1546077413075
[windows-jdk7-m3.3.x_build] [WS-CLEANUP] Deleting project workspace...Cannot delete workspace :remote file operation failed: f:\jenkins\jenkins-slave\workspace\aven-assembly-plugin_master-SP4DXUL4GVN3Q5KJHI5ED6WPWUEC2L2PUW2RCT2SFVGTCXHUIFDQ@2@2 at hudson.remoting.Channel@4ee2423:JNLP4-connect connection from 37.48.69.226/37.48.69.226:64887: java.nio.file.AccessDeniedException: f:\jenkins\jenkins-slave\workspace\aven-assembly-plugin_master-SP4DXUL4GVN3Q5KJHI5ED6WPWUEC2L2PUW2RCT2SFVGTCXHUIFDQ@2@2 -> f:\jenkins\jenkins-slave\workspace\aven-assembly-plugin_master-SP4DXUL4GVN3Q5KJHI5ED6WPWUEC2L2PUW2RCT2SFVGTCXHUIFDQ@2@2_ws-cleanup_1546077413076
[windows-jdk11-m3.5.x_build] [WS-CLEANUP] Deleting project workspace...Cannot delete workspace :remote file operation failed: f:\jenkins\jenkins-slave\workspace\aven-assembly-plugin_master-SP4DXUL4GVN3Q5KJHI5ED6WPWUEC2L2PUW2RCT2SFVGTCXHUIFDQ@2 at hudson.remoting.Channel@7f96cc69:JNLP4-connect connection from 37.48.69.226/37.48.69.226:63010: java.nio.file.AccessDeniedException: f:\jenkins\jenkins-slave\workspace\aven-assembly-plugin_master-SP4DXUL4GVN3Q5KJHI5ED6WPWUEC2L2PUW2RCT2SFVGTCXHUIFDQ@2 -> f:\jenkins\jenkins-slave\workspace\aven-assembly-plugin_master-SP4DXUL4GVN3Q5KJHI5ED6WPWUEC2L2PUW2RCT2SFVGTCXHUIFDQ@2_ws-cleanup_1546077413097
[Pipeline] [linux-jdk11-m3.5.x_build] // stage
[Pipeline] [linux-jdk8-m3.5.x_build] }
[Pipeline] [linux-jdk7-m3.2.x_build] }
[Pipeline] [linux-jdk7-m3.5.x_build] }
[Pipeline] [linux-jdk11-m3.5.x_build] }
[Pipeline] [windows-jdk7-m3.2.x_build] }
[Pipeline] [windows-jdk7-m3.3.x_build] }
[Pipeline] [windows-jdk11-m3.5.x_build] }
[Pipeline] [linux-jdk7-m3.2.x_build] // ws
[Pipeline] [linux-jdk7-m3.5.x_build] // ws
[Pipeline] [linux-jdk11-m3.5.x_build] // ws
[Pipeline] [linux-jdk7-m3.2.x_build] }
[Pipeline] [linux-jdk7-m3.5.x_build] }
[Pipeline] [linux-jdk11-m3.5.x_build] }
[windows-jdk7-m3.5.x_build] [WS-CLEANUP] Deleting project workspace...Cannot delete workspace :remote file operation failed: f:\jenkins\jenkins-slave\workspace\aven-assembly-plugin_master-SP4DXUL4GVN3Q5KJHI5ED6WPWUEC2L2PUW2RCT2SFVGTCXHUIFDQ@2 at hudson.remoting.Channel@398d98d3:JNLP4-connect connection from ec2-34-228-168-168.compute-1.amazonaws.com/34.228.168.168:51626: java.nio.file.AccessDeniedException: f:\jenkins\jenkins-slave\workspace\aven-assembly-plugin_master-SP4DXUL4GVN3Q5KJHI5ED6WPWUEC2L2PUW2RCT2SFVGTCXHUIFDQ@2 -> f:\jenkins\jenkins-slave\workspace\aven-assembly-plugin_master-SP4DXUL4GVN3Q5KJHI5ED6WPWUEC2L2PUW2RCT2SFVGTCXHUIFDQ@2_ws-cleanup_1546077413252
[windows-jdk8-m3.5.x_build] [WS-CLEANUP] Deleting project workspace...Cannot delete workspace :remote file operation failed: f:\jenkins\jenkins-slave\workspace\aven-assembly-plugin_master-SP4DXUL4GVN3Q5KJHI5ED6WPWUEC2L2PUW2RCT2SFVGTCXHUIFDQ@3@2 at hudson.remoting.Channel@398d98d3:JNLP4-connect connection from ec2-34-228-168-168.compute-1.amazonaws.com/34.228.168.168:51626: java.nio.file.AccessDeniedException: f:\jenkins\jenkins-slave\workspace\aven-assembly-plugin_master-SP4DXUL4GVN3Q5KJHI5ED6WPWUEC2L2PUW2RCT2SFVGTCXHUIFDQ@3@2 -> f:\jenkins\jenkins-slave\workspace\aven-assembly-plugin_master-SP4DXUL4GVN3Q5KJHI5ED6WPWUEC2L2PUW2RCT2SFVGTCXHUIFDQ@3@2_ws-cleanup_1546077413252
[Pipeline] [windows-jdk7-m3.2.x_build] // stage
[Pipeline] [windows-jdk7-m3.3.x_build] // stage
[Pipeline] [windows-jdk11-m3.5.x_build] // stage
[Pipeline] [windows-jdk7-m3.2.x_build] }
[Pipeline] [windows-jdk7-m3.3.x_build] }
[Pipeline] [windows-jdk11-m3.5.x_build] }
[Pipeline] [linux-jdk7-m3.2.x_build] // node
[Pipeline] [linux-jdk7-m3.5.x_build] // node
[Pipeline] [linux-jdk11-m3.5.x_build] // node
[Pipeline] [linux-jdk7-m3.2.x_build] }
[Pipeline] [linux-jdk7-m3.5.x_build] }
[Pipeline] [linux-jdk11-m3.5.x_build] }
[Pipeline] [windows-jdk7-m3.5.x_build] }
[Pipeline] [windows-jdk8-m3.5.x_build] }
[Pipeline] [windows-jdk7-m3.2.x_build] // ws
[linux-jdk7-m3.3.x_build] [WS-CLEANUP] Deleting project workspace...[WS-CLEANUP] done
[Pipeline] [windows-jdk7-m3.3.x_build] // ws
[Pipeline] [windows-jdk11-m3.5.x_build] // ws
[Pipeline] [windows-jdk7-m3.2.x_build] }
[Pipeline] [windows-jdk7-m3.3.x_build] }
[Pipeline] [windows-jdk11-m3.5.x_build] }
[Pipeline] [windows-jdk7-m3.5.x_build] // stage
[Pipeline] [windows-jdk8-m3.5.x_build] // stage
[Pipeline] [windows-jdk7-m3.5.x_build] }
[Pipeline] [windows-jdk8-m3.5.x_build] }
[Pipeline] [linux-jdk7-m3.3.x_build] }
[Pipeline] [windows-jdk7-m3.2.x_build] // node
[Pipeline] [windows-jdk7-m3.3.x_build] // node
[Pipeline] [windows-jdk11-m3.5.x_build] // node
[Pipeline] [windows-jdk7-m3.2.x_build] }
[windows-jdk7-m3.2.x_build] Failed in branch windows-jdk7-m3.2.x_build
[Pipeline] [windows-jdk7-m3.3.x_build] }
[windows-jdk7-m3.3.x_build] Failed in branch windows-jdk7-m3.3.x_build
[Pipeline] [windows-jdk11-m3.5.x_build] }
[windows-jdk11-m3.5.x_build] Failed in branch windows-jdk11-m3.5.x_build
[Pipeline] [windows-jdk7-m3.5.x_build] // ws
[Pipeline] [windows-jdk8-m3.5.x_build] // ws
[Pipeline] [windows-jdk7-m3.5.x_build] }
[Pipeline] [windows-jdk8-m3.5.x_build] }
[Pipeline] [linux-jdk7-m3.3.x_build] // stage
[Pipeline] [linux-jdk7-m3.3.x_build] }
[Pipeline] [windows-jdk7-m3.5.x_build] // node
[Pipeline] [windows-jdk8-m3.5.x_build] // node
[Pipeline] [windows-jdk7-m3.5.x_build] }
[windows-jdk7-m3.5.x_build] Failed in branch windows-jdk7-m3.5.x_build
[Pipeline] [windows-jdk8-m3.5.x_build] }
[windows-jdk8-m3.5.x_build] Failed in branch windows-jdk8-m3.5.x_build
[Pipeline] [linux-jdk7-m3.3.x_build] // ws
[Pipeline] [linux-jdk7-m3.3.x_build] }
[Pipeline] [linux-jdk7-m3.3.x_build] // node
[Pipeline] [linux-jdk7-m3.3.x_build] }
[Pipeline] // parallel
[Pipeline] stage
[Pipeline] { (Notifications)
[Pipeline] echo
Build result: FAILURE
[Pipeline] jiraIssueSelector
[Pipeline] emailext
Reply | Threaded
Open this post in threaded view
|

Build failed in Jenkins: Maven TLP » maven-assembly-plugin » master #51

Apache Jenkins Server-2
See https://builds.apache.org/job/maven-box/job/maven-assembly-plugin/job/master/51/

Changes:

* use a special local repo to have a bit of caching
* add mavenLinkerPublisher

All tests passed

Build log:
[...truncated 7897 lines...]
WARNING: All illegal access operations will be denied in a future release
[INFO]           projects\descriptor-refs\jar-with-dependencies\component-descriptors-merged\pom.xml SUCCESS (41.6 s)
[INFO] Building: projects\descriptor-refs\jar-with-dependencies\deps-unpacked-to-root-dir\pom.xml
[INFO] run post-build script verify.groovy
[INFO]           projects\descriptor-refs\jar-with-dependencies\deps-unpacked-to-root-dir\pom.xml SUCCESS (32.7 s)
[INFO] Building: projects\descriptor-refs\jar-with-dependencies\no-target-dir\pom.xml
[INFO] run post-build script verify.bsh
[INFO]           projects\descriptor-refs\jar-with-dependencies\no-target-dir\pom.xml SUCCESS (32.4 s)
[INFO] Building: projects\descriptor-refs\project\multimodule-sources-copied\pom.xml
[withMaven] Publishers: Generated Artifacts Publisher: 956 ms, Junit Publisher: 11265 ms, Open Task Scanner Publisher: 1257 ms, Invoker Publisher: 559239 ms, Pipeline Graph Publisher: 2 ms
[Pipeline] // withMaven
[Pipeline] cleanWs
[WS-CLEANUP] Deleting project workspace...
[WS-CLEANUP] Deferred wipeout is used...
ERROR: Cannot delete workspace :f:\jenkins\jenkins-slave\workspace\box_maven-assembly-plugin_master@3@2\windows-jdk7-m3.3.x_build\target\invoker-reports\BUILD-it-project-parent.xml
[Pipeline] }
[Pipeline] // stage
[Pipeline] }
[Pipeline] // ws
[Pipeline] }
[Pipeline] // node
[Pipeline] }
Failed in branch windows-jdk8-m3.5.x_build
[INFO] run post-build script verify.bsh
[INFO]           projects\descriptor-refs\project\multimodule-sources-copied\pom.xml SUCCESS (12.9 s)
[INFO] Building: projects\descriptor-refs\project\no-target-dir\pom.xml
[INFO] run post-build script verify.bsh
[INFO]           projects\descriptor-refs\project\no-target-dir\pom.xml SUCCESS (5.2 s)
[INFO] Building: projects\descriptor-refs\project\no-target-dir-multimodule\pom.xml
[INFO] run post-build script verify.bsh
[INFO]           projects\descriptor-refs\project\no-target-dir-multimodule\pom.xml SUCCESS (7.2 s)
[INFO] Building: projects\descriptor-refs\project\sources-copied\pom.xml
[INFO] run post-build script verify.bsh
[INFO]           projects\descriptor-refs\project\sources-copied\pom.xml SUCCESS (5.1 s)
[INFO] Building: projects\descriptor-refs\src\no-target-dir\pom.xml
[INFO] run post-build script verify.bsh
[INFO]           projects\descriptor-refs\src\no-target-dir\pom.xml SUCCESS (5.4 s)
[INFO] Building: projects\descriptor-refs\src\src-dir-copied\pom.xml
[INFO] run post-build script verify.bsh
[INFO]           projects\descriptor-refs\src\src-dir-copied\pom.xml SUCCESS (6.1 s)
[INFO] Building: projects\file-modes\file-set-fileMode\pom.xml
[INFO]           projects\file-modes\file-set-fileMode\pom.xml .... SKIPPED due to OS
[INFO] Building: projects\file-modes\fileItem-fileMode\pom.xml
[INFO] run post-build script verify.bsh
[INFO]           projects\file-modes\fileItem-fileMode\pom.xml .... SUCCESS (2.6 s)
[INFO] Building: projects\file-sets\default-directory-unspecified\pom.xml
[INFO] run post-build script verify.bsh
[INFO]           projects\file-sets\default-directory-unspecified\pom.xml SUCCESS (2.8 s)
[INFO] Building: projects\file-sets\default-excludes-unspecified\pom.xml
[INFO] run post-build script verify.bsh
[INFO]           projects\file-sets\default-excludes-unspecified\pom.xml SUCCESS (3.8 s)
[INFO] Building: projects\file-sets\dont-use-default-excludes\pom.xml
[INFO] run pre-build script setup.bsh
[INFO] run post-build script verify.groovy
[INFO]           projects\file-sets\dont-use-default-excludes\pom.xml SUCCESS (3.8 s)
[INFO] Building: projects\file-sets\excludes-using-regex\pom.xml
[INFO] run post-build script verify.bsh
[INFO]           projects\file-sets\excludes-using-regex\pom.xml .. SUCCESS (18.2 s)
[INFO] Building: projects\file-sets\excluding-svn-dirs\pom.xml
[INFO] run pre-build script setup.bsh
[INFO] run post-build script verify.groovy
[INFO]           projects\file-sets\excluding-svn-dirs\pom.xml .... SUCCESS (22.6 s)
[INFO] Building: projects\file-sets\filtered-module-sources\pom.xml
[INFO] run post-build script verify.bsh
[INFO]           projects\file-sets\filtered-module-sources\pom.xml SUCCESS (33.3 s)
[INFO] Building: projects\file-sets\filtered-multimodule\pom.xml
[INFO] run post-build script verify.bsh
[INFO]           projects\file-sets\filtered-multimodule\pom.xml .. SUCCESS (35.8 s)
[INFO] Building: projects\file-sets\include-base-directory\pom.xml
[INFO] run post-build script verify.bsh
[INFO]           projects\file-sets\include-base-directory\pom.xml  SUCCESS (23.2 s)
[INFO] Building: projects\file-sets\include-parent-dir\pom.xml
[INFO] run post-build script verify.bsh
[INFO]           projects\file-sets\include-parent-dir\pom.xml .... SUCCESS (48.4 s)
[INFO] Building: projects\file-sets\massembly-665\pom.xml
[INFO]           projects\file-sets\massembly-665\pom.xml ......... SUCCESS (23.0 s)
[INFO] Building: projects\file-sets\multimodule-unix-lineEndings\pom.xml
[INFO] run post-build script verify.bsh
[INFO]           projects\file-sets\multimodule-unix-lineEndings\pom.xml SUCCESS (36.2 s)
[INFO] Building: projects\file-sets\multimodule-win-lineEndings\pom.xml
[INFO] run post-build script verify.bsh
[INFO]           projects\file-sets\multimodule-win-lineEndings\pom.xml SUCCESS (15.0 s)
[INFO] Building: projects\file-sets\platformspecific-filesets\pom.xml
[INFO] run post-build script verify.groovy
[INFO]           projects\file-sets\platformspecific-filesets\pom.xml SUCCESS (3.0 s)
[INFO] Building: projects\file-sets\precedence-check\pom.xml
[INFO] run post-build script verify.groovy
[INFO]           projects\file-sets\precedence-check\pom.xml ...... SUCCESS (2.6 s)
[INFO] Building: projects\file-sets\use-default-excludes\pom.xml
[INFO] run post-build script verify.bsh
[INFO]           projects\file-sets\use-default-excludes\pom.xml .. SUCCESS (2.6 s)
[INFO] Building: projects\files\filtered-sysprop\pom.xml
[INFO] run post-build script verify.bsh
[INFO]           projects\files\filtered-sysprop\pom.xml .......... SUCCESS (4.4 s)
[INFO] Building: projects\files\multimodule-relativePath\pom.xml
[INFO] run post-build script verify.bsh
[INFO]           projects\files\multimodule-relativePath\pom.xml .. SUCCESS (3.6 s)
[INFO] Building: projects\filtering-feature\fileset-to-tar-massembly-722\pom.xml
[INFO]           projects\filtering-feature\fileset-to-tar-massembly-722\pom.xml SUCCESS (4.1 s)
[INFO] Building: projects\filtering-feature\filter-comp-descriptor-path\pom.xml
[INFO] run post-build script verify.bsh
[INFO]           projects\filtering-feature\filter-comp-descriptor-path\pom.xml SUCCESS (2.4 s)
[INFO] Building: projects\filtering-feature\filters-defined-in-build\pom.xml
[INFO] run post-build script verify.bsh
[INFO]           projects\filtering-feature\filters-defined-in-build\pom.xml SUCCESS (2.5 s)
[INFO] Building: projects\filtering-feature\filtersDefinedInAssemblyPluginConfig\pom.xml
[INFO] run post-build script verify.bsh
[INFO]           projects\filtering-feature\filtersDefinedInAssemblyPluginConfig\pom.xml SUCCESS (2.6 s)
[INFO] Building: projects\filtering-feature\massembly-736\pom.xml
[INFO] run post-build script verify.bsh
[INFO]           projects\filtering-feature\massembly-736\pom.xml . SUCCESS (2.7 s)
[INFO] Building: projects\forking-tests\assembly-assembly-with-module-binaries\pom.xml
[INFO] run post-build script verify.bsh
[INFO]           projects\forking-tests\assembly-assembly-with-module-binaries\pom.xml SUCCESS (7.4 s)
[INFO] Building: projects\forking-tests\assembly-attached-with-module-binaries\pom.xml
[INFO] run post-build script verify.bsh
[INFO]           projects\forking-tests\assembly-attached-with-module-binaries\pom.xml SUCCESS (34.1 s)
[INFO] Building: projects\mojo-configuration\archiver-ignorePermissions\pom.xml
[INFO] run post-build script verify.bsh
[INFO]           projects\mojo-configuration\archiver-ignorePermissions\pom.xml SUCCESS (53.0 s)
[INFO] Building: projects\mojo-configuration\ignoreDirFormatExtensions\pom.xml
[INFO] run post-build script verify.bsh
[INFO]           projects\mojo-configuration\ignoreDirFormatExtensions\pom.xml SUCCESS (38.1 s)
[INFO] Building: projects\mojo-configuration\manifest-with-customEntry\pom.xml
[INFO] run post-build script verify.bsh
[INFO]           projects\mojo-configuration\manifest-with-customEntry\pom.xml SUCCESS (44.1 s)
[INFO] Building: projects\mojo-configuration\manifest-with-mainClass\pom.xml
[INFO] run post-build script verify.bsh
[INFO]           projects\mojo-configuration\manifest-with-mainClass\pom.xml SUCCESS (41.4 s)
[INFO] Building: projects\mojo-configuration\massembly-291\pom.xml
[INFO] run post-build script verify.bsh
[INFO]           projects\mojo-configuration\massembly-291\pom.xml  SUCCESS (27.0 s)
[INFO] Building: projects\mojo-configuration\massembly-301\pom.xml
[INFO] run post-build script verify.bsh
[INFO]           projects\mojo-configuration\massembly-301\pom.xml  SUCCESS (23.3 s)
[INFO] Building: projects\mojo-configuration\no-appendAssemblyId-no-classifier\pom.xml
[INFO] run post-build script verify.bsh
[INFO]           projects\mojo-configuration\no-appendAssemblyId-no-classifier\pom.xml SUCCESS (18.6 s)
[INFO] Building: projects\mojo-configuration\skipAssemblyCLIPropertySet\pom.xml
[INFO] run post-build script verify.bsh
[INFO]           projects\mojo-configuration\skipAssemblyCLIPropertySet\pom.xml SUCCESS (3.1 s)
[INFO] Building: projects\mojo-tests\single-in-one-project-hierarchy\pom.xml
[INFO] run post-build script verify.bsh
[INFO]           projects\mojo-tests\single-in-one-project-hierarchy\pom.xml SUCCESS (5.9 s)
[INFO] Building: projects\mojo-tests\single-twice-in-multimodule-hierarchy\pom.xml
[INFO] run post-build script verify.bsh
[INFO]           projects\mojo-tests\single-twice-in-multimodule-hierarchy\pom.xml SUCCESS (7.8 s)
[INFO] Building: projects\mojo-tests\single-twice-in-one-project-hierarchy\pom.xml
[INFO] run post-build script verify.bsh
[INFO]           projects\mojo-tests\single-twice-in-one-project-hierarchy\pom.xml SUCCESS (5.7 s)
[INFO] Building: projects\multimodule\massembly-298\pom.xml
[INFO] run post-build script verify.bsh
[INFO]           projects\multimodule\massembly-298\pom.xml ....... SUCCESS (13.8 s)
[INFO] Building: projects\multimodule\massembly-317\pom.xml
[INFO]           projects\multimodule\massembly-317\pom.xml ....... SUCCESS (35.8 s)
[INFO] Building: projects\multimodule\massembly-474\pom.xml
[INFO]           projects\multimodule\massembly-474\pom.xml ....... SUCCESS (44.9 s)
[INFO] Building: projects\multimodule\massembly-619\pom.xml
[INFO] run post-build script verify.bsh
[INFO]           projects\multimodule\massembly-619\pom.xml ....... SUCCESS (36.0 s)
[INFO] Building: projects\multimodule\multimodule-binariesNotSource\pom.xml
[INFO] run post-build script verify.bsh
[INFO]           projects\multimodule\multimodule-binariesNotSource\pom.xml SUCCESS (53.2 s)
[INFO] Building: projects\multimodule\multimodule-filteredFileSet\pom.xml
[INFO] run post-build script verify.bsh
[INFO]           projects\multimodule\multimodule-filteredFileSet\pom.xml SUCCESS (33.4 s)
[INFO] Building: projects\multimodule\multimodule-modulePomPropInterp\pom.xml
[INFO] run post-build script verify.bsh
[INFO]           projects\multimodule\multimodule-modulePomPropInterp\pom.xml SUCCESS (29.6 s)
[INFO] Building: projects\multimodule\multimodule-siblingParent\parent\pom.xml
[INFO] run post-build script verify.bsh
[INFO]           projects\multimodule\multimodule-siblingParent\parent\pom.xml SUCCESS (14.2 s)
[INFO] Building: projects\multimodule\multimodule-sourceNotBinaries\pom.xml
[INFO] run post-build script verify.bsh
[INFO]           projects\multimodule\multimodule-sourceNotBinaries\pom.xml SUCCESS (9.0 s)
[INFO] Building: projects\multimodule\multimodule-wholeReactorFromChild\pom.xml
[INFO] run post-build script verify.bsh
[INFO]           projects\multimodule\multimodule-wholeReactorFromChild\pom.xml SUCCESS (9.6 s)
[INFO] Building: projects\multimodule\two-level-multimodule\pom.xml
[INFO] run post-build script verify.groovy
[INFO]           projects\multimodule\two-level-multimodule\pom.xml SUCCESS (7.7 s)
[INFO] Building: projects\multimodule\two-levels-includeBaseDir-withBin\pom.xml
[INFO] run post-build script verify.groovy
[INFO]           projects\multimodule\two-levels-includeBaseDir-withBin\pom.xml SUCCESS (7.8 s)
[INFO] Building: projects\multimodule\two-levels-includeBaseDir-withSrc\pom.xml
[INFO] run post-build script verify.groovy
[INFO]           projects\multimodule\two-levels-includeBaseDir-withSrc\pom.xml SUCCESS (8.5 s)
[INFO] Building: projects\repositories\basic-repository\pom.xml
[INFO] run post-build script verify.bsh
[INFO]           projects\repositories\basic-repository\pom.xml ... SUCCESS (33.0 s)
[INFO] Building: projects\repositories\massembly-196\pom.xml
[INFO] run post-build script verify.bsh
[INFO]           projects\repositories\massembly-196\pom.xml ...... SUCCESS (62.8 s)
[INFO] Building: projects\repositories\massembly-855\pom.xml
[INFO] run post-build script verify.bsh
[INFO]           projects\repositories\massembly-855\pom.xml ...... SUCCESS (22.3 s)
[INFO]
[INFO] --- maven-checkstyle-plugin:3.0.0:check (checkstyle-check) @ maven-assembly-plugin ---
[INFO] There are 2 errors reported by Checkstyle 6.18 with config/maven_checks.xml ruleset.
[INFO] Ignored 2 errors, 0 violation remaining.
[INFO]
[INFO] --- maven-invoker-plugin:3.1.0:verify (integration-test) @ maven-assembly-plugin ---
[INFO] -------------------------------------------------
[INFO] Build Summary:
[INFO]   Passed: 135, Failed: 0, Errors: 0, Skipped: 2
[INFO] -------------------------------------------------
[INFO] ------------------------------------------------------------------------
[INFO] BUILD SUCCESS
[INFO] ------------------------------------------------------------------------
[INFO] Total time: 51:01 min
[INFO] Finished at: 2019-01-02T15:53:02Z
[INFO] Final Memory: 46M/160M
[INFO] ------------------------------------------------------------------------
[INFO] [jenkins-event-spy] Generated F:\jenkins\jenkins-slave\workspace\box_maven-assembly-plugin_master@2@tmp\withMaven983b8a68\maven-spy-20190102-150159-1916772640834003773284.log
[Pipeline] }
[Pipeline] // dir
[Pipeline] }
[withMaven] artifactsPublisher - Archive artifact windows-jdk11-m3.5.x_build\pom.xml under org\apache\maven\plugins\maven-assembly-plugin\3.1.2-SNAPSHOT\maven-assembly-plugin-3.1.2-SNAPSHOT.pom
[withMaven] artifactsPublisher - Archive artifact windows-jdk11-m3.5.x_build\target\maven-assembly-plugin-3.1.2-SNAPSHOT.jar under org\apache\maven\plugins\maven-assembly-plugin\3.1.2-SNAPSHOT\maven-assembly-plugin-3.1.2-SNAPSHOT.jar
[withMaven] junitPublisher - Archive test results for Maven artifact org.apache.maven.plugins:maven-assembly-plugin:maven-plugin:3.1.2-SNAPSHOT generated by maven-surefire-plugin:test (default-test): windows-jdk11-m3.5.x_build\target\surefire-reports\*.xml
Recording test results
[withMaven] openTasksPublisher - Scan Tasks for Maven artifact org.apache.maven.plugins:maven-assembly-plugin:maven-plugin:3.1.2-SNAPSHOT in source directory windows-jdk11-m3.5.x_build\src\main\java
[TASKS] Scanning folder 'f:\jenkins\jenkins-slave\workspace\box_maven-assembly-plugin_master@2' for files matching the pattern 'windows-jdk11-m3.5.x_build\src\main\java\**\*' - excludes: null
[TASKS] Found 71 files to scan for tasks
[TASKS] Found 14 open tasks.
Skipping warnings blame since pipelines do not have an SCM link.%n
[TASKS] Computing warning deltas based on reference build #43
[withMaven] invokerPublisher - Archive invoker results for Maven artifact MavenArtifact{org.apache.maven.plugins:maven-assembly-plugin:maven-plugin:3.1.2-SNAPSHOT(version: 3.1.2-SNAPSHOT, snapshot:false) } generated by PluginInvocation{org.apache.maven.plugins:maven-invoker-plugin:3.1.0@integration-test  integration-test}: windows-jdk11-m3.5.x_build\target\invoker-reports\*.xml
[withMaven] Publishers: Generated Artifacts Publisher: 1446 ms, Junit Publisher: 12021 ms, Open Task Scanner Publisher: 1557 ms, Invoker Publisher: 551421 ms, Pipeline Graph Publisher: 17 ms
[Pipeline] // withMaven
[Pipeline] cleanWs
[WS-CLEANUP] Deleting project workspace...
[WS-CLEANUP] Deferred wipeout is used...
ERROR: Cannot delete workspace :f:\jenkins\jenkins-slave\workspace\box_maven-assembly-plugin_master@2\windows-jdk11-m3.5.x_build\target\invoker-reports\BUILD-it-project-parent.xml
[Pipeline] }
[Pipeline] // stage
[Pipeline] }
[Pipeline] // ws
[Pipeline] }
[Pipeline] // node
[Pipeline] }
Failed in branch windows-jdk11-m3.5.x_build
[Pipeline] // parallel
[Pipeline] stage
[Pipeline] { (Notifications)
[Pipeline] echo
Build result: FAILURE
[Pipeline] jiraIssueSelector
[Pipeline] emailext
Reply | Threaded
Open this post in threaded view
|

Build succeeded in Jenkins: Maven TLP » maven-assembly-plugin » master #52

Apache Jenkins Server-2
See https://builds.apache.org/job/maven-box/job/maven-assembly-plugin/job/master/52/

Changes:

* Disable cleanWs() due to issues with file handles on Windows
* added a link to asf-gitpubsub-jenkins-plugin
* fixed markup (asciidoc, not markdown...)

All tests passed