Build failed in Jenkins: Maven TLP » maven-assembly-plugin » MASSEMBLY-921 #1

classic Classic list List threaded Threaded
4 messages Options
Reply | Threaded
Open this post in threaded view
|

Build failed in Jenkins: Maven TLP » maven-assembly-plugin » MASSEMBLY-921 #1

Apache Jenkins Server-2
See https://builds.apache.org/job/maven-box/job/maven-assembly-plugin/job/MASSEMBLY-921/1/

No changes.

All tests passed

Build log:
[...truncated 6022 lines...]
[withMaven] junitPublisher - Archive test results for Maven artifact org.apache.maven.plugins:maven-assembly-plugin:maven-plugin:3.2.0-SNAPSHOT generated by maven-surefire-plugin:test (default-test): windows-jdk7-m3.2.x_build\target\surefire-reports\*.xml
Recording test results
[INFO] There are 3 errors reported by Checkstyle 6.18 with config/maven_checks.xml ruleset.
[INFO] Ignored 3 errors, 0 violation remaining.
[INFO]
[INFO] --- maven-invoker-plugin:3.1.0:verify (integration-test) @ maven-assembly-plugin ---
[INFO] -------------------------------------------------
[INFO] Build Summary:
[INFO]   Passed: 1, Failed: 1, Errors: 0, Skipped: 0
[INFO] -------------------------------------------------
[ERROR] The following builds failed:
[ERROR] *  projects\reproducible\pom.xml
[INFO] -------------------------------------------------
[INFO] ------------------------------------------------------------------------
[INFO] BUILD FAILURE
[INFO] ------------------------------------------------------------------------
[INFO] Total time: 01:10 min
[INFO] Finished at: 2019-09-14T10:16:32-07:00
[INFO] Final Memory: 46M/537M
[INFO] ------------------------------------------------------------------------
[INFO] [jenkins-event-spy] Generated F:\jenkins\jenkins-slave\workspace\en-assembly-plugin_MASSEMBLY-921@2@2@tmp\withMaven633743d5\maven-spy-20190914-101521-4163864100364948386453.log
[ERROR] Failed to execute goal org.apache.maven.plugins:maven-invoker-plugin:3.1.0:verify (integration-test) on project maven-assembly-plugin: 1 build failed. See console output above for details. -> [Help 1]
org.apache.maven.lifecycle.LifecycleExecutionException: Failed to execute goal org.apache.maven.plugins:maven-invoker-plugin:3.1.0:verify (integration-test) on project maven-assembly-plugin: 1 build failed. See console output above for details.
        at org.apache.maven.lifecycle.internal.MojoExecutor.execute(MojoExecutor.java:212)
        at org.apache.maven.lifecycle.internal.MojoExecutor.execute(MojoExecutor.java:153)
        at org.apache.maven.lifecycle.internal.MojoExecutor.execute(MojoExecutor.java:145)
        at org.apache.maven.lifecycle.internal.LifecycleModuleBuilder.buildProject(LifecycleModuleBuilder.java:116)
        at org.apache.maven.lifecycle.internal.LifecycleModuleBuilder.buildProject(LifecycleModuleBuilder.java:80)
        at org.apache.maven.lifecycle.internal.builder.singlethreaded.SingleThreadedBuilder.build(SingleThreadedBuilder.java:51)
        at org.apache.maven.lifecycle.internal.LifecycleStarter.execute(LifecycleStarter.java:128)
        at org.apache.maven.DefaultMaven.doExecute(DefaultMaven.java:307)
        at org.apache.maven.DefaultMaven.doExecute(DefaultMaven.java:193)
        at org.apache.maven.DefaultMaven.execute(DefaultMaven.java:106)
        at org.apache.maven.cli.MavenCli.execute(MavenCli.java:863)
        at org.apache.maven.cli.MavenCli.doMain(MavenCli.java:288)
        at org.apache.maven.cli.MavenCli.main(MavenCli.java:199)
        at sun.reflect.NativeMethodAccessorImpl.invoke0(Native Method)
        at sun.reflect.NativeMethodAccessorImpl.invoke(NativeMethodAccessorImpl.java:57)
        at sun.reflect.DelegatingMethodAccessorImpl.invoke(DelegatingMethodAccessorImpl.java:43)
        at java.lang.reflect.Method.invoke(Method.java:606)
        at org.codehaus.plexus.classworlds.launcher.Launcher.launchEnhanced(Launcher.java:289)
        at org.codehaus.plexus.classworlds.launcher.Launcher.launch(Launcher.java:229)
        at org.codehaus.plexus.classworlds.launcher.Launcher.mainWithExitCode(Launcher.java:415)
        at org.codehaus.plexus.classworlds.launcher.Launcher.main(Launcher.java:356)
Caused by: org.apache.maven.plugin.MojoFailureException: 1 build failed. See console output above for details.
        at org.apache.maven.plugins.invoker.InvokerSession.handleFailures(InvokerSession.java:260)
        at org.apache.maven.plugins.invoker.VerifyMojo.execute(VerifyMojo.java:137)
        at org.apache.maven.plugin.DefaultBuildPluginManager.executeMojo(DefaultBuildPluginManager.java:134)
        at org.apache.maven.lifecycle.internal.MojoExecutor.execute(MojoExecutor.java:207)
        ... 20 more
[ERROR]
[ERROR] Re-run Maven using the -X switch to enable full debug logging.
[ERROR]
[ERROR] For more information about the errors and possible solutions, please read the following articles:
[ERROR] [Help 1] http://cwiki.apache.org/confluence/display/MAVEN/MojoFailureException
Picked up JAVA_TOOL_OPTIONS: -Dmaven.ext.class.path="f:\jenkins\jenkins-slave\workspace\en-assembly-plugin_MASSEMBLY-921@2@2@tmp\withMaven633743d5\pipeline-maven-spy.jar" -Dorg.jenkinsci.plugins.pipeline.maven.reportsFolder="f:\jenkins\jenkins-slave\workspace\en-assembly-plugin_MASSEMBLY-921@2@2@tmp\withMaven633743d5"
[Pipeline] }
[withMaven] openTasksPublisher - Scan Tasks for Maven artifact org.apache.maven.plugins:maven-assembly-plugin:maven-plugin:3.2.0-SNAPSHOT in source directory windows-jdk7-m3.2.x_build\src\main\java
[Pipeline] // dir
[Pipeline] }
[Fast Archiver] No prior successful build to compare, so performing full copy of artifacts
[TASKS] Scanning folder 'f:\jenkins\jenkins-slave\workspace\en-assembly-plugin_MASSEMBLY-921@3' for files matching the pattern 'windows-jdk7-m3.2.x_build\src\main\java\**\*' - excludes: null
[TASKS] Found 71 files to scan for tasks
[TASKS] Found 14 open tasks.
Skipping warnings blame since pipelines do not have an SCM link.%n
[withMaven] junitPublisher - Archive test results for Maven artifact org.apache.maven.plugins:maven-assembly-plugin:maven-plugin:3.2.0-SNAPSHOT generated by maven-surefire-plugin:test (default-test): windows-jdk7-m3.3.x_build\target\surefire-reports\*.xml
Recording test results
[withMaven] invokerPublisher - Archive invoker results for Maven artifact MavenArtifact{org.apache.maven.plugins:maven-assembly-plugin:maven-plugin:3.2.0-SNAPSHOT(version: 3.2.0-SNAPSHOT, snapshot:false) } generated by PluginInvocation{org.apache.maven.plugins:maven-invoker-plugin:3.1.0@integration-test  integration-test}: windows-jdk7-m3.2.x_build\target\invoker-reports\*.xml
[withMaven] openTasksPublisher - Scan Tasks for Maven artifact org.apache.maven.plugins:maven-assembly-plugin:maven-plugin:3.2.0-SNAPSHOT in source directory windows-jdk7-m3.3.x_build\src\main\java
[TASKS] Scanning folder 'f:\jenkins\jenkins-slave\workspace\en-assembly-plugin_MASSEMBLY-921@2@2' for files matching the pattern 'windows-jdk7-m3.3.x_build\src\main\java\**\*' - excludes: null
[TASKS] Found 71 files to scan for tasks
[TASKS] Found 14 open tasks.
Skipping warnings blame since pipelines do not have an SCM link.%n
[withMaven] Publishers: Generated Artifacts Publisher: 11 ms, Junit Publisher: 803 ms, Open Task Scanner Publisher: 170 ms, Dependencies Fingerprint Publisher: 54 ms, Invoker Publisher: 795 ms, Pipeline Graph Publisher: 1 ms
[Pipeline] // withMaven
[Pipeline] cleanWs
[withMaven] invokerPublisher - Archive invoker results for Maven artifact MavenArtifact{org.apache.maven.plugins:maven-assembly-plugin:maven-plugin:3.2.0-SNAPSHOT(version: 3.2.0-SNAPSHOT, snapshot:false) } generated by PluginInvocation{org.apache.maven.plugins:maven-invoker-plugin:3.1.0@integration-test  integration-test}: windows-jdk7-m3.3.x_build\target\invoker-reports\*.xml
[WS-CLEANUP] Deleting project workspace...
[WS-CLEANUP] Deferred wipeout is used...
[WS-CLEANUP] done
[Pipeline] cleanWs
[WS-CLEANUP] Deleting project workspace...
[WS-CLEANUP] Deferred wipeout is used...
[WS-CLEANUP] done
[Pipeline] }
[Pipeline] // stage
[Pipeline] }
[Pipeline] // ws
[Pipeline] }
[Pipeline] // node
[Pipeline] }
Failed in branch windows-jdk7-m3.2.x_build
[withMaven] Publishers: Generated Artifacts Publisher: 7 ms, Junit Publisher: 688 ms, Open Task Scanner Publisher: 208 ms, Dependencies Fingerprint Publisher: 86 ms, Invoker Publisher: 1082 ms, Pipeline Graph Publisher: 1 ms
[Pipeline] // withMaven
[Pipeline] cleanWs
[WS-CLEANUP] Deleting project workspace...
[WS-CLEANUP] Deferred wipeout is used...
[WS-CLEANUP] done
[Pipeline] cleanWs
[WS-CLEANUP] Deleting project workspace...
[WS-CLEANUP] Deferred wipeout is used...
[WS-CLEANUP] done
[Pipeline] }
[Pipeline] // stage
[Pipeline] }
[Pipeline] // ws
[Pipeline] }
[Pipeline] // node
[Pipeline] }
Failed in branch windows-jdk7-m3.3.x_build
[INFO] Skipping because packaging 'maven-plugin' is not pom.
[INFO]
[INFO] --- maven-invoker-plugin:3.1.0:install (integration-test) @ maven-assembly-plugin ---
[INFO] Installing /home/jenkins/jenkins-slave/workspace/en-assembly-plugin_MASSEMBLY-921@2/linux-jdk13-m3.6.x_build/pom.xml to /home/jenkins/jenkins-slave/workspace/en-assembly-plugin_MASSEMBLY-921@2/linux-jdk13-m3.6.x_build/target/local-repo/org/apache/maven/plugins/maven-assembly-plugin/3.2.0-SNAPSHOT/maven-assembly-plugin-3.2.0-SNAPSHOT.pom
[INFO] Installing /home/jenkins/jenkins-slave/workspace/en-assembly-plugin_MASSEMBLY-921@2/linux-jdk13-m3.6.x_build/target/maven-assembly-plugin-3.2.0-SNAPSHOT.jar to /home/jenkins/jenkins-slave/workspace/en-assembly-plugin_MASSEMBLY-921@2/linux-jdk13-m3.6.x_build/target/local-repo/org/apache/maven/plugins/maven-assembly-plugin/3.2.0-SNAPSHOT/maven-assembly-plugin-3.2.0-SNAPSHOT.jar
[INFO]
[INFO] --- maven-invoker-plugin:3.1.0:integration-test (integration-test) @ maven-assembly-plugin ---
[INFO] Running 1 setup job:
[INFO] Building: it-project-parent/pom.xml
[INFO]           it-project-parent/pom.xml ........................ SUCCESS (3.9 s)
[INFO] Setup done.
[INFO] Building: projects/reproducible/pom.xml
[INFO] run post-build script verify.groovy
WARNING: An illegal reflective access operation has occurred
WARNING: Illegal reflective access by org.codehaus.groovy.reflection.CachedClass (file:/home/jenkins/jenkins-slave/workspace/.maven_repositories/0/org/codehaus/groovy/groovy-all/2.4.8/groovy-all-2.4.8.jar) to method java.lang.Object.finalize()
WARNING: Please consider reporting this to the maintainers of org.codehaus.groovy.reflection.CachedClass
WARNING: Use --illegal-access=warn to enable warnings of further illegal reflective access operations
WARNING: All illegal access operations will be denied in a future release
[INFO]           projects/reproducible/pom.xml .................... FAILED (16.1 s)
[INFO]   The post-build script did not succeed. assert new File( deployDir, 'reproducible-1.0-src.tar.sha1' ).text == '408fb459348cbefdb499092145ec57b57cd74c2c'
       |         |                                            |    |
       |         |                                            |    false
       |         |                                            21305f0bd08d5c6357dbf38620c573e456b377ce
       |         /home/jenkins/jenkins-slave/workspace/en-assembly-plugin_MASSEMBLY-921@2/linux-jdk13-m3.6.x_build/target/it/projects/reproducible/target/repo/org/apache/maven/its/reproducible/1.0
       /home/jenkins/jenkins-slave/workspace/en-assembly-plugin_MASSEMBLY-921@2/linux-jdk13-m3.6.x_build/target/it/projects/reproducible/target/repo/org/apache/maven/its/reproducible/1.0/reproducible-1.0-src.tar.sha1
[INFO]
[INFO] --- maven-checkstyle-plugin:3.0.0:check (checkstyle-check) @ maven-assembly-plugin ---
[INFO] There are 3 errors reported by Checkstyle 6.18 with config/maven_checks.xml ruleset.
[INFO] Ignored 3 errors, 0 violation remaining.
[INFO]
[INFO] --- maven-invoker-plugin:3.1.0:verify (integration-test) @ maven-assembly-plugin ---
[INFO] -------------------------------------------------
[INFO] Build Summary:
[INFO]   Passed: 1, Failed: 1, Errors: 0, Skipped: 0
[INFO] -------------------------------------------------
[ERROR] The following builds failed:
[ERROR] *  projects/reproducible/pom.xml
[INFO] -------------------------------------------------
[INFO] ------------------------------------------------------------------------
[INFO] BUILD FAILURE
[INFO] ------------------------------------------------------------------------
[INFO] Total time:  01:51 min
[INFO] Finished at: 2019-09-14T17:17:06Z
[INFO] ------------------------------------------------------------------------
[INFO] [jenkins-event-spy] Generated /home/jenkins/jenkins-slave/workspace/en-assembly-plugin_MASSEMBLY-921@2@tmp/withMaven48d99d0b/maven-spy-20190914-171514-7787752281516346779303.log
[ERROR] Failed to execute goal org.apache.maven.plugins:maven-invoker-plugin:3.1.0:verify (integration-test) on project maven-assembly-plugin: 1 build failed. See console output above for details. -> [Help 1]
org.apache.maven.lifecycle.LifecycleExecutionException: Failed to execute goal org.apache.maven.plugins:maven-invoker-plugin:3.1.0:verify (integration-test) on project maven-assembly-plugin: 1 build failed. See console output above for details.
    at org.apache.maven.lifecycle.internal.MojoExecutor.execute (MojoExecutor.java:215)
    at org.apache.maven.lifecycle.internal.MojoExecutor.execute (MojoExecutor.java:156)
    at org.apache.maven.lifecycle.internal.MojoExecutor.execute (MojoExecutor.java:148)
    at org.apache.maven.lifecycle.internal.LifecycleModuleBuilder.buildProject (LifecycleModuleBuilder.java:117)
    at org.apache.maven.lifecycle.internal.LifecycleModuleBuilder.buildProject (LifecycleModuleBuilder.java:81)
    at org.apache.maven.lifecycle.internal.builder.singlethreaded.SingleThreadedBuilder.build (SingleThreadedBuilder.java:56)
    at org.apache.maven.lifecycle.internal.LifecycleStarter.execute (LifecycleStarter.java:128)
    at org.apache.maven.DefaultMaven.doExecute (DefaultMaven.java:305)
    at org.apache.maven.DefaultMaven.doExecute (DefaultMaven.java:192)
    at org.apache.maven.DefaultMaven.execute (DefaultMaven.java:105)
    at org.apache.maven.cli.MavenCli.execute (MavenCli.java:956)
    at org.apache.maven.cli.MavenCli.doMain (MavenCli.java:288)
    at org.apache.maven.cli.MavenCli.main (MavenCli.java:192)
    at jdk.internal.reflect.NativeMethodAccessorImpl.invoke0 (Native Method)
    at jdk.internal.reflect.NativeMethodAccessorImpl.invoke (NativeMethodAccessorImpl.java:62)
    at jdk.internal.reflect.DelegatingMethodAccessorImpl.invoke (DelegatingMethodAccessorImpl.java:43)
    at java.lang.reflect.Method.invoke (Method.java:567)
    at org.codehaus.plexus.classworlds.launcher.Launcher.launchEnhanced (Launcher.java:289)
    at org.codehaus.plexus.classworlds.launcher.Launcher.launch (Launcher.java:229)
    at org.codehaus.plexus.classworlds.launcher.Launcher.mainWithExitCode (Launcher.java:415)
    at org.codehaus.plexus.classworlds.launcher.Launcher.main (Launcher.java:356)
Caused by: org.apache.maven.plugin.MojoFailureException: 1 build failed. See console output above for details.
    at org.apache.maven.plugins.invoker.InvokerSession.handleFailures (InvokerSession.java:260)
    at org.apache.maven.plugins.invoker.VerifyMojo.execute (VerifyMojo.java:137)
    at org.apache.maven.plugin.DefaultBuildPluginManager.executeMojo (DefaultBuildPluginManager.java:137)
    at org.apache.maven.lifecycle.internal.MojoExecutor.execute (MojoExecutor.java:210)
    at org.apache.maven.lifecycle.internal.MojoExecutor.execute (MojoExecutor.java:156)
    at org.apache.maven.lifecycle.internal.MojoExecutor.execute (MojoExecutor.java:148)
    at org.apache.maven.lifecycle.internal.LifecycleModuleBuilder.buildProject (LifecycleModuleBuilder.java:117)
    at org.apache.maven.lifecycle.internal.LifecycleModuleBuilder.buildProject (LifecycleModuleBuilder.java:81)
    at org.apache.maven.lifecycle.internal.builder.singlethreaded.SingleThreadedBuilder.build (SingleThreadedBuilder.java:56)
    at org.apache.maven.lifecycle.internal.LifecycleStarter.execute (LifecycleStarter.java:128)
    at org.apache.maven.DefaultMaven.doExecute (DefaultMaven.java:305)
    at org.apache.maven.DefaultMaven.doExecute (DefaultMaven.java:192)
    at org.apache.maven.DefaultMaven.execute (DefaultMaven.java:105)
    at org.apache.maven.cli.MavenCli.execute (MavenCli.java:956)
    at org.apache.maven.cli.MavenCli.doMain (MavenCli.java:288)
    at org.apache.maven.cli.MavenCli.main (MavenCli.java:192)
    at jdk.internal.reflect.NativeMethodAccessorImpl.invoke0 (Native Method)
    at jdk.internal.reflect.NativeMethodAccessorImpl.invoke (NativeMethodAccessorImpl.java:62)
    at jdk.internal.reflect.DelegatingMethodAccessorImpl.invoke (DelegatingMethodAccessorImpl.java:43)
    at java.lang.reflect.Method.invoke (Method.java:567)
    at org.codehaus.plexus.classworlds.launcher.Launcher.launchEnhanced (Launcher.java:289)
    at org.codehaus.plexus.classworlds.launcher.Launcher.launch (Launcher.java:229)
    at org.codehaus.plexus.classworlds.launcher.Launcher.mainWithExitCode (Launcher.java:415)
    at org.codehaus.plexus.classworlds.launcher.Launcher.main (Launcher.java:356)
[ERROR]
[ERROR] Re-run Maven using the -X switch to enable full debug logging.
[ERROR]
[ERROR] For more information about the errors and possible solutions, please read the following articles:
[ERROR] [Help 1] http://cwiki.apache.org/confluence/display/MAVEN/MojoFailureException
[Pipeline] }
[Pipeline] // dir
[Pipeline] }
[Fast Archiver] No prior successful build to compare, so performing full copy of artifacts
[withMaven] junitPublisher - Archive test results for Maven artifact org.apache.maven.plugins:maven-assembly-plugin:maven-plugin:3.2.0-SNAPSHOT generated by maven-surefire-plugin:test (default-test): linux-jdk13-m3.6.x_build/target/surefire-reports/*.xml
Recording test results
[withMaven] openTasksPublisher - Scan Tasks for Maven artifact org.apache.maven.plugins:maven-assembly-plugin:maven-plugin:3.2.0-SNAPSHOT in source directory linux-jdk13-m3.6.x_build/src/main/java
[TASKS] Scanning folder '/home/jenkins/jenkins-slave/workspace/en-assembly-plugin_MASSEMBLY-921@2' for files matching the pattern 'linux-jdk13-m3.6.x_build/src/main/java/**/*' - excludes: null
[TASKS] Found 71 files to scan for tasks
[TASKS] Found 14 open tasks.
Skipping warnings blame since pipelines do not have an SCM link.%n
[withMaven] invokerPublisher - Archive invoker results for Maven artifact MavenArtifact{org.apache.maven.plugins:maven-assembly-plugin:maven-plugin:3.2.0-SNAPSHOT(version: 3.2.0-SNAPSHOT, snapshot:false) } generated by PluginInvocation{org.apache.maven.plugins:maven-invoker-plugin:3.1.0@integration-test  integration-test}: linux-jdk13-m3.6.x_build/target/invoker-reports/*.xml
[withMaven] Publishers: Generated Artifacts Publisher: 157 ms, Junit Publisher: 15367 ms, Open Task Scanner Publisher: 1818 ms, Dependencies Fingerprint Publisher: 1273 ms, Invoker Publisher: 1913 ms, Pipeline Graph Publisher: 19 ms
[Pipeline] // withMaven
[Pipeline] cleanWs
[WS-CLEANUP] Deleting project workspace...
[WS-CLEANUP] Deferred wipeout is used...
[WS-CLEANUP] done
[Pipeline] cleanWs
[WS-CLEANUP] Deleting project workspace...
[WS-CLEANUP] Deferred wipeout is used...
[WS-CLEANUP] done
[Pipeline] }
[Pipeline] // stage
[Pipeline] }
[Pipeline] // ws
[Pipeline] }
[Pipeline] // node
[Pipeline] }
Failed in branch linux-jdk13-m3.6.x_build
[Pipeline] // parallel
[Pipeline] stage
[Pipeline] { (Notifications)
[Pipeline] echo
Build result: FAILURE
[Pipeline] jiraIssueSelector
[Pipeline] echo
The authors of changes [].
[Pipeline] echo
Sending email ...
[Pipeline] emailext
Reply | Threaded
Open this post in threaded view
|

Build failed in Jenkins: Maven TLP » maven-assembly-plugin » MASSEMBLY-921 #2

Apache Jenkins Server-2
See https://builds.apache.org/job/maven-box/job/maven-assembly-plugin/job/MASSEMBLY-921/2/

Changes:

* added snapshot repos
* added snapshot repos
* added snapshot repos
* added snapshot repos
* added snapshot repos
* added snapshot repos
* added snapshot repos
* added snapshot repos
* added snapshot repos
* added snapshot repos
* added snapshot repos
* added snapshot repos
* added snapshot repos
* added snapshot repos
* added snapshot repos
* added snapshot repos

All tests passed

Build log:
[...truncated 6404 lines...]
[INFO] Using 'UTF-8' encoding to copy filtered resources.
[INFO] Copying 5 resources
[INFO] skip non existing resourceDirectory /home/jenkins/jenkins-slave/workspace/en-assembly-plugin_MASSEMBLY-921@2/linux-jdk13-m3.6.x_build/target/generated-resources/plexus
[INFO] Copying 3 resources
[INFO]
[INFO] --- maven-compiler-plugin:3.7.0:compile (default-compile) @ maven-assembly-plugin ---
[INFO] Changes detected - recompiling the module!
[INFO] Compiling 88 source files to /home/jenkins/jenkins-slave/workspace/en-assembly-plugin_MASSEMBLY-921@2/linux-jdk13-m3.6.x_build/target/classes
[INFO] /home/jenkins/jenkins-slave/workspace/en-assembly-plugin_MASSEMBLY-921@2/linux-jdk13-m3.6.x_build/src/main/java/org/apache/maven/plugins/assembly/archive/DefaultAssemblyArchiver.java: Some input files use or override a deprecated API.
[INFO] /home/jenkins/jenkins-slave/workspace/en-assembly-plugin_MASSEMBLY-921@2/linux-jdk13-m3.6.x_build/src/main/java/org/apache/maven/plugins/assembly/archive/DefaultAssemblyArchiver.java: Recompile with -Xlint:deprecation for details.
[INFO] /home/jenkins/jenkins-slave/workspace/en-assembly-plugin_MASSEMBLY-921@2/linux-jdk13-m3.6.x_build/target/generated-sources/modello/org/apache/maven/plugins/assembly/model/io/xpp3/AssemblyXpp3Reader.java: Some input files use unchecked or unsafe operations.
[INFO] /home/jenkins/jenkins-slave/workspace/en-assembly-plugin_MASSEMBLY-921@2/linux-jdk13-m3.6.x_build/target/generated-sources/modello/org/apache/maven/plugins/assembly/model/io/xpp3/AssemblyXpp3Reader.java: Recompile with -Xlint:unchecked for details.
[INFO]
[INFO] --- maven-plugin-plugin:3.5.2:descriptor (default-descriptor) @ maven-assembly-plugin ---
[INFO] Using 'UTF-8' encoding to read mojo source files.
[INFO] java-javadoc mojo extractor found 0 mojo descriptor.
[INFO] java-annotations mojo extractor found 2 mojo descriptors.
[INFO]
[INFO] --- plexus-component-metadata:1.7.1:generate-metadata (descriptors) @ maven-assembly-plugin ---
[INFO] Discovered 13 component descriptors(s)
[INFO]
[INFO] --- maven-resources-plugin:3.1.0:testResources (default-testResources) @ maven-assembly-plugin ---
[INFO] Using 'UTF-8' encoding to copy filtered resources.
[INFO] Copying 1 resource
[INFO] Copying 3 resources
[INFO]
[INFO] --- maven-compiler-plugin:3.7.0:testCompile (default-testCompile) @ maven-assembly-plugin ---
[INFO] Changes detected - recompiling the module!
[INFO] Compiling 34 source files to /home/jenkins/jenkins-slave/workspace/en-assembly-plugin_MASSEMBLY-921@2/linux-jdk13-m3.6.x_build/target/test-classes
[INFO] /home/jenkins/jenkins-slave/workspace/en-assembly-plugin_MASSEMBLY-921@2/linux-jdk13-m3.6.x_build/src/test/java/org/apache/maven/plugins/assembly/archive/task/testutils/MockAndControlForAddFileSetsTask.java: Some input files use or override a deprecated API.
[INFO] /home/jenkins/jenkins-slave/workspace/en-assembly-plugin_MASSEMBLY-921@2/linux-jdk13-m3.6.x_build/src/test/java/org/apache/maven/plugins/assembly/archive/task/testutils/MockAndControlForAddFileSetsTask.java: Recompile with -Xlint:deprecation for details.
[INFO] /home/jenkins/jenkins-slave/workspace/en-assembly-plugin_MASSEMBLY-921@2/linux-jdk13-m3.6.x_build/src/test/java/org/apache/maven/plugins/assembly/archive/task/testutils/MockAndControlForAddArtifactTask.java: Some input files use unchecked or unsafe operations.
[INFO] /home/jenkins/jenkins-slave/workspace/en-assembly-plugin_MASSEMBLY-921@2/linux-jdk13-m3.6.x_build/src/test/java/org/apache/maven/plugins/assembly/archive/task/testutils/MockAndControlForAddArtifactTask.java: Recompile with -Xlint:unchecked for details.
[INFO]
[INFO] --- plexus-component-metadata:1.7.1:generate-test-metadata (descriptors) @ maven-assembly-plugin ---
[INFO]
[INFO] --- maven-surefire-plugin:2.22.0:test (default-test) @ maven-assembly-plugin ---
[INFO] Surefire report directory: /home/jenkins/jenkins-slave/workspace/en-assembly-plugin_MASSEMBLY-921@2/linux-jdk13-m3.6.x_build/target/surefire-reports
[INFO]
[INFO] -------------------------------------------------------
[INFO]  T E S T S
[INFO] -------------------------------------------------------
[INFO] Running org.apache.maven.plugins.assembly.interpolation.AssemblyExpressionEvaluatorTest
[INFO] Tests run: 5, Failures: 0, Errors: 0, Skipped: 0, Time elapsed: 0.654 s - in org.apache.maven.plugins.assembly.interpolation.AssemblyExpressionEvaluatorTest
[INFO] Running org.apache.maven.plugins.assembly.interpolation.AssemblyInterpolatorTest
[INFO] Tests run: 7, Failures: 0, Errors: 0, Skipped: 0, Time elapsed: 0.019 s - in org.apache.maven.plugins.assembly.interpolation.AssemblyInterpolatorTest
[INFO] Running org.apache.maven.plugins.assembly.filter.ComponentsXmlArchiverFileFilterTest
[INFO] Tests run: 7, Failures: 0, Errors: 0, Skipped: 0, Time elapsed: 1.182 s - in org.apache.maven.plugins.assembly.filter.ComponentsXmlArchiverFileFilterTest
[INFO] Running org.apache.maven.plugins.assembly.archive.task.AddFileSetsTaskTest
[INFO] Tests run: 9, Failures: 0, Errors: 0, Skipped: 0, Time elapsed: 0.356 s - in org.apache.maven.plugins.assembly.archive.task.AddFileSetsTaskTest
[INFO] Running org.apache.maven.plugins.assembly.archive.task.AddDirectoryTaskTest
[INFO] Tests run: 4, Failures: 0, Errors: 0, Skipped: 0, Time elapsed: 0.058 s - in org.apache.maven.plugins.assembly.archive.task.AddDirectoryTaskTest
[INFO] Running org.apache.maven.plugins.assembly.archive.task.AddDependencySetsTaskTest
[INFO] Tests run: 8, Failures: 0, Errors: 0, Skipped: 0, Time elapsed: 0.162 s - in org.apache.maven.plugins.assembly.archive.task.AddDependencySetsTaskTest
[INFO] Running org.apache.maven.plugins.assembly.archive.task.AddArtifactTaskTest
[INFO] Tests run: 5, Failures: 0, Errors: 0, Skipped: 0, Time elapsed: 0.024 s - in org.apache.maven.plugins.assembly.archive.task.AddArtifactTaskTest
[INFO] Running org.apache.maven.plugins.assembly.archive.archiver.AssemblyProxyArchiverTest
[INFO] Tests run: 4, Failures: 0, Errors: 0, Skipped: 0, Time elapsed: 0.207 s - in org.apache.maven.plugins.assembly.archive.archiver.AssemblyProxyArchiverTest
[INFO] Running org.apache.maven.plugins.assembly.archive.DefaultAssemblyArchiverTest
[INFO] Tests run: 15, Failures: 0, Errors: 0, Skipped: 0, Time elapsed: 2.901 s - in org.apache.maven.plugins.assembly.archive.DefaultAssemblyArchiverTest
[INFO] Running org.apache.maven.plugins.assembly.archive.phase.FileSetAssemblyPhaseTest
[INFO] Tests run: 2, Failures: 0, Errors: 0, Skipped: 0, Time elapsed: 0.06 s - in org.apache.maven.plugins.assembly.archive.phase.FileSetAssemblyPhaseTest
[INFO] Running org.apache.maven.plugins.assembly.archive.phase.AssemblyArchiverPhaseComparatorTest
[INFO] Tests run: 1, Failures: 0, Errors: 0, Skipped: 0, Time elapsed: 0.006 s - in org.apache.maven.plugins.assembly.archive.phase.AssemblyArchiverPhaseComparatorTest
[INFO] Running org.apache.maven.plugins.assembly.archive.phase.ModuleSetAssemblyPhaseTest
[INFO] Tests run: 24, Failures: 0, Errors: 0, Skipped: 0, Time elapsed: 0.448 s - in org.apache.maven.plugins.assembly.archive.phase.ModuleSetAssemblyPhaseTest
[INFO] Running org.apache.maven.plugins.assembly.archive.phase.FileItemAssemblyPhaseTest
[INFO] Tests run: 6, Failures: 0, Errors: 0, Skipped: 0, Time elapsed: 0.158 s - in org.apache.maven.plugins.assembly.archive.phase.FileItemAssemblyPhaseTest
[INFO] Running org.apache.maven.plugins.assembly.archive.phase.DependencySetAssemblyPhaseTest
[INFO] Tests run: 2, Failures: 0, Errors: 0, Skipped: 0, Time elapsed: 0.023 s - in org.apache.maven.plugins.assembly.archive.phase.DependencySetAssemblyPhaseTest
[INFO] Running org.apache.maven.plugins.assembly.archive.phase.RepositoryAssemblyPhaseTest
[INFO] Tests run: 2, Failures: 0, Errors: 0, Skipped: 0, Time elapsed: 0.057 s - in org.apache.maven.plugins.assembly.archive.phase.RepositoryAssemblyPhaseTest
[INFO] Running org.apache.maven.plugins.assembly.archive.ManifestCreationFinalizerTest
[INFO] Tests run: 4, Failures: 0, Errors: 0, Skipped: 0, Time elapsed: 0.042 s - in org.apache.maven.plugins.assembly.archive.ManifestCreationFinalizerTest
[INFO] Running org.apache.maven.plugins.assembly.artifact.ResolutionManagementInfoTest
[INFO] Tests run: 3, Failures: 0, Errors: 0, Skipped: 0, Time elapsed: 0.024 s - in org.apache.maven.plugins.assembly.artifact.ResolutionManagementInfoTest
[INFO] Running org.apache.maven.plugins.assembly.artifact.DefaultDependencyResolverTest
[INFO] Tests run: 4, Failures: 0, Errors: 0, Skipped: 0, Time elapsed: 0.714 s - in org.apache.maven.plugins.assembly.artifact.DefaultDependencyResolverTest
[INFO] Running org.apache.maven.plugins.assembly.io.PrefixedClasspathLocatorStrategyTest
[INFO] Tests run: 4, Failures: 0, Errors: 0, Skipped: 0, Time elapsed: 0.015 s - in org.apache.maven.plugins.assembly.io.PrefixedClasspathLocatorStrategyTest
[INFO] Running org.apache.maven.plugins.assembly.io.DefaultAssemblyReaderTest
[INFO] Tests run: 22, Failures: 0, Errors: 0, Skipped: 0, Time elapsed: 0.68 s - in org.apache.maven.plugins.assembly.io.DefaultAssemblyReaderTest
[INFO] Running org.apache.maven.plugins.assembly.utils.LineEndingsUtilsTest
[INFO] Tests run: 24, Failures: 0, Errors: 0, Skipped: 0, Time elapsed: 0.037 s - in org.apache.maven.plugins.assembly.utils.LineEndingsUtilsTest
[INFO] Running org.apache.maven.plugins.assembly.utils.LinuxLineFeedInputStreamTest
[INFO] Tests run: 7, Failures: 0, Errors: 0, Skipped: 0, Time elapsed: 0.009 s - in org.apache.maven.plugins.assembly.utils.LinuxLineFeedInputStreamTest
[INFO] Running org.apache.maven.plugins.assembly.utils.AssemblyFormatUtilsTest
[INFO] Tests run: 69, Failures: 0, Errors: 0, Skipped: 0, Time elapsed: 0.079 s - in org.apache.maven.plugins.assembly.utils.AssemblyFormatUtilsTest
[INFO] Running org.apache.maven.plugins.assembly.utils.WindowsLineFeedInputStreamTest
[INFO] Tests run: 7, Failures: 0, Errors: 0, Skipped: 0, Time elapsed: 0.001 s - in org.apache.maven.plugins.assembly.utils.WindowsLineFeedInputStreamTest
[INFO] Running org.apache.maven.plugins.assembly.utils.FilterUtilsTest
[INFO] Tests run: 13, Failures: 0, Errors: 0, Skipped: 0, Time elapsed: 0.044 s - in org.apache.maven.plugins.assembly.utils.FilterUtilsTest
[INFO] Running org.apache.maven.plugins.assembly.utils.ProjectUtilsTest
[INFO] Tests run: 5, Failures: 0, Errors: 0, Skipped: 0, Time elapsed: 0.01 s - in org.apache.maven.plugins.assembly.utils.ProjectUtilsTest
[INFO] Running org.apache.maven.plugins.assembly.utils.TypeConversionUtilsTest
[INFO] Tests run: 6, Failures: 0, Errors: 0, Skipped: 0, Time elapsed: 0.001 s - in org.apache.maven.plugins.assembly.utils.TypeConversionUtilsTest
[INFO] Running org.apache.maven.plugins.assembly.format.ReaderFormatterTest
[INFO] Tests run: 3, Failures: 0, Errors: 0, Skipped: 0, Time elapsed: 0.005 s - in org.apache.maven.plugins.assembly.format.ReaderFormatterTest
[INFO]
[INFO] Results:
[INFO]
[INFO] Tests run: 272, Failures: 0, Errors: 0, Skipped: 0
[INFO]
[INFO]
[INFO] --- maven-jar-plugin:3.1.0:jar (default-jar) @ maven-assembly-plugin ---
[INFO] Building jar: /home/jenkins/jenkins-slave/workspace/en-assembly-plugin_MASSEMBLY-921@2/linux-jdk13-m3.6.x_build/target/maven-assembly-plugin-3.2.0-SNAPSHOT.jar
[INFO]
[INFO] --- maven-plugin-plugin:3.5.2:addPluginArtifactMetadata (default-addPluginArtifactMetadata) @ maven-assembly-plugin ---
[INFO]
[INFO] --- maven-site-plugin:3.7.1:attach-descriptor (attach-descriptor) @ maven-assembly-plugin ---
[INFO] Skipping because packaging 'maven-plugin' is not pom.
[INFO]
[INFO] --- maven-invoker-plugin:3.1.0:install (integration-test) @ maven-assembly-plugin ---
[INFO] Installing /home/jenkins/jenkins-slave/workspace/en-assembly-plugin_MASSEMBLY-921@2/linux-jdk13-m3.6.x_build/pom.xml to /home/jenkins/jenkins-slave/workspace/en-assembly-plugin_MASSEMBLY-921@2/linux-jdk13-m3.6.x_build/target/local-repo/org/apache/maven/plugins/maven-assembly-plugin/3.2.0-SNAPSHOT/maven-assembly-plugin-3.2.0-SNAPSHOT.pom
[INFO] Installing /home/jenkins/jenkins-slave/workspace/en-assembly-plugin_MASSEMBLY-921@2/linux-jdk13-m3.6.x_build/target/maven-assembly-plugin-3.2.0-SNAPSHOT.jar to /home/jenkins/jenkins-slave/workspace/en-assembly-plugin_MASSEMBLY-921@2/linux-jdk13-m3.6.x_build/target/local-repo/org/apache/maven/plugins/maven-assembly-plugin/3.2.0-SNAPSHOT/maven-assembly-plugin-3.2.0-SNAPSHOT.jar
[INFO]
[INFO] --- maven-invoker-plugin:3.1.0:integration-test (integration-test) @ maven-assembly-plugin ---
[INFO] Running 1 setup job:
[INFO] Building: it-project-parent/pom.xml
[INFO]           it-project-parent/pom.xml ........................ SUCCESS (9.3 s)
[INFO] Setup done.
[INFO] Building: projects/reproducible/pom.xml
[INFO] run post-build script verify.groovy
WARNING: An illegal reflective access operation has occurred
WARNING: Illegal reflective access by org.codehaus.groovy.reflection.CachedClass (file:/home/jenkins/jenkins-slave/workspace/.maven_repositories/1/org/codehaus/groovy/groovy-all/2.4.8/groovy-all-2.4.8.jar) to method java.lang.Object.finalize()
WARNING: Please consider reporting this to the maintainers of org.codehaus.groovy.reflection.CachedClass
WARNING: Use --illegal-access=warn to enable warnings of further illegal reflective access operations
WARNING: All illegal access operations will be denied in a future release
[INFO]           projects/reproducible/pom.xml .................... FAILED (30.2 s)
[INFO]   The post-build script did not succeed. assert new File( deployDir, 'reproducible-1.0-src.tar.sha1' ).text == '408fb459348cbefdb499092145ec57b57cd74c2c'
       |         |                                            |    |
       |         |                                            |    false
       |         |                                            21305f0bd08d5c6357dbf38620c573e456b377ce
       |         /home/jenkins/jenkins-slave/workspace/en-assembly-plugin_MASSEMBLY-921@2/linux-jdk13-m3.6.x_build/target/it/projects/reproducible/target/repo/org/apache/maven/its/reproducible/1.0
       /home/jenkins/jenkins-slave/workspace/en-assembly-plugin_MASSEMBLY-921@2/linux-jdk13-m3.6.x_build/target/it/projects/reproducible/target/repo/org/apache/maven/its/reproducible/1.0/reproducible-1.0-src.tar.sha1
[INFO]
[INFO] --- maven-checkstyle-plugin:3.0.0:check (checkstyle-check) @ maven-assembly-plugin ---
[INFO] There are 3 errors reported by Checkstyle 6.18 with config/maven_checks.xml ruleset.
[INFO] Ignored 3 errors, 0 violation remaining.
[INFO]
[INFO] --- maven-invoker-plugin:3.1.0:verify (integration-test) @ maven-assembly-plugin ---
[INFO] -------------------------------------------------
[INFO] Build Summary:
[INFO]   Passed: 1, Failed: 1, Errors: 0, Skipped: 0
[INFO] -------------------------------------------------
[ERROR] The following builds failed:
[ERROR] *  projects/reproducible/pom.xml
[INFO] -------------------------------------------------
[INFO] ------------------------------------------------------------------------
[INFO] BUILD FAILURE
[INFO] ------------------------------------------------------------------------
[INFO] Total time:  05:47 min
[INFO] Finished at: 2019-09-14T18:26:45Z
[INFO] ------------------------------------------------------------------------
[INFO] [jenkins-event-spy] Generated /home/jenkins/jenkins-slave/workspace/en-assembly-plugin_MASSEMBLY-921@2@tmp/withMaven80a9ee6a/maven-spy-20190914-182055-4596952629150772300104.log
[ERROR] Failed to execute goal org.apache.maven.plugins:maven-invoker-plugin:3.1.0:verify (integration-test) on project maven-assembly-plugin: 1 build failed. See console output above for details. -> [Help 1]
org.apache.maven.lifecycle.LifecycleExecutionException: Failed to execute goal org.apache.maven.plugins:maven-invoker-plugin:3.1.0:verify (integration-test) on project maven-assembly-plugin: 1 build failed. See console output above for details.
    at org.apache.maven.lifecycle.internal.MojoExecutor.execute (MojoExecutor.java:215)
    at org.apache.maven.lifecycle.internal.MojoExecutor.execute (MojoExecutor.java:156)
    at org.apache.maven.lifecycle.internal.MojoExecutor.execute (MojoExecutor.java:148)
    at org.apache.maven.lifecycle.internal.LifecycleModuleBuilder.buildProject (LifecycleModuleBuilder.java:117)
    at org.apache.maven.lifecycle.internal.LifecycleModuleBuilder.buildProject (LifecycleModuleBuilder.java:81)
    at org.apache.maven.lifecycle.internal.builder.singlethreaded.SingleThreadedBuilder.build (SingleThreadedBuilder.java:56)
    at org.apache.maven.lifecycle.internal.LifecycleStarter.execute (LifecycleStarter.java:128)
    at org.apache.maven.DefaultMaven.doExecute (DefaultMaven.java:305)
    at org.apache.maven.DefaultMaven.doExecute (DefaultMaven.java:192)
    at org.apache.maven.DefaultMaven.execute (DefaultMaven.java:105)
    at org.apache.maven.cli.MavenCli.execute (MavenCli.java:956)
    at org.apache.maven.cli.MavenCli.doMain (MavenCli.java:288)
    at org.apache.maven.cli.MavenCli.main (MavenCli.java:192)
    at jdk.internal.reflect.NativeMethodAccessorImpl.invoke0 (Native Method)
    at jdk.internal.reflect.NativeMethodAccessorImpl.invoke (NativeMethodAccessorImpl.java:62)
    at jdk.internal.reflect.DelegatingMethodAccessorImpl.invoke (DelegatingMethodAccessorImpl.java:43)
    at java.lang.reflect.Method.invoke (Method.java:567)
    at org.codehaus.plexus.classworlds.launcher.Launcher.launchEnhanced (Launcher.java:289)
    at org.codehaus.plexus.classworlds.launcher.Launcher.launch (Launcher.java:229)
    at org.codehaus.plexus.classworlds.launcher.Launcher.mainWithExitCode (Launcher.java:415)
    at org.codehaus.plexus.classworlds.launcher.Launcher.main (Launcher.java:356)
Caused by: org.apache.maven.plugin.MojoFailureException: 1 build failed. See console output above for details.
    at org.apache.maven.plugins.invoker.InvokerSession.handleFailures (InvokerSession.java:260)
    at org.apache.maven.plugins.invoker.VerifyMojo.execute (VerifyMojo.java:137)
    at org.apache.maven.plugin.DefaultBuildPluginManager.executeMojo (DefaultBuildPluginManager.java:137)
    at org.apache.maven.lifecycle.internal.MojoExecutor.execute (MojoExecutor.java:210)
    at org.apache.maven.lifecycle.internal.MojoExecutor.execute (MojoExecutor.java:156)
    at org.apache.maven.lifecycle.internal.MojoExecutor.execute (MojoExecutor.java:148)
    at org.apache.maven.lifecycle.internal.LifecycleModuleBuilder.buildProject (LifecycleModuleBuilder.java:117)
    at org.apache.maven.lifecycle.internal.LifecycleModuleBuilder.buildProject (LifecycleModuleBuilder.java:81)
    at org.apache.maven.lifecycle.internal.builder.singlethreaded.SingleThreadedBuilder.build (SingleThreadedBuilder.java:56)
    at org.apache.maven.lifecycle.internal.LifecycleStarter.execute (LifecycleStarter.java:128)
    at org.apache.maven.DefaultMaven.doExecute (DefaultMaven.java:305)
    at org.apache.maven.DefaultMaven.doExecute (DefaultMaven.java:192)
    at org.apache.maven.DefaultMaven.execute (DefaultMaven.java:105)
    at org.apache.maven.cli.MavenCli.execute (MavenCli.java:956)
    at org.apache.maven.cli.MavenCli.doMain (MavenCli.java:288)
    at org.apache.maven.cli.MavenCli.main (MavenCli.java:192)
    at jdk.internal.reflect.NativeMethodAccessorImpl.invoke0 (Native Method)
    at jdk.internal.reflect.NativeMethodAccessorImpl.invoke (NativeMethodAccessorImpl.java:62)
    at jdk.internal.reflect.DelegatingMethodAccessorImpl.invoke (DelegatingMethodAccessorImpl.java:43)
    at java.lang.reflect.Method.invoke (Method.java:567)
    at org.codehaus.plexus.classworlds.launcher.Launcher.launchEnhanced (Launcher.java:289)
    at org.codehaus.plexus.classworlds.launcher.Launcher.launch (Launcher.java:229)
    at org.codehaus.plexus.classworlds.launcher.Launcher.mainWithExitCode (Launcher.java:415)
    at org.codehaus.plexus.classworlds.launcher.Launcher.main (Launcher.java:356)
[ERROR]
[ERROR] Re-run Maven using the -X switch to enable full debug logging.
[ERROR]
[ERROR] For more information about the errors and possible solutions, please read the following articles:
[ERROR] [Help 1] http://cwiki.apache.org/confluence/display/MAVEN/MojoFailureException
[Pipeline] }
[Pipeline] // dir
[Pipeline] }
[Fast Archiver] No prior successful build to compare, so performing full copy of artifacts
[withMaven] junitPublisher - Archive test results for Maven artifact org.apache.maven.plugins:maven-assembly-plugin:maven-plugin:3.2.0-SNAPSHOT generated by maven-surefire-plugin:test (default-test): linux-jdk13-m3.6.x_build/target/surefire-reports/*.xml
Recording test results
[withMaven] openTasksPublisher - Scan Tasks for Maven artifact org.apache.maven.plugins:maven-assembly-plugin:maven-plugin:3.2.0-SNAPSHOT in source directory linux-jdk13-m3.6.x_build/src/main/java
[TASKS] Scanning folder '/home/jenkins/jenkins-slave/workspace/en-assembly-plugin_MASSEMBLY-921@2' for files matching the pattern 'linux-jdk13-m3.6.x_build/src/main/java/**/*' - excludes: null
[TASKS] Found 71 files to scan for tasks
[TASKS] Found 14 open tasks.
Skipping warnings blame since pipelines do not have an SCM link.%n
[withMaven] invokerPublisher - Archive invoker results for Maven artifact MavenArtifact{org.apache.maven.plugins:maven-assembly-plugin:maven-plugin:3.2.0-SNAPSHOT(version: 3.2.0-SNAPSHOT, snapshot:false) } generated by PluginInvocation{org.apache.maven.plugins:maven-invoker-plugin:3.1.0@integration-test  integration-test}: linux-jdk13-m3.6.x_build/target/invoker-reports/*.xml
[withMaven] Publishers: Generated Artifacts Publisher: 162 ms, Junit Publisher: 16198 ms, Open Task Scanner Publisher: 1990 ms, Dependencies Fingerprint Publisher: 1249 ms, Invoker Publisher: 2832 ms, Pipeline Graph Publisher: 2 ms
[Pipeline] // withMaven
[Pipeline] cleanWs
[WS-CLEANUP] Deleting project workspace...
[WS-CLEANUP] Deferred wipeout is used...
[WS-CLEANUP] done
[Pipeline] cleanWs
[WS-CLEANUP] Deleting project workspace...
[WS-CLEANUP] Deferred wipeout is used...
[WS-CLEANUP] done
[Pipeline] }
[Pipeline] // stage
[Pipeline] }
[Pipeline] // ws
[Pipeline] }
[Pipeline] // node
[Pipeline] }
Failed in branch linux-jdk13-m3.6.x_build
[Pipeline] // parallel
[Pipeline] stage
[Pipeline] { (Notifications)
[Pipeline] echo
Build result: FAILURE
[Pipeline] jiraIssueSelector
[Pipeline] echo
The authors of changes [hboutemy].
[Pipeline] echo
Sending email ...
[Pipeline] emailext
Reply | Threaded
Open this post in threaded view
|

Build failed in Jenkins: Maven TLP » maven-assembly-plugin » MASSEMBLY-921 #3

Apache Jenkins Server-2
See https://builds.apache.org/job/maven-box/job/maven-assembly-plugin/job/MASSEMBLY-921/3/

Changes:

* ensure line ending to try to get reproducible content on Win
* ensure line ending to try to get reproducible content on Win
* ensure line ending to try to get reproducible content on Win
* ensure line ending to try to get reproducible content on Win
* ensure line ending to try to get reproducible content on Win
* ensure line ending to try to get reproducible content on Win
* ensure line ending to try to get reproducible content on Win
* ensure line ending to try to get reproducible content on Win
* ensure line ending to try to get reproducible content on Win
* ensure line ending to try to get reproducible content on Win
* ensure line ending to try to get reproducible content on Win
* ensure line ending to try to get reproducible content on Win
* ensure line ending to try to get reproducible content on Win
* ensure line ending to try to get reproducible content on Win
* ensure line ending to try to get reproducible content on Win
* ensure line ending to try to get reproducible content on Win

All tests passed

Build log:
[...truncated 6301 lines...]
[INFO] skip non existing resourceDirectory /home/jenkins/jenkins-slave/workspace/en-assembly-plugin_MASSEMBLY-921@2/linux-jdk13-m3.6.x_build/target/generated-resources/plexus
[INFO] Copying 3 resources
[INFO]
[INFO] --- maven-compiler-plugin:3.7.0:compile (default-compile) @ maven-assembly-plugin ---
[INFO] Changes detected - recompiling the module!
[INFO] Compiling 88 source files to /home/jenkins/jenkins-slave/workspace/en-assembly-plugin_MASSEMBLY-921@2/linux-jdk13-m3.6.x_build/target/classes
[INFO] /home/jenkins/jenkins-slave/workspace/en-assembly-plugin_MASSEMBLY-921@2/linux-jdk13-m3.6.x_build/src/main/java/org/apache/maven/plugins/assembly/archive/DefaultAssemblyArchiver.java: Some input files use or override a deprecated API.
[INFO] /home/jenkins/jenkins-slave/workspace/en-assembly-plugin_MASSEMBLY-921@2/linux-jdk13-m3.6.x_build/src/main/java/org/apache/maven/plugins/assembly/archive/DefaultAssemblyArchiver.java: Recompile with -Xlint:deprecation for details.
[INFO] /home/jenkins/jenkins-slave/workspace/en-assembly-plugin_MASSEMBLY-921@2/linux-jdk13-m3.6.x_build/target/generated-sources/modello/org/apache/maven/plugins/assembly/model/io/xpp3/AssemblyXpp3Reader.java: Some input files use unchecked or unsafe operations.
[INFO] /home/jenkins/jenkins-slave/workspace/en-assembly-plugin_MASSEMBLY-921@2/linux-jdk13-m3.6.x_build/target/generated-sources/modello/org/apache/maven/plugins/assembly/model/io/xpp3/AssemblyXpp3Reader.java: Recompile with -Xlint:unchecked for details.
[INFO]
[INFO] --- maven-plugin-plugin:3.5.2:descriptor (default-descriptor) @ maven-assembly-plugin ---
[INFO] Using 'UTF-8' encoding to read mojo source files.
[INFO] java-javadoc mojo extractor found 0 mojo descriptor.
[INFO] java-annotations mojo extractor found 2 mojo descriptors.
[INFO]
[INFO] --- plexus-component-metadata:1.7.1:generate-metadata (descriptors) @ maven-assembly-plugin ---
[INFO] Discovered 13 component descriptors(s)
[INFO]
[INFO] --- maven-resources-plugin:3.1.0:testResources (default-testResources) @ maven-assembly-plugin ---
[INFO] Using 'UTF-8' encoding to copy filtered resources.
[INFO] Copying 1 resource
[INFO] Copying 3 resources
[INFO]
[INFO] --- maven-compiler-plugin:3.7.0:testCompile (default-testCompile) @ maven-assembly-plugin ---
[INFO] Changes detected - recompiling the module!
[INFO] Compiling 34 source files to /home/jenkins/jenkins-slave/workspace/en-assembly-plugin_MASSEMBLY-921@2/linux-jdk13-m3.6.x_build/target/test-classes
[INFO] /home/jenkins/jenkins-slave/workspace/en-assembly-plugin_MASSEMBLY-921@2/linux-jdk13-m3.6.x_build/src/test/java/org/apache/maven/plugins/assembly/archive/task/testutils/MockAndControlForAddFileSetsTask.java: Some input files use or override a deprecated API.
[INFO] /home/jenkins/jenkins-slave/workspace/en-assembly-plugin_MASSEMBLY-921@2/linux-jdk13-m3.6.x_build/src/test/java/org/apache/maven/plugins/assembly/archive/task/testutils/MockAndControlForAddFileSetsTask.java: Recompile with -Xlint:deprecation for details.
[INFO] /home/jenkins/jenkins-slave/workspace/en-assembly-plugin_MASSEMBLY-921@2/linux-jdk13-m3.6.x_build/src/test/java/org/apache/maven/plugins/assembly/archive/task/testutils/MockAndControlForAddArtifactTask.java: Some input files use unchecked or unsafe operations.
[INFO] /home/jenkins/jenkins-slave/workspace/en-assembly-plugin_MASSEMBLY-921@2/linux-jdk13-m3.6.x_build/src/test/java/org/apache/maven/plugins/assembly/archive/task/testutils/MockAndControlForAddArtifactTask.java: Recompile with -Xlint:unchecked for details.
[INFO]
[INFO] --- plexus-component-metadata:1.7.1:generate-test-metadata (descriptors) @ maven-assembly-plugin ---
[INFO]
[INFO] --- maven-surefire-plugin:2.22.0:test (default-test) @ maven-assembly-plugin ---
[INFO] Surefire report directory: /home/jenkins/jenkins-slave/workspace/en-assembly-plugin_MASSEMBLY-921@2/linux-jdk13-m3.6.x_build/target/surefire-reports
[INFO]
[INFO] -------------------------------------------------------
[INFO]  T E S T S
[INFO] -------------------------------------------------------
[INFO] Running org.apache.maven.plugins.assembly.interpolation.AssemblyExpressionEvaluatorTest
[INFO] Tests run: 5, Failures: 0, Errors: 0, Skipped: 0, Time elapsed: 0.473 s - in org.apache.maven.plugins.assembly.interpolation.AssemblyExpressionEvaluatorTest
[INFO] Running org.apache.maven.plugins.assembly.interpolation.AssemblyInterpolatorTest
[INFO] Tests run: 7, Failures: 0, Errors: 0, Skipped: 0, Time elapsed: 0.025 s - in org.apache.maven.plugins.assembly.interpolation.AssemblyInterpolatorTest
[INFO] Running org.apache.maven.plugins.assembly.filter.ComponentsXmlArchiverFileFilterTest
[INFO] Tests run: 7, Failures: 0, Errors: 0, Skipped: 0, Time elapsed: 0.56 s - in org.apache.maven.plugins.assembly.filter.ComponentsXmlArchiverFileFilterTest
[INFO] Running org.apache.maven.plugins.assembly.archive.task.AddFileSetsTaskTest
[INFO] Tests run: 9, Failures: 0, Errors: 0, Skipped: 0, Time elapsed: 0.359 s - in org.apache.maven.plugins.assembly.archive.task.AddFileSetsTaskTest
[INFO] Running org.apache.maven.plugins.assembly.archive.task.AddDirectoryTaskTest
[INFO] Tests run: 4, Failures: 0, Errors: 0, Skipped: 0, Time elapsed: 0.055 s - in org.apache.maven.plugins.assembly.archive.task.AddDirectoryTaskTest
[INFO] Running org.apache.maven.plugins.assembly.archive.task.AddDependencySetsTaskTest
[INFO] Tests run: 8, Failures: 0, Errors: 0, Skipped: 0, Time elapsed: 0.169 s - in org.apache.maven.plugins.assembly.archive.task.AddDependencySetsTaskTest
[INFO] Running org.apache.maven.plugins.assembly.archive.task.AddArtifactTaskTest
[INFO] Tests run: 5, Failures: 0, Errors: 0, Skipped: 0, Time elapsed: 0.013 s - in org.apache.maven.plugins.assembly.archive.task.AddArtifactTaskTest
[INFO] Running org.apache.maven.plugins.assembly.archive.archiver.AssemblyProxyArchiverTest
[INFO] Tests run: 4, Failures: 0, Errors: 0, Skipped: 0, Time elapsed: 0.229 s - in org.apache.maven.plugins.assembly.archive.archiver.AssemblyProxyArchiverTest
[INFO] Running org.apache.maven.plugins.assembly.archive.DefaultAssemblyArchiverTest
[INFO] Tests run: 15, Failures: 0, Errors: 0, Skipped: 0, Time elapsed: 2.776 s - in org.apache.maven.plugins.assembly.archive.DefaultAssemblyArchiverTest
[INFO] Running org.apache.maven.plugins.assembly.archive.phase.FileSetAssemblyPhaseTest
[INFO] Tests run: 2, Failures: 0, Errors: 0, Skipped: 0, Time elapsed: 0.046 s - in org.apache.maven.plugins.assembly.archive.phase.FileSetAssemblyPhaseTest
[INFO] Running org.apache.maven.plugins.assembly.archive.phase.AssemblyArchiverPhaseComparatorTest
[INFO] Tests run: 1, Failures: 0, Errors: 0, Skipped: 0, Time elapsed: 0.001 s - in org.apache.maven.plugins.assembly.archive.phase.AssemblyArchiverPhaseComparatorTest
[INFO] Running org.apache.maven.plugins.assembly.archive.phase.ModuleSetAssemblyPhaseTest
[INFO] Tests run: 24, Failures: 0, Errors: 0, Skipped: 0, Time elapsed: 0.391 s - in org.apache.maven.plugins.assembly.archive.phase.ModuleSetAssemblyPhaseTest
[INFO] Running org.apache.maven.plugins.assembly.archive.phase.FileItemAssemblyPhaseTest
[INFO] Tests run: 6, Failures: 0, Errors: 0, Skipped: 0, Time elapsed: 0.149 s - in org.apache.maven.plugins.assembly.archive.phase.FileItemAssemblyPhaseTest
[INFO] Running org.apache.maven.plugins.assembly.archive.phase.DependencySetAssemblyPhaseTest
[INFO] Tests run: 2, Failures: 0, Errors: 0, Skipped: 0, Time elapsed: 0.052 s - in org.apache.maven.plugins.assembly.archive.phase.DependencySetAssemblyPhaseTest
[INFO] Running org.apache.maven.plugins.assembly.archive.phase.RepositoryAssemblyPhaseTest
[INFO] Tests run: 2, Failures: 0, Errors: 0, Skipped: 0, Time elapsed: 0.058 s - in org.apache.maven.plugins.assembly.archive.phase.RepositoryAssemblyPhaseTest
[INFO] Running org.apache.maven.plugins.assembly.archive.ManifestCreationFinalizerTest
[INFO] Tests run: 4, Failures: 0, Errors: 0, Skipped: 0, Time elapsed: 0.091 s - in org.apache.maven.plugins.assembly.archive.ManifestCreationFinalizerTest
[INFO] Running org.apache.maven.plugins.assembly.artifact.ResolutionManagementInfoTest
[INFO] Tests run: 3, Failures: 0, Errors: 0, Skipped: 0, Time elapsed: 0.034 s - in org.apache.maven.plugins.assembly.artifact.ResolutionManagementInfoTest
[INFO] Running org.apache.maven.plugins.assembly.artifact.DefaultDependencyResolverTest
[INFO] Tests run: 4, Failures: 0, Errors: 0, Skipped: 0, Time elapsed: 0.759 s - in org.apache.maven.plugins.assembly.artifact.DefaultDependencyResolverTest
[INFO] Running org.apache.maven.plugins.assembly.io.PrefixedClasspathLocatorStrategyTest
[INFO] Tests run: 4, Failures: 0, Errors: 0, Skipped: 0, Time elapsed: 0.013 s - in org.apache.maven.plugins.assembly.io.PrefixedClasspathLocatorStrategyTest
[INFO] Running org.apache.maven.plugins.assembly.io.DefaultAssemblyReaderTest
[INFO] Tests run: 22, Failures: 0, Errors: 0, Skipped: 0, Time elapsed: 0.379 s - in org.apache.maven.plugins.assembly.io.DefaultAssemblyReaderTest
[INFO] Running org.apache.maven.plugins.assembly.utils.LineEndingsUtilsTest
[INFO] Tests run: 24, Failures: 0, Errors: 0, Skipped: 0, Time elapsed: 0.028 s - in org.apache.maven.plugins.assembly.utils.LineEndingsUtilsTest
[INFO] Running org.apache.maven.plugins.assembly.utils.LinuxLineFeedInputStreamTest
[INFO] Tests run: 7, Failures: 0, Errors: 0, Skipped: 0, Time elapsed: 0.008 s - in org.apache.maven.plugins.assembly.utils.LinuxLineFeedInputStreamTest
[INFO] Running org.apache.maven.plugins.assembly.utils.AssemblyFormatUtilsTest
[INFO] Tests run: 69, Failures: 0, Errors: 0, Skipped: 0, Time elapsed: 0.031 s - in org.apache.maven.plugins.assembly.utils.AssemblyFormatUtilsTest
[INFO] Running org.apache.maven.plugins.assembly.utils.WindowsLineFeedInputStreamTest
[INFO] Tests run: 7, Failures: 0, Errors: 0, Skipped: 0, Time elapsed: 0.001 s - in org.apache.maven.plugins.assembly.utils.WindowsLineFeedInputStreamTest
[INFO] Running org.apache.maven.plugins.assembly.utils.FilterUtilsTest
[INFO] Tests run: 13, Failures: 0, Errors: 0, Skipped: 0, Time elapsed: 0.014 s - in org.apache.maven.plugins.assembly.utils.FilterUtilsTest
[INFO] Running org.apache.maven.plugins.assembly.utils.ProjectUtilsTest
[INFO] Tests run: 5, Failures: 0, Errors: 0, Skipped: 0, Time elapsed: 0.005 s - in org.apache.maven.plugins.assembly.utils.ProjectUtilsTest
[INFO] Running org.apache.maven.plugins.assembly.utils.TypeConversionUtilsTest
[INFO] Tests run: 6, Failures: 0, Errors: 0, Skipped: 0, Time elapsed: 0.001 s - in org.apache.maven.plugins.assembly.utils.TypeConversionUtilsTest
[INFO] Running org.apache.maven.plugins.assembly.format.ReaderFormatterTest
[INFO] Tests run: 3, Failures: 0, Errors: 0, Skipped: 0, Time elapsed: 0 s - in org.apache.maven.plugins.assembly.format.ReaderFormatterTest
[INFO]
[INFO] Results:
[INFO]
[INFO] Tests run: 272, Failures: 0, Errors: 0, Skipped: 0
[INFO]
[INFO]
[INFO] --- maven-jar-plugin:3.1.0:jar (default-jar) @ maven-assembly-plugin ---
[INFO] Building jar: /home/jenkins/jenkins-slave/workspace/en-assembly-plugin_MASSEMBLY-921@2/linux-jdk13-m3.6.x_build/target/maven-assembly-plugin-3.2.0-SNAPSHOT.jar
[INFO]
[INFO] --- maven-plugin-plugin:3.5.2:addPluginArtifactMetadata (default-addPluginArtifactMetadata) @ maven-assembly-plugin ---
[INFO]
[INFO] --- maven-site-plugin:3.7.1:attach-descriptor (attach-descriptor) @ maven-assembly-plugin ---
[INFO] Skipping because packaging 'maven-plugin' is not pom.
[INFO]
[INFO] --- maven-invoker-plugin:3.1.0:install (integration-test) @ maven-assembly-plugin ---
[INFO] Downloading from central: https://repo.maven.apache.org/maven2/commons-io/commons-io/2.6/commons-io-2.6.jar
[INFO] Downloaded from central: https://repo.maven.apache.org/maven2/commons-io/commons-io/2.6/commons-io-2.6.jar (215 kB at 4.5 MB/s)
[INFO] Installing /home/jenkins/jenkins-slave/workspace/en-assembly-plugin_MASSEMBLY-921@2/linux-jdk13-m3.6.x_build/pom.xml to /home/jenkins/jenkins-slave/workspace/en-assembly-plugin_MASSEMBLY-921@2/linux-jdk13-m3.6.x_build/target/local-repo/org/apache/maven/plugins/maven-assembly-plugin/3.2.0-SNAPSHOT/maven-assembly-plugin-3.2.0-SNAPSHOT.pom
[INFO] Installing /home/jenkins/jenkins-slave/workspace/en-assembly-plugin_MASSEMBLY-921@2/linux-jdk13-m3.6.x_build/target/maven-assembly-plugin-3.2.0-SNAPSHOT.jar to /home/jenkins/jenkins-slave/workspace/en-assembly-plugin_MASSEMBLY-921@2/linux-jdk13-m3.6.x_build/target/local-repo/org/apache/maven/plugins/maven-assembly-plugin/3.2.0-SNAPSHOT/maven-assembly-plugin-3.2.0-SNAPSHOT.jar
[INFO]
[INFO] --- maven-invoker-plugin:3.1.0:integration-test (integration-test) @ maven-assembly-plugin ---
[INFO] Running 1 setup job:
[INFO] Building: it-project-parent/pom.xml
[INFO]           it-project-parent/pom.xml ........................ SUCCESS (11.2 s)
[INFO] Setup done.
[INFO] Building: projects/reproducible/pom.xml
[INFO] run post-build script verify.groovy
WARNING: An illegal reflective access operation has occurred
WARNING: Illegal reflective access by org.codehaus.groovy.reflection.CachedClass (file:/home/jenkins/jenkins-slave/workspace/.maven_repositories/0/org/codehaus/groovy/groovy-all/2.4.8/groovy-all-2.4.8.jar) to method java.lang.Object.finalize()
WARNING: Please consider reporting this to the maintainers of org.codehaus.groovy.reflection.CachedClass
WARNING: Use --illegal-access=warn to enable warnings of further illegal reflective access operations
WARNING: All illegal access operations will be denied in a future release
[INFO]           projects/reproducible/pom.xml .................... FAILED (23.7 s)
[INFO]   The post-build script did not succeed. assert new File( deployDir, 'reproducible-1.0-src.zip.sha1' ).text == 'a21cc1205b51bc893d06966ec145b762efa74fe6'
       |         |                                            |    |
       |         |                                            |    false
       |         |                                            079d0af3f42cd8cd3faad6b49547298cf8a3eb39
       |         /home/jenkins/jenkins-slave/workspace/en-assembly-plugin_MASSEMBLY-921@2/linux-jdk13-m3.6.x_build/target/it/projects/reproducible/target/repo/org/apache/maven/its/reproducible/1.0
       /home/jenkins/jenkins-slave/workspace/en-assembly-plugin_MASSEMBLY-921@2/linux-jdk13-m3.6.x_build/target/it/projects/reproducible/target/repo/org/apache/maven/its/reproducible/1.0/reproducible-1.0-src.zip.sha1
[INFO]
[INFO] --- maven-checkstyle-plugin:3.0.0:check (checkstyle-check) @ maven-assembly-plugin ---
[INFO] There are 3 errors reported by Checkstyle 6.18 with config/maven_checks.xml ruleset.
[INFO] Ignored 3 errors, 0 violation remaining.
[INFO]
[INFO] --- maven-invoker-plugin:3.1.0:verify (integration-test) @ maven-assembly-plugin ---
[INFO] -------------------------------------------------
[INFO] Build Summary:
[INFO]   Passed: 1, Failed: 1, Errors: 0, Skipped: 0
[INFO] -------------------------------------------------
[ERROR] The following builds failed:
[ERROR] *  projects/reproducible/pom.xml
[INFO] -------------------------------------------------
[INFO] ------------------------------------------------------------------------
[INFO] BUILD FAILURE
[INFO] ------------------------------------------------------------------------
[INFO] Total time:  04:22 min
[INFO] Finished at: 2019-09-14T18:39:07Z
[INFO] ------------------------------------------------------------------------
[INFO] [jenkins-event-spy] Generated /home/jenkins/jenkins-slave/workspace/en-assembly-plugin_MASSEMBLY-921@2@tmp/withMaven70bc035e/maven-spy-20190914-183443-9552496857747142153824.log
[ERROR] Failed to execute goal org.apache.maven.plugins:maven-invoker-plugin:3.1.0:verify (integration-test) on project maven-assembly-plugin: 1 build failed. See console output above for details. -> [Help 1]
org.apache.maven.lifecycle.LifecycleExecutionException: Failed to execute goal org.apache.maven.plugins:maven-invoker-plugin:3.1.0:verify (integration-test) on project maven-assembly-plugin: 1 build failed. See console output above for details.
    at org.apache.maven.lifecycle.internal.MojoExecutor.execute (MojoExecutor.java:215)
    at org.apache.maven.lifecycle.internal.MojoExecutor.execute (MojoExecutor.java:156)
    at org.apache.maven.lifecycle.internal.MojoExecutor.execute (MojoExecutor.java:148)
    at org.apache.maven.lifecycle.internal.LifecycleModuleBuilder.buildProject (LifecycleModuleBuilder.java:117)
    at org.apache.maven.lifecycle.internal.LifecycleModuleBuilder.buildProject (LifecycleModuleBuilder.java:81)
    at org.apache.maven.lifecycle.internal.builder.singlethreaded.SingleThreadedBuilder.build (SingleThreadedBuilder.java:56)
    at org.apache.maven.lifecycle.internal.LifecycleStarter.execute (LifecycleStarter.java:128)
    at org.apache.maven.DefaultMaven.doExecute (DefaultMaven.java:305)
    at org.apache.maven.DefaultMaven.doExecute (DefaultMaven.java:192)
    at org.apache.maven.DefaultMaven.execute (DefaultMaven.java:105)
    at org.apache.maven.cli.MavenCli.execute (MavenCli.java:956)
    at org.apache.maven.cli.MavenCli.doMain (MavenCli.java:288)
    at org.apache.maven.cli.MavenCli.main (MavenCli.java:192)
    at jdk.internal.reflect.NativeMethodAccessorImpl.invoke0 (Native Method)
    at jdk.internal.reflect.NativeMethodAccessorImpl.invoke (NativeMethodAccessorImpl.java:62)
    at jdk.internal.reflect.DelegatingMethodAccessorImpl.invoke (DelegatingMethodAccessorImpl.java:43)
    at java.lang.reflect.Method.invoke (Method.java:567)
    at org.codehaus.plexus.classworlds.launcher.Launcher.launchEnhanced (Launcher.java:289)
    at org.codehaus.plexus.classworlds.launcher.Launcher.launch (Launcher.java:229)
    at org.codehaus.plexus.classworlds.launcher.Launcher.mainWithExitCode (Launcher.java:415)
    at org.codehaus.plexus.classworlds.launcher.Launcher.main (Launcher.java:356)
Caused by: org.apache.maven.plugin.MojoFailureException: 1 build failed. See console output above for details.
    at org.apache.maven.plugins.invoker.InvokerSession.handleFailures (InvokerSession.java:260)
    at org.apache.maven.plugins.invoker.VerifyMojo.execute (VerifyMojo.java:137)
    at org.apache.maven.plugin.DefaultBuildPluginManager.executeMojo (DefaultBuildPluginManager.java:137)
    at org.apache.maven.lifecycle.internal.MojoExecutor.execute (MojoExecutor.java:210)
    at org.apache.maven.lifecycle.internal.MojoExecutor.execute (MojoExecutor.java:156)
    at org.apache.maven.lifecycle.internal.MojoExecutor.execute (MojoExecutor.java:148)
    at org.apache.maven.lifecycle.internal.LifecycleModuleBuilder.buildProject (LifecycleModuleBuilder.java:117)
    at org.apache.maven.lifecycle.internal.LifecycleModuleBuilder.buildProject (LifecycleModuleBuilder.java:81)
    at org.apache.maven.lifecycle.internal.builder.singlethreaded.SingleThreadedBuilder.build (SingleThreadedBuilder.java:56)
    at org.apache.maven.lifecycle.internal.LifecycleStarter.execute (LifecycleStarter.java:128)
    at org.apache.maven.DefaultMaven.doExecute (DefaultMaven.java:305)
    at org.apache.maven.DefaultMaven.doExecute (DefaultMaven.java:192)
    at org.apache.maven.DefaultMaven.execute (DefaultMaven.java:105)
    at org.apache.maven.cli.MavenCli.execute (MavenCli.java:956)
    at org.apache.maven.cli.MavenCli.doMain (MavenCli.java:288)
    at org.apache.maven.cli.MavenCli.main (MavenCli.java:192)
    at jdk.internal.reflect.NativeMethodAccessorImpl.invoke0 (Native Method)
    at jdk.internal.reflect.NativeMethodAccessorImpl.invoke (NativeMethodAccessorImpl.java:62)
    at jdk.internal.reflect.DelegatingMethodAccessorImpl.invoke (DelegatingMethodAccessorImpl.java:43)
    at java.lang.reflect.Method.invoke (Method.java:567)
    at org.codehaus.plexus.classworlds.launcher.Launcher.launchEnhanced (Launcher.java:289)
    at org.codehaus.plexus.classworlds.launcher.Launcher.launch (Launcher.java:229)
    at org.codehaus.plexus.classworlds.launcher.Launcher.mainWithExitCode (Launcher.java:415)
    at org.codehaus.plexus.classworlds.launcher.Launcher.main (Launcher.java:356)
[ERROR]
[ERROR] Re-run Maven using the -X switch to enable full debug logging.
[ERROR]
[ERROR] For more information about the errors and possible solutions, please read the following articles:
[ERROR] [Help 1] http://cwiki.apache.org/confluence/display/MAVEN/MojoFailureException
[Pipeline] }
[Pipeline] // dir
[Pipeline] }
[Fast Archiver] No prior successful build to compare, so performing full copy of artifacts
[withMaven] junitPublisher - Archive test results for Maven artifact org.apache.maven.plugins:maven-assembly-plugin:maven-plugin:3.2.0-SNAPSHOT generated by maven-surefire-plugin:test (default-test): linux-jdk13-m3.6.x_build/target/surefire-reports/*.xml
Recording test results
[withMaven] openTasksPublisher - Scan Tasks for Maven artifact org.apache.maven.plugins:maven-assembly-plugin:maven-plugin:3.2.0-SNAPSHOT in source directory linux-jdk13-m3.6.x_build/src/main/java
[TASKS] Scanning folder '/home/jenkins/jenkins-slave/workspace/en-assembly-plugin_MASSEMBLY-921@2' for files matching the pattern 'linux-jdk13-m3.6.x_build/src/main/java/**/*' - excludes: null
[TASKS] Found 71 files to scan for tasks
[TASKS] Found 14 open tasks.
Skipping warnings blame since pipelines do not have an SCM link.%n
[withMaven] invokerPublisher - Archive invoker results for Maven artifact MavenArtifact{org.apache.maven.plugins:maven-assembly-plugin:maven-plugin:3.2.0-SNAPSHOT(version: 3.2.0-SNAPSHOT, snapshot:false) } generated by PluginInvocation{org.apache.maven.plugins:maven-invoker-plugin:3.1.0@integration-test  integration-test}: linux-jdk13-m3.6.x_build/target/invoker-reports/*.xml
[withMaven] Publishers: Generated Artifacts Publisher: 158 ms, Junit Publisher: 15417 ms, Open Task Scanner Publisher: 1840 ms, Dependencies Fingerprint Publisher: 1244 ms, Invoker Publisher: 2392 ms, Pipeline Graph Publisher: 2 ms
[Pipeline] // withMaven
[Pipeline] cleanWs
[WS-CLEANUP] Deleting project workspace...
[WS-CLEANUP] Deferred wipeout is used...
[WS-CLEANUP] done
[Pipeline] cleanWs
[WS-CLEANUP] Deleting project workspace...
[WS-CLEANUP] Deferred wipeout is used...
[WS-CLEANUP] done
[Pipeline] }
[Pipeline] // stage
[Pipeline] }
[Pipeline] // ws
[Pipeline] }
[Pipeline] // node
[Pipeline] }
Failed in branch linux-jdk13-m3.6.x_build
[Pipeline] // parallel
[Pipeline] stage
[Pipeline] { (Notifications)
[Pipeline] echo
Build result: FAILURE
[Pipeline] jiraIssueSelector
[Pipeline] echo
The authors of changes [hboutemy].
[Pipeline] echo
Sending email ...
[Pipeline] emailext
Reply | Threaded
Open this post in threaded view
|

Build failed in Jenkins: Maven TLP » maven-assembly-plugin » MASSEMBLY-921 #4

Apache Jenkins Server-2
See https://builds.apache.org/job/maven-box/job/maven-assembly-plugin/job/MASSEMBLY-921/4/

Changes:

* forgot to update sha1 after modifying a file
* forgot to update sha1 after modifying a file
* forgot to update sha1 after modifying a file
* forgot to update sha1 after modifying a file
* forgot to update sha1 after modifying a file
* forgot to update sha1 after modifying a file
* forgot to update sha1 after modifying a file
* forgot to update sha1 after modifying a file
* forgot to update sha1 after modifying a file
* forgot to update sha1 after modifying a file
* forgot to update sha1 after modifying a file
* forgot to update sha1 after modifying a file
* forgot to update sha1 after modifying a file
* forgot to update sha1 after modifying a file
* forgot to update sha1 after modifying a file
* forgot to update sha1 after modifying a file

All tests passed

Build log:
[...truncated 6450 lines...]
[TASKS] Found 14 open tasks.
Skipping warnings blame since pipelines do not have an SCM link.%n
[withMaven] invokerPublisher - Archive invoker results for Maven artifact MavenArtifact{org.apache.maven.plugins:maven-assembly-plugin:maven-plugin:3.2.0-SNAPSHOT(version: 3.2.0-SNAPSHOT, snapshot:false) } generated by PluginInvocation{org.apache.maven.plugins:maven-invoker-plugin:3.1.0@integration-test  integration-test}: windows-jdk11-m3.6.x_build\target\invoker-reports\*.xml
[withMaven] openTasksPublisher - Scan Tasks for Maven artifact org.apache.maven.plugins:maven-assembly-plugin:maven-plugin:3.2.0-SNAPSHOT in source directory windows-jdk13-m3.6.x_build\src\main\java
[TASKS] Scanning folder 'f:\jenkins\jenkins-slave\workspace\en-assembly-plugin_MASSEMBLY-921@2@2' for files matching the pattern 'windows-jdk13-m3.6.x_build\src\main\java\**\*' - excludes: null
[TASKS] Found 71 files to scan for tasks
[TASKS] Found 14 open tasks.
Skipping warnings blame since pipelines do not have an SCM link.%n
[withMaven] invokerPublisher - Archive invoker results for Maven artifact MavenArtifact{org.apache.maven.plugins:maven-assembly-plugin:maven-plugin:3.2.0-SNAPSHOT(version: 3.2.0-SNAPSHOT, snapshot:false) } generated by PluginInvocation{org.apache.maven.plugins:maven-invoker-plugin:3.1.0@integration-test  integration-test}: windows-jdk13-m3.6.x_build\target\invoker-reports\*.xml
[withMaven] openTasksPublisher - Scan Tasks for Maven artifact org.apache.maven.plugins:maven-assembly-plugin:maven-plugin:3.2.0-SNAPSHOT in source directory windows-jdk7-m3.3.x_build\src\main\java
[withMaven] invokerPublisher - Archive invoker results for Maven artifact MavenArtifact{org.apache.maven.plugins:maven-assembly-plugin:maven-plugin:3.2.0-SNAPSHOT(version: 3.2.0-SNAPSHOT, snapshot:false) } generated by PluginInvocation{org.apache.maven.plugins:maven-invoker-plugin:3.1.0@integration-test  integration-test}: linux-jdk7-m3.6.x_build/target/invoker-reports/*.xml
[TASKS] Scanning folder 'f:\jenkins\jenkins-slave\workspace\en-assembly-plugin_MASSEMBLY-921@2@2' for files matching the pattern 'windows-jdk7-m3.3.x_build\src\main\java\**\*' - excludes: null
[TASKS] Found 71 files to scan for tasks
[TASKS] Found 14 open tasks.
Skipping warnings blame since pipelines do not have an SCM link.%n
[withMaven] invokerPublisher - Archive invoker results for Maven artifact MavenArtifact{org.apache.maven.plugins:maven-assembly-plugin:maven-plugin:3.2.0-SNAPSHOT(version: 3.2.0-SNAPSHOT, snapshot:false) } generated by PluginInvocation{org.apache.maven.plugins:maven-invoker-plugin:3.1.0@integration-test  integration-test}: windows-jdk7-m3.3.x_build\target\invoker-reports\*.xml
[Pipeline] // ws
[withMaven] Publishers: Generated Artifacts Publisher: 7 ms, Junit Publisher: 18046 ms, Open Task Scanner Publisher: 177 ms, Dependencies Fingerprint Publisher: 61 ms, Invoker Publisher: 1388 ms, Pipeline Graph Publisher: 17 ms
[withMaven] openTasksPublisher - Scan Tasks for Maven artifact org.apache.maven.plugins:maven-assembly-plugin:maven-plugin:3.2.0-SNAPSHOT in source directory windows-jdk12-m3.6.x_build\src\main\java
[withMaven] Publishers: Generated Artifacts Publisher: 10 ms, Junit Publisher: 16670 ms, Open Task Scanner Publisher: 173 ms, Dependencies Fingerprint Publisher: 59 ms, Invoker Publisher: 2777 ms, Pipeline Graph Publisher: 1 ms
[withMaven] Publishers: Generated Artifacts Publisher: 11 ms, Junit Publisher: 17348 ms, Open Task Scanner Publisher: 174 ms, Dependencies Fingerprint Publisher: 58 ms, Invoker Publisher: 2088 ms, Pipeline Graph Publisher: 17 ms
[withMaven] Publishers: Generated Artifacts Publisher: 10 ms, Junit Publisher: 18744 ms, Open Task Scanner Publisher: 161 ms, Dependencies Fingerprint Publisher: 58 ms, Invoker Publisher: 759 ms, Pipeline Graph Publisher: 1 ms
[withMaven] Publishers: Generated Artifacts Publisher: 16 ms, Junit Publisher: 15800 ms, Open Task Scanner Publisher: 167 ms, Dependencies Fingerprint Publisher: 55 ms, Invoker Publisher: 3657 ms, Pipeline Graph Publisher: 1 ms
[Pipeline] // ws
[Pipeline] // ws
[TASKS] Scanning folder 'f:\jenkins\jenkins-slave\workspace\en-assembly-plugin_MASSEMBLY-921@3' for files matching the pattern 'windows-jdk12-m3.6.x_build\src\main\java\**\*' - excludes: null
[TASKS] Found 71 files to scan for tasks
[TASKS] Found 14 open tasks.
Skipping warnings blame since pipelines do not have an SCM link.%n
[Pipeline] }
[Pipeline] }
[Pipeline] }
[Pipeline] // withMaven
[Pipeline] // withMaven
[Pipeline] // withMaven
[Pipeline] }
[Pipeline] }
[Pipeline] }
[Pipeline] // withMaven
[Pipeline] // withMaven
[withMaven] invokerPublisher - Archive invoker results for Maven artifact MavenArtifact{org.apache.maven.plugins:maven-assembly-plugin:maven-plugin:3.2.0-SNAPSHOT(version: 3.2.0-SNAPSHOT, snapshot:false) } generated by PluginInvocation{org.apache.maven.plugins:maven-invoker-plugin:3.1.0@integration-test  integration-test}: windows-jdk12-m3.6.x_build\target\invoker-reports\*.xml
[Pipeline] cleanWs
[Pipeline] cleanWs
[Pipeline] cleanWs
[Pipeline] // withMaven
[Pipeline] // withMaven
[Pipeline] // withMaven
[Pipeline] cleanWs
[WS-CLEANUP] Deleting project workspace...
[WS-CLEANUP] Deferred wipeout is used...
[Pipeline] cleanWs
[WS-CLEANUP] Deleting project workspace...
[WS-CLEANUP] Deferred wipeout is used...
[Pipeline] // node
[WS-CLEANUP] done
[Pipeline] // node
[WS-CLEANUP] done
[Pipeline] // node
[Pipeline] }
Failed in branch linux-jdk7-m3.3.x_build
[Pipeline] }
Failed in branch linux-jdk11-m3.6.x_build
[Pipeline] }
Failed in branch linux-jdk12-m3.6.x_build
[Pipeline] cleanWs
[Pipeline] cleanWs
[WS-CLEANUP] Deleting project workspace...
[WS-CLEANUP] Deferred wipeout is used...
[Pipeline] cleanWs
[WS-CLEANUP] Deleting project workspace...
[WS-CLEANUP] Deferred wipeout is used...
[Pipeline] // stage
[WS-CLEANUP] Deleting project workspace...
[WS-CLEANUP] Deferred wipeout is used...
[Pipeline] // stage
[WS-CLEANUP] done
[Pipeline] // stage
[WS-CLEANUP] Deleting project workspace...
[WS-CLEANUP] Deferred wipeout is used...
[WS-CLEANUP] Deleting project workspace...
[WS-CLEANUP] Deferred wipeout is used...
[WS-CLEANUP] done
[Pipeline] }
[Pipeline] }
[WS-CLEANUP] Deleting project workspace...
[WS-CLEANUP] Deferred wipeout is used...
[Pipeline] }
[WS-CLEANUP] done
[Pipeline] cleanWs
[WS-CLEANUP] Deleting project workspace...
[WS-CLEANUP] Deferred wipeout is used...
[Pipeline] cleanWs
[WS-CLEANUP] done
[Pipeline] cleanWs
[WS-CLEANUP] Deleting project workspace...
[WS-CLEANUP] Deferred wipeout is used...
[Pipeline] // ws
[WS-CLEANUP] done
[Pipeline] // ws
[WS-CLEANUP] Deleting project workspace...
[WS-CLEANUP] Deferred wipeout is used...
[Pipeline] // ws
[Pipeline] }
[Pipeline] }
[WS-CLEANUP] done
[Pipeline] }
[Pipeline] cleanWs
[Pipeline] cleanWs
[Pipeline] }
[WS-CLEANUP] done
[Pipeline] }
[WS-CLEANUP] done
[WS-CLEANUP] done
[Pipeline] // node
[Pipeline] // node
[Pipeline] // node
[Pipeline] }
Failed in branch linux-jdk13-m3.6.x_build
[Pipeline] }
Failed in branch windows-jdk7-m3.5.x_build
[Pipeline] }
Failed in branch windows-jdk7-m3.6.x_build
[Pipeline] }
[withMaven] Publishers: Generated Artifacts Publisher: 23 ms, Junit Publisher: 19691 ms, Open Task Scanner Publisher: 210 ms, Dependencies Fingerprint Publisher: 58 ms, Invoker Publisher: 769 ms, Pipeline Graph Publisher: 1 ms
[WS-CLEANUP] Deleting project workspace...
[WS-CLEANUP] Deferred wipeout is used...
[WS-CLEANUP] Deleting project workspace...
[WS-CLEANUP] Deferred wipeout is used...
[Pipeline] // stage
[Pipeline] }
[WS-CLEANUP] done
[WS-CLEANUP] done
[Pipeline] // stage
[Pipeline] }
[Pipeline] cleanWs
[Pipeline] cleanWs
[Pipeline] cleanWs
[Pipeline] // stage
[Pipeline] // withMaven
[Pipeline] }
[Pipeline] // ws
[Pipeline] }
[Pipeline] cleanWs
[WS-CLEANUP] Deleting project workspace...
[WS-CLEANUP] Deferred wipeout is used...
[withMaven] Publishers: Generated Artifacts Publisher: 31622 ms, Junit Publisher: 15458 ms, Open Task Scanner Publisher: 1781 ms, Dependencies Fingerprint Publisher: 1232 ms, Invoker Publisher: 2001 ms, Pipeline Graph Publisher: 1 ms
[Pipeline] }
[Pipeline] }
[Pipeline] // ws
[Pipeline] }
[WS-CLEANUP] done
[Pipeline] // ws
[Pipeline] }
[WS-CLEANUP] Deleting project workspace...
[WS-CLEANUP] Deferred wipeout is used...
[WS-CLEANUP] Deleting project workspace...
[WS-CLEANUP] Deferred wipeout is used...
[WS-CLEANUP] Deleting project workspace...
[WS-CLEANUP] Deferred wipeout is used...
[Pipeline] // node
[Pipeline] }
Failed in branch windows-jdk7-m3.2.x_build
[Pipeline] // stage
[Pipeline] // stage
[Pipeline] }
[Pipeline] }
[Pipeline] // node
[Pipeline] }
Failed in branch windows-jdk7-m3.3.x_build
[Pipeline] cleanWs
[WS-CLEANUP] Deleting project workspace...
[WS-CLEANUP] Deferred wipeout is used...
[Pipeline] // node
[WS-CLEANUP] done
[Pipeline] }
Failed in branch windows-jdk13-m3.6.x_build
[Pipeline] // ws
[Pipeline] // ws
[Pipeline] }
[Pipeline] }
[WS-CLEANUP] done
[WS-CLEANUP] done
[Pipeline] // withMaven
[WS-CLEANUP] done
[Pipeline] cleanWs
[Pipeline] }
[Pipeline] // node
[Pipeline] // node
[Pipeline] }
Failed in branch windows-jdk8-m3.6.x_build
[Pipeline] }
Failed in branch windows-jdk11-m3.6.x_build
[Pipeline] }
[Pipeline] }
[Pipeline] // stage
[Pipeline] }
[Pipeline] }
[Pipeline] // stage
[Pipeline] // stage
[Pipeline] }
[Pipeline] }
[Pipeline] // ws
[Pipeline] // stage
[Pipeline] }
[Pipeline] }
[WS-CLEANUP] Deleting project workspace...
[WS-CLEANUP] Deferred wipeout is used...
[Pipeline] // ws
[Pipeline] // ws
[Pipeline] }
[Pipeline] }
[Pipeline] // node
[Pipeline] // ws
[Pipeline] }
Failed in branch windows-jdk12-m3.6.x_build
[Pipeline] }
[Pipeline] // node
[Pipeline] // node
[Pipeline] }
Failed in branch linux-jdk7-m3.2.x_build
[Pipeline] }
Failed in branch linux-jdk8-m3.6.x_build
[Pipeline] // node
[Pipeline] }
Failed in branch linux-jdk7-m3.5.x_build
[WS-CLEANUP] done
[Pipeline] cleanWs
[WS-CLEANUP] Deleting project workspace...
[WS-CLEANUP] Deferred wipeout is used...
[WS-CLEANUP] done
[Pipeline] }
[Pipeline] // stage
[Pipeline] }
[Pipeline] // ws
[Pipeline] }
[Pipeline] // node
[Pipeline] }
Failed in branch linux-jdk7-m3.6.x_build
[Pipeline] // parallel
[Pipeline] stage
[Pipeline] { (Notifications)
[Pipeline] echo
Build result: FAILURE
[Pipeline] jiraIssueSelector
[Pipeline] echo
The authors of changes [hboutemy].
[Pipeline] echo
Sending email ...
[Pipeline] emailext