Build failed in Jenkins: Maven TLP » maven-archetypes » master #21

classic Classic list List threaded Threaded
4 messages Options
Reply | Threaded
Open this post in threaded view
|

Build failed in Jenkins: Maven TLP » maven-archetypes » master #21

Apache Jenkins Server-2
See https://builds.apache.org/job/maven-box/job/maven-archetypes/job/master/21/

No changes.

All tests passed

Build log:
[...truncated 3.36 MB...]
[windows-jdk9] [INFO] Downloading from central: https://repo.maven.apache.org/maven2/org/codehaus/groovy/groovy/1.8.3/groovy-1.8.3.pom
[windows-jdk9] [INFO] Downloaded from central: https://repo.maven.apache.org/maven2/org/codehaus/groovy/groovy/1.8.3/groovy-1.8.3.pom (32 kB at 994 kB/s)
[windows-jdk9] [INFO] Downloading from central: https://repo.maven.apache.org/maven2/asm/asm/3.2/asm-3.2.pom
[windows-jdk9] [INFO] Downloaded from central: https://repo.maven.apache.org/maven2/asm/asm/3.2/asm-3.2.pom (264 B at 8.5 kB/s)
[windows-jdk9] [INFO] Downloading from central: https://repo.maven.apache.org/maven2/asm/asm-parent/3.2/asm-parent-3.2.pom
[windows-jdk9] [INFO] Downloaded from central: https://repo.maven.apache.org/maven2/asm/asm-parent/3.2/asm-parent-3.2.pom (4.4 kB at 140 kB/s)
[windows-jdk9] [INFO] Downloading from central: https://repo.maven.apache.org/maven2/asm/asm-commons/3.2/asm-commons-3.2.pom
[windows-jdk9] [INFO] Downloaded from central: https://repo.maven.apache.org/maven2/asm/asm-commons/3.2/asm-commons-3.2.pom (415 B at 26 kB/s)
[windows-jdk9] [INFO] Downloading from central: https://repo.maven.apache.org/maven2/asm/asm-tree/3.2/asm-tree-3.2.pom
[windows-jdk9] [INFO] Downloaded from central: https://repo.maven.apache.org/maven2/asm/asm-tree/3.2/asm-tree-3.2.pom (404 B at 25 kB/s)
[windows-jdk9] [INFO] Downloading from central: https://repo.maven.apache.org/maven2/asm/asm-util/3.2/asm-util-3.2.pom
[windows-jdk9] [INFO] Downloaded from central: https://repo.maven.apache.org/maven2/asm/asm-util/3.2/asm-util-3.2.pom (409 B at 6.5 kB/s)
[windows-jdk9] [INFO] Downloading from central: https://repo.maven.apache.org/maven2/asm/asm-analysis/3.2/asm-analysis-3.2.pom
[windows-jdk9] [INFO] Downloaded from central: https://repo.maven.apache.org/maven2/asm/asm-analysis/3.2/asm-analysis-3.2.pom (417 B at 9.1 kB/s)
[windows-jdk9] [INFO] Downloading from central: https://repo.maven.apache.org/maven2/org/codehaus/plexus/plexus-interactivity-api/1.0-alpha-6/plexus-interactivity-api-1.0-alpha-6.pom
[windows-jdk9] [INFO] Downloaded from central: https://repo.maven.apache.org/maven2/org/codehaus/plexus/plexus-interactivity-api/1.0-alpha-6/plexus-interactivity-api-1.0-alpha-6.pom (726 B at 16 kB/s)
[windows-jdk9] [INFO] Downloading from central: https://repo.maven.apache.org/maven2/org/codehaus/plexus/plexus-interactivity/1.0-alpha-6/plexus-interactivity-1.0-alpha-6.pom
[windows-jdk9] [INFO] Downloaded from central: https://repo.maven.apache.org/maven2/org/codehaus/plexus/plexus-interactivity/1.0-alpha-6/plexus-interactivity-1.0-alpha-6.pom (1.1 kB at 67 kB/s)
[windows-jdk9] [INFO] Downloading from central: https://repo.maven.apache.org/maven2/org/codehaus/plexus/plexus-components/1.1.9/plexus-components-1.1.9.pom
[windows-jdk9] [INFO] Downloaded from central: https://repo.maven.apache.org/maven2/org/codehaus/plexus/plexus-components/1.1.9/plexus-components-1.1.9.pom (2.4 kB at 76 kB/s)
[windows-jdk9] [INFO] Downloading from central: https://repo.maven.apache.org/maven2/org/apache/maven/shared/maven-script-interpreter/1.0/maven-script-interpreter-1.0.pom
[windows-jdk9] [INFO] Downloaded from central: https://repo.maven.apache.org/maven2/org/apache/maven/shared/maven-script-interpreter/1.0/maven-script-interpreter-1.0.pom (3.8 kB at 240 kB/s)
[windows-jdk9] [INFO] Downloading from central: https://repo.maven.apache.org/maven2/org/apache/ant/ant/1.8.1/ant-1.8.1.pom
[windows-jdk9] [INFO] Downloaded from central: https://repo.maven.apache.org/maven2/org/apache/ant/ant/1.8.1/ant-1.8.1.pom (8.8 kB at 550 kB/s)
[windows-jdk9] [INFO] Downloading from central: https://repo.maven.apache.org/maven2/org/apache/ant/ant-parent/1.8.1/ant-parent-1.8.1.pom
[windows-jdk9] [INFO] Downloaded from central: https://repo.maven.apache.org/maven2/org/apache/ant/ant-parent/1.8.1/ant-parent-1.8.1.pom (4.3 kB at 138 kB/s)
[windows-jdk9] [INFO] Downloading from central: https://repo.maven.apache.org/maven2/org/apache/maven/archetype/archetype-catalog/3.0.1/archetype-catalog-3.0.1.jar
[windows-jdk9] [INFO] Downloading from central: https://repo.maven.apache.org/maven2/net/sourceforge/jchardet/jchardet/1.0/jchardet-1.0.jar
[windows-jdk9] [INFO] Downloading from central: https://repo.maven.apache.org/maven2/dom4j/dom4j/1.6.1/dom4j-1.6.1.jar
[windows-jdk9] [INFO] Downloading from central: https://repo.maven.apache.org/maven2/org/apache/maven/archetype/archetype-descriptor/3.0.1/archetype-descriptor-3.0.1.jar
[windows-jdk9] [INFO] Downloading from central: https://repo.maven.apache.org/maven2/org/apache/maven/archetype/archetype-common/3.0.1/archetype-common-3.0.1.jar
[windows-jdk9] [INFO] Downloaded from central: https://repo.maven.apache.org/maven2/org/apache/maven/archetype/archetype-common/3.0.1/archetype-common-3.0.1.jar (331 kB at 5.3 MB/s)
[windows-jdk9] [INFO] Downloading from central: https://repo.maven.apache.org/maven2/xml-apis/xml-apis/1.0.b2/xml-apis-1.0.b2.jar
[windows-jdk9] [INFO] Downloaded from central: https://repo.maven.apache.org/maven2/xml-apis/xml-apis/1.0.b2/xml-apis-1.0.b2.jar (109 kB at 1.4 MB/s)
[windows-jdk9] [INFO] Downloading from central: https://repo.maven.apache.org/maven2/jdom/jdom/1.0/jdom-1.0.jar
[windows-jdk9] [INFO] Downloaded from central: https://repo.maven.apache.org/maven2/jdom/jdom/1.0/jdom-1.0.jar (153 kB at 1.6 MB/s)
[windows-jdk9] [INFO] Downloading from central: https://repo.maven.apache.org/maven2/org/apache/maven/wagon/wagon-provider-api/2.8/wagon-provider-api-2.8.jar
[windows-jdk9] [INFO] Downloaded from central: https://repo.maven.apache.org/maven2/org/apache/maven/wagon/wagon-provider-api/2.8/wagon-provider-api-2.8.jar (53 kB at 421 kB/s)
[windows-jdk9] [INFO] Downloading from central: https://repo.maven.apache.org/maven2/org/codehaus/groovy/groovy/1.8.3/groovy-1.8.3.jar
[windows-jdk9] [INFO] Downloaded from central: https://repo.maven.apache.org/maven2/org/apache/maven/archetype/archetype-catalog/3.0.1/archetype-catalog-3.0.1.jar (19 kB at 135 kB/s)
[windows-jdk9] [INFO] Downloading from central: https://repo.maven.apache.org/maven2/asm/asm/3.2/asm-3.2.jar
[windows-jdk9] [INFO] Downloaded from central: https://repo.maven.apache.org/maven2/dom4j/dom4j/1.6.1/dom4j-1.6.1.jar (314 kB at 2.2 MB/s)
[windows-jdk9] [INFO] Downloading from central: https://repo.maven.apache.org/maven2/asm/asm-commons/3.2/asm-commons-3.2.jar
[windows-jdk9] [INFO] Downloaded from central: https://repo.maven.apache.org/maven2/org/codehaus/groovy/groovy/1.8.3/groovy-1.8.3.jar (5.5 MB at 22 MB/s)
[windows-jdk9] [INFO] Downloading from central: https://repo.maven.apache.org/maven2/asm/asm-util/3.2/asm-util-3.2.jar
[windows-jdk9] [INFO] Downloaded from central: https://repo.maven.apache.org/maven2/org/apache/maven/archetype/archetype-descriptor/3.0.1/archetype-descriptor-3.0.1.jar (24 kB at 95 kB/s)
[windows-jdk9] [INFO] Downloading from central: https://repo.maven.apache.org/maven2/asm/asm-analysis/3.2/asm-analysis-3.2.jar
[windows-jdk9] [INFO] Downloaded from central: https://repo.maven.apache.org/maven2/asm/asm/3.2/asm-3.2.jar (43 kB at 154 kB/s)
[windows-jdk9] [INFO] Downloading from central: https://repo.maven.apache.org/maven2/asm/asm-tree/3.2/asm-tree-3.2.jar
[windows-jdk9] [INFO] Downloaded from central: https://repo.maven.apache.org/maven2/asm/asm-commons/3.2/asm-commons-3.2.jar (33 kB at 111 kB/s)
[windows-jdk9] [INFO] Downloading from central: https://repo.maven.apache.org/maven2/org/codehaus/plexus/plexus-interactivity-api/1.0-alpha-6/plexus-interactivity-api-1.0-alpha-6.jar
[windows-jdk9] [INFO] Downloaded from central: https://repo.maven.apache.org/maven2/asm/asm-analysis/3.2/asm-analysis-3.2.jar (18 kB at 55 kB/s)
[windows-jdk9] [INFO] Downloading from central: https://repo.maven.apache.org/maven2/org/apache/maven/shared/maven-invoker/2.2/maven-invoker-2.2.jar
[windows-jdk9] [INFO] Downloaded from central: https://repo.maven.apache.org/maven2/net/sourceforge/jchardet/jchardet/1.0/jchardet-1.0.jar (27 kB at 81 kB/s)
[windows-jdk9] [INFO] Downloading from central: https://repo.maven.apache.org/maven2/org/apache/maven/shared/maven-artifact-transfer/0.9.0/maven-artifact-transfer-0.9.0.jar
[windows-jdk9] [INFO] Downloaded from central: https://repo.maven.apache.org/maven2/org/apache/maven/shared/maven-artifact-transfer/0.9.0/maven-artifact-transfer-0.9.0.jar (123 kB at 342 kB/s)
[windows-jdk9] [INFO] Downloading from central: https://repo.maven.apache.org/maven2/org/apache/maven/shared/maven-common-artifact-filters/3.0.0/maven-common-artifact-filters-3.0.0.jar
[windows-jdk9] [INFO] Downloaded from central: https://repo.maven.apache.org/maven2/org/apache/maven/shared/maven-common-artifact-filters/3.0.0/maven-common-artifact-filters-3.0.0.jar (57 kB at 153 kB/s)
[windows-jdk9] [INFO] Downloading from central: https://repo.maven.apache.org/maven2/commons-codec/commons-codec/1.6/commons-codec-1.6.jar
[windows-jdk9] [INFO] Downloaded from central: https://repo.maven.apache.org/maven2/commons-codec/commons-codec/1.6/commons-codec-1.6.jar (233 kB at 496 kB/s)
[windows-jdk9] [INFO] Downloading from central: https://repo.maven.apache.org/maven2/org/slf4j/slf4j-api/1.7.5/slf4j-api-1.7.5.jar
[windows-jdk9] [INFO] Downloaded from central: https://repo.maven.apache.org/maven2/asm/asm-tree/3.2/asm-tree-3.2.jar (22 kB at 47 kB/s)
[windows-jdk9] [INFO] Downloading from central: https://repo.maven.apache.org/maven2/org/apache/maven/shared/maven-script-interpreter/1.0/maven-script-interpreter-1.0.jar
[windows-jdk9] [INFO] Downloaded from central: https://repo.maven.apache.org/maven2/org/codehaus/plexus/plexus-interactivity-api/1.0-alpha-6/plexus-interactivity-api-1.0-alpha-6.jar (12 kB at 23 kB/s)
[windows-jdk9] [INFO] Downloading from central: https://repo.maven.apache.org/maven2/org/apache/ant/ant/1.8.1/ant-1.8.1.jar
[windows-jdk9] [INFO] Downloaded from central: https://repo.maven.apache.org/maven2/org/apache/maven/shared/maven-invoker/2.2/maven-invoker-2.2.jar (30 kB at 59 kB/s)
[windows-jdk9] [INFO] Downloaded from central: https://repo.maven.apache.org/maven2/asm/asm-util/3.2/asm-util-3.2.jar (37 kB at 67 kB/s)
[windows-jdk9] [INFO] Downloaded from central: https://repo.maven.apache.org/maven2/org/apache/ant/ant/1.8.1/ant-1.8.1.jar (1.5 MB at 2.7 MB/s)
[windows-jdk9] [INFO] Downloaded from central: https://repo.maven.apache.org/maven2/org/apache/maven/shared/maven-script-interpreter/1.0/maven-script-interpreter-1.0.jar (21 kB at 36 kB/s)
[windows-jdk9] [INFO] Downloaded from central: https://repo.maven.apache.org/maven2/org/slf4j/slf4j-api/1.7.5/slf4j-api-1.7.5.jar (26 kB at 43 kB/s)
[windows-jdk9] [INFO] Building archetype jar: F:\jenkins\jenkins-slave\workspace\box_maven-archetypes_master-CWQIX33IMRENQAEK6YQUG4YRNL2FP25GOPO4YFHLPIHFEWUYVBDQ\m\maven-archetype-archetype\target\maven-archetype-archetype-1.4-SNAPSHOT
[windows-jdk9] [INFO]
[windows-jdk9] [INFO] --- maven-site-plugin:3.7:attach-descriptor (attach-descriptor) @ maven-archetype-archetype ---
[windows-jdk9] [INFO] Skipping because packaging 'maven-archetype' is not pom.
[windows-jdk9] [INFO]
[windows-jdk9] [INFO] --- maven-archetype-plugin:3.0.1:integration-test (default-integration-test) @ maven-archetype-archetype ---
[windows-jdk9] [INFO] Processing Archetype IT project: it-basic
[windows-jdk9] [INFO] ----------------------------------------------------------------------------
[windows-jdk9] [INFO] Using following parameters for creating project from Archetype: maven-archetype-archetype:1.4-SNAPSHOT
[windows-jdk9] [INFO] ----------------------------------------------------------------------------
[windows-jdk9] [INFO] Parameter: groupId, Value: archetype.it
[windows-jdk9] [INFO] Parameter: artifactId, Value: basic-archetype
[windows-jdk9] [INFO] Parameter: version, Value: 0.1-SNAPSHOT
[windows-jdk9] [INFO] Parameter: package, Value: null
[windows-jdk9] [INFO] Parameter: packageInPathFormat, Value: null
[windows-jdk9] [INFO] Parameter: groupId, Value: archetype.it
[windows-jdk9] [INFO] Parameter: artifactId, Value: basic-archetype
[windows-jdk9] [INFO] Parameter: version, Value: 0.1-SNAPSHOT
[windows-jdk9] [INFO] Project created from Archetype in dir: F:\jenkins\jenkins-slave\workspace\box_maven-archetypes_master-CWQIX33IMRENQAEK6YQUG4YRNL2FP25GOPO4YFHLPIHFEWUYVBDQ\m\maven-archetype-archetype\target\test-classes\projects\it-basic\project\basic-archetype
[windows-jdk9] [INFO] Invoking post-archetype-generation goals: verify
[windows-jdk9] [INFO] Picked up JAVA_TOOL_OPTIONS: -Dmaven.ext.class.path="f:\jenkins\jenkins-slave\workspace\box_maven-archetypes_master-CWQIX33IMRENQAEK6YQUG4YRNL2FP25GOPO4YFHLPIHFEWUYVBDQ@tmp\withMaven9cd2157d\pipeline-maven-spy.jar" -Dorg.jenkinsci.plugins.pipeline.maven.reportsFolder="f:\jenkins\jenkins-slave\workspace\box_maven-archetypes_master-CWQIX33IMRENQAEK6YQUG4YRNL2FP25GOPO4YFHLPIHFEWUYVBDQ@tmp\withMaven9cd2157d"
[windows-jdk9] [INFO] [INFO] [jenkins-event-spy] Generate F:\jenkins\jenkins-slave\workspace\box_maven-archetypes_master-CWQIX33IMRENQAEK6YQUG4YRNL2FP25GOPO4YFHLPIHFEWUYVBDQ@tmp\withMaven9cd2157d\maven-spy-20180912-072111-3527908120696928954347.log.tmp ...
[windows-jdk9] [INFO] [INFO] Error stacktraces are turned on.
[windows-jdk9] [INFO] [INFO] Scanning for projects...
[windows-jdk9] [INFO] [INFO]
[windows-jdk9] [INFO] [INFO] ------------------------------------------------------------------------
[windows-jdk9] [INFO] [INFO] Building Archetype - basic-archetype 0.1-SNAPSHOT
[windows-jdk9] [INFO] [INFO] ------------------------------------------------------------------------
[windows-jdk9] [INFO] [INFO]
[windows-jdk9] [INFO] [INFO] --- maven-resources-plugin:3.0.2:resources (default-resources) @ basic-archetype ---
[windows-jdk9] [INFO] [INFO] Using 'UTF-8' encoding to copy filtered resources.
[windows-jdk9] [INFO] [INFO] Copying 4 resources
[windows-jdk9] [INFO] [INFO]
[windows-jdk9] [INFO] [INFO] --- maven-resources-plugin:3.0.2:testResources (default-testResources) @ basic-archetype ---
[windows-jdk9] [INFO] [INFO] Using 'UTF-8' encoding to copy filtered resources.
[windows-jdk9] [INFO] [INFO] Copying 2 resources
[windows-jdk9] [INFO] [INFO]
[windows-jdk9] [INFO] [INFO] --- maven-archetype-plugin:3.0.1:jar (default-jar) @ basic-archetype ---
[windows-jdk9] [INFO] [INFO] Building archetype jar: F:\jenkins\jenkins-slave\workspace\box_maven-archetypes_master-CWQIX33IMRENQAEK6YQUG4YRNL2FP25GOPO4YFHLPIHFEWUYVBDQ\m\maven-archetype-archetype\target\test-classes\projects\it-basic\project\basic-archetype\target\basic-archetype-0.1-SNAPSHOT
[windows-jdk9] [INFO] [INFO]
[windows-jdk9] [INFO] [INFO] --- maven-archetype-plugin:3.0.1:integration-test (default-integration-test) @ basic-archetype ---
[windows-jdk9] [INFO] [INFO] Processing Archetype IT project: it-basic
[windows-jdk9] [INFO] [INFO] ----------------------------------------------------------------------------
[windows-jdk9] [INFO] [INFO] Using following parameters for creating project from Archetype: basic-archetype:0.1-SNAPSHOT
[windows-jdk9] [INFO] [INFO] ----------------------------------------------------------------------------
[windows-jdk9] [INFO] [INFO] Parameter: groupId, Value: archetype.it
[windows-jdk9] [INFO] [INFO] Parameter: artifactId, Value: basic-project
[windows-jdk9] [INFO] [INFO] Parameter: version, Value: 0.1-SNAPSHOT
[windows-jdk9] [INFO] [INFO] Parameter: package, Value: it.pkg
[windows-jdk9] [INFO] [INFO] Parameter: packageInPathFormat, Value: it/pkg
[windows-jdk9] [INFO] [INFO] Parameter: package, Value: it.pkg
[windows-jdk9] [INFO] [INFO] Parameter: groupId, Value: archetype.it
[windows-jdk9] [INFO] [INFO] Parameter: artifactId, Value: basic-project
[windows-jdk9] [INFO] [INFO] Parameter: version, Value: 0.1-SNAPSHOT
[windows-jdk9] [INFO] [INFO] Project created from Archetype in dir: F:\jenkins\jenkins-slave\workspace\box_maven-archetypes_master-CWQIX33IMRENQAEK6YQUG4YRNL2FP25GOPO4YFHLPIHFEWUYVBDQ\m\maven-archetype-archetype\target\test-classes\projects\it-basic\project\basic-archetype\target\test-classes\projects\it-basic\project\basic-project
[windows-jdk9] [INFO] [INFO] Invoking post-archetype-generation goals: verify
[windows-jdk9] [INFO] [INFO] Post-archetype-generation invoker exit code: -2147483648
[windows-jdk9] [INFO] [INFO] ------------------------------------------------------------------------
[windows-jdk9] [INFO] [INFO] BUILD FAILURE
[windows-jdk9] [INFO] [INFO] ------------------------------------------------------------------------
[windows-jdk9] [INFO] [INFO] Total time: 1.988 s
[windows-jdk9] [INFO] [INFO] Finished at: 2018-09-12T07:21:13-07:00
[windows-jdk9] [INFO] [INFO] Final Memory: 16M/53M
[windows-jdk9] [INFO] [INFO] ------------------------------------------------------------------------
[windows-jdk9] [INFO] [INFO] [jenkins-event-spy] Generated F:\jenkins\jenkins-slave\workspace\box_maven-archetypes_master-CWQIX33IMRENQAEK6YQUG4YRNL2FP25GOPO4YFHLPIHFEWUYVBDQ@tmp\withMaven9cd2157d\maven-spy-20180912-072111-3527908120696928954347.log
[windows-jdk9] [INFO] [ERROR] Failed to execute goal org.apache.maven.plugins:maven-archetype-plugin:3.0.1:integration-test (default-integration-test) on project basic-archetype:
[windows-jdk9] [INFO] [ERROR] Archetype IT 'it-basic' failed: Execution failure: exit code = -2147483648
[windows-jdk9] [INFO] [ERROR] -> [Help 1]
[windows-jdk9] [INFO] org.apache.maven.lifecycle.LifecycleExecutionException: Failed to execute goal org.apache.maven.plugins:maven-archetype-plugin:3.0.1:integration-test (default-integration-test) on project basic-archetype:
[windows-jdk9] [INFO] Archetype IT 'it-basic' failed: Execution failure: exit code = -2147483648
[windows-jdk9] [INFO]     at org.apache.maven.lifecycle.internal.MojoExecutor.execute (MojoExecutor.java:213)
[windows-jdk9] [INFO]     at org.apache.maven.lifecycle.internal.MojoExecutor.execute (MojoExecutor.java:154)
[windows-jdk9] [INFO]     at org.apache.maven.lifecycle.internal.MojoExecutor.execute (MojoExecutor.java:146)
[windows-jdk9] [INFO]     at org.apache.maven.lifecycle.internal.LifecycleModuleBuilder.buildProject (LifecycleModuleBuilder.java:117)
[windows-jdk9] [INFO]     at org.apache.maven.lifecycle.internal.LifecycleModuleBuilder.buildProject (LifecycleModuleBuilder.java:81)
[windows-jdk9] [INFO]     at org.apache.maven.lifecycle.internal.builder.singlethreaded.SingleThreadedBuilder.build (SingleThreadedBuilder.java:51)
[windows-jdk9] [INFO]     at org.apache.maven.lifecycle.internal.LifecycleStarter.execute (LifecycleStarter.java:128)
[windows-jdk9] [INFO]     at org.apache.maven.DefaultMaven.doExecute (DefaultMaven.java:309)
[windows-jdk9] [INFO]     at org.apache.maven.DefaultMaven.doExecute (DefaultMaven.java:194)
[windows-jdk9] [INFO]     at org.apache.maven.DefaultMaven.execute (DefaultMaven.java:107)
[windows-jdk9] [INFO]     at org.apache.maven.cli.MavenCli.execute (MavenCli.java:955)
[windows-jdk9] [INFO]     at org.apache.maven.cli.MavenCli.doMain (MavenCli.java:290)
[windows-jdk9] [INFO]     at org.apache.maven.cli.MavenCli.main (MavenCli.java:194)
[windows-jdk9] [INFO]     at jdk.internal.reflect.NativeMethodAccessorImpl.invoke0 (Native Method)
[windows-jdk9] [INFO]     at jdk.internal.reflect.NativeMethodAccessorImpl.invoke (NativeMethodAccessorImpl.java:62)
[windows-jdk9] [INFO]     at jdk.internal.reflect.DelegatingMethodAccessorImpl.invoke (DelegatingMethodAccessorImpl.java:43)
[windows-jdk9] [INFO]     at java.lang.reflect.Method.invoke (Method.java:564)
[windows-jdk9] [INFO]     at org.codehaus.plexus.classworlds.launcher.Launcher.launchEnhanced (Launcher.java:289)
[windows-jdk9] [INFO]     at org.codehaus.plexus.classworlds.launcher.Launcher.launch (Launcher.java:229)
[windows-jdk9] [INFO]     at org.codehaus.plexus.classworlds.launcher.Launcher.mainWithExitCode (Launcher.java:415)
[windows-jdk9] [INFO]     at org.codehaus.plexus.classworlds.launcher.Launcher.main (Launcher.java:356)
[windows-jdk9] [INFO] Caused by: org.apache.maven.plugin.MojoExecutionException:
[windows-jdk9] [INFO] Archetype IT 'it-basic' failed: Execution failure: exit code = -2147483648
[windows-jdk9] [INFO]     at org.apache.maven.archetype.mojos.IntegrationTestMojo.execute (IntegrationTestMojo.java:325)
[windows-jdk9] [INFO]     at org.apache.maven.plugin.DefaultBuildPluginManager.executeMojo (DefaultBuildPluginManager.java:134)
[windows-jdk9] [INFO]     at org.apache.maven.lifecycle.internal.MojoExecutor.execute (MojoExecutor.java:208)
[windows-jdk9] [INFO]     at org.apache.maven.lifecycle.internal.MojoExecutor.execute (MojoExecutor.java:154)
[windows-jdk9] [INFO]     at org.apache.maven.lifecycle.internal.MojoExecutor.execute (MojoExecutor.java:146)
[windows-jdk9] [INFO]     at org.apache.maven.lifecycle.internal.LifecycleModuleBuilder.buildProject (LifecycleModuleBuilder.java:117)
[windows-jdk9] [INFO]     at org.apache.maven.lifecycle.internal.LifecycleModuleBuilder.buildProject (LifecycleModuleBuilder.java:81)
[windows-jdk9] [INFO]     at org.apache.maven.lifecycle.internal.builder.singlethreaded.SingleThreadedBuilder.build (SingleThreadedBuilder.java:51)
[windows-jdk9] [INFO]     at org.apache.maven.lifecycle.internal.LifecycleStarter.execute (LifecycleStarter.java:128)
[windows-jdk9] [INFO]     at org.apache.maven.DefaultMaven.doExecute (DefaultMaven.java:309)
[windows-jdk9] [INFO]     at org.apache.maven.DefaultMaven.doExecute (DefaultMaven.java:194)
[windows-jdk9] [INFO]     at org.apache.maven.DefaultMaven.execute (DefaultMaven.java:107)
[windows-jdk9] [INFO]     at org.apache.maven.cli.MavenCli.execute (MavenCli.java:955)
[windows-jdk9] [INFO]     at org.apache.maven.cli.MavenCli.doMain (MavenCli.java:290)
[windows-jdk9] [INFO]     at org.apache.maven.cli.MavenCli.main (MavenCli.java:194)
[windows-jdk9] [INFO]     at jdk.internal.reflect.NativeMethodAccessorImpl.invoke0 (Native Method)
[windows-jdk9] [INFO]     at jdk.internal.reflect.NativeMethodAccessorImpl.invoke (NativeMethodAccessorImpl.java:62)
[windows-jdk9] [INFO]     at jdk.internal.reflect.DelegatingMethodAccessorImpl.invoke (DelegatingMethodAccessorImpl.java:43)
[windows-jdk9] [INFO]     at java.lang.reflect.Method.invoke (Method.java:564)
[windows-jdk9] [INFO]     at org.codehaus.plexus.classworlds.launcher.Launcher.launchEnhanced (Launcher.java:289)
[windows-jdk9] [INFO]     at org.codehaus.plexus.classworlds.launcher.Launcher.launch (Launcher.java:229)
[windows-jdk9] [INFO]     at org.codehaus.plexus.classworlds.launcher.Launcher.mainWithExitCode (Launcher.java:415)
[windows-jdk9] [INFO]     at org.codehaus.plexus.classworlds.launcher.Launcher.main (Launcher.java:356)
[windows-jdk9] [INFO] [ERROR]
[windows-jdk9] [INFO] [ERROR] Re-run Maven using the -X switch to enable full debug logging.
[windows-jdk9] [INFO] [ERROR]
[windows-jdk9] [INFO] [ERROR] For more information about the errors and possible solutions, please read the following articles:
[windows-jdk9] [INFO] [ERROR] [Help 1] http://cwiki.apache.org/confluence/display/MAVEN/MojoExecutionException
[windows-jdk9] [INFO] Post-archetype-generation invoker exit code: 1
[windows-jdk9] [INFO] ------------------------------------------------------------------------
[windows-jdk9] [INFO] Reactor Summary:
[windows-jdk9] [INFO]
[windows-jdk9] [INFO] Apache Maven Archetypes ............................ SUCCESS [ 40.910 s]
[windows-jdk9] [INFO] Maven Archetype Archetype .......................... FAILURE [ 10.208 s]
[windows-jdk9] [INFO] Maven Simple J2EE Archetype ........................ SKIPPED
[windows-jdk9] [INFO] Maven Plugin Archetype ............................. SKIPPED
[windows-jdk9] [INFO] Maven Plugin Site Archetype ........................ SKIPPED
[windows-jdk9] [INFO] Maven Portlet Archetype ............................ SKIPPED
[windows-jdk9] [INFO] Maven Quickstart Archetype ......................... SKIPPED
[windows-jdk9] [INFO] Maven Simple Project Archetype ..................... SKIPPED
[windows-jdk9] [INFO] Maven Site Archetype ............................... SKIPPED
[windows-jdk9] [INFO] Maven Archetype for Simple Site .................... SKIPPED
[windows-jdk9] [INFO] Maven Site Skin Archetype .......................... SKIPPED
[windows-jdk9] [INFO] Maven Webapp Archetype ............................. SKIPPED
[windows-jdk9] [INFO] ------------------------------------------------------------------------
[windows-jdk9] [INFO] BUILD FAILURE
[windows-jdk9] [INFO] ------------------------------------------------------------------------
[windows-jdk9] [INFO] Total time: 54.133 s
[windows-jdk9] [INFO] Finished at: 2018-09-12T07:21:14-07:00
[windows-jdk9] [INFO] Final Memory: 34M/115M
[windows-jdk9] [INFO] ------------------------------------------------------------------------
[windows-jdk9] [WARNING] The requested profile "run-its" could not be activated because it does not exist.
[windows-jdk9] [INFO] [jenkins-event-spy] Generated F:\jenkins\jenkins-slave\workspace\box_maven-archetypes_master-CWQIX33IMRENQAEK6YQUG4YRNL2FP25GOPO4YFHLPIHFEWUYVBDQ@tmp\withMaven9cd2157d\maven-spy-20180912-072019-5394607107073656889493.log
[windows-jdk9] [ERROR] Failed to execute goal org.apache.maven.plugins:maven-archetype-plugin:3.0.1:integration-test (default-integration-test) on project maven-archetype-archetype:
[windows-jdk9] [ERROR] Archetype IT 'it-basic' failed: Execution failure: exit code = 1
[windows-jdk9] [ERROR] -> [Help 1]
[windows-jdk9] [ERROR]
[windows-jdk9] [ERROR] To see the full stack trace of the errors, re-run Maven with the -e switch.
[windows-jdk9] [ERROR] Re-run Maven using the -X switch to enable full debug logging.
[windows-jdk9] [ERROR]
[windows-jdk9] [ERROR] For more information about the errors and possible solutions, please read the following articles:
[windows-jdk9] [ERROR] [Help 1] http://cwiki.apache.org/confluence/display/MAVEN/MojoExecutionException
[windows-jdk9] [ERROR]
[windows-jdk9] [ERROR] After correcting the problems, you can resume the build with the command
[windows-jdk9] [ERROR]   mvn <goals> -rf :maven-archetype-archetype
[Pipeline] [windows-jdk9] }
[Pipeline] [windows-jdk9] // dir
[Pipeline] [windows-jdk9] }
[Pipeline] [windows-jdk9] // withMaven
[Pipeline] [windows-jdk9] cleanWs
[windows-jdk9] [WS-CLEANUP] Deleting project workspace...[WS-CLEANUP] done
[Pipeline] [windows-jdk9] cleanWs
[windows-jdk9] [WS-CLEANUP] Deleting project workspace...[WS-CLEANUP] done
[Pipeline] [windows-jdk9] }
[Pipeline] [windows-jdk9] // stage
[Pipeline] [windows-jdk9] }
[Pipeline] [windows-jdk9] // node
[Pipeline] [windows-jdk9] }
[windows-jdk9] Failed in branch windows-jdk9
[Pipeline] // parallel
[Pipeline] stage
[Pipeline] { (Notifications)
[Pipeline] echo
Build result: FAILURE
[Pipeline] jiraIssueSelector
[Pipeline] emailext
Reply | Threaded
Open this post in threaded view
|

Build failed in Jenkins: Maven TLP » maven-archetypes » master #22

Apache Jenkins Server-2
See https://builds.apache.org/job/maven-box/job/maven-archetypes/job/master/22/

No changes.

All tests passed

Build log:
[...truncated 3.36 MB...]
[windows-jdk10] [INFO] Downloading from central: https://repo.maven.apache.org/maven2/org/codehaus/groovy/groovy/1.8.3/groovy-1.8.3.pom
[windows-jdk10] [INFO] Downloaded from central: https://repo.maven.apache.org/maven2/org/codehaus/groovy/groovy/1.8.3/groovy-1.8.3.pom (32 kB at 4.0 MB/s)
[windows-jdk10] [INFO] Downloading from central: https://repo.maven.apache.org/maven2/asm/asm/3.2/asm-3.2.pom
[windows-jdk10] [INFO] Downloaded from central: https://repo.maven.apache.org/maven2/asm/asm/3.2/asm-3.2.pom (264 B at 44 kB/s)
[windows-jdk10] [INFO] Downloading from central: https://repo.maven.apache.org/maven2/asm/asm-parent/3.2/asm-parent-3.2.pom
[windows-jdk10] [INFO] Downloaded from central: https://repo.maven.apache.org/maven2/asm/asm-parent/3.2/asm-parent-3.2.pom (4.4 kB at 725 kB/s)
[windows-jdk10] [INFO] Downloading from central: https://repo.maven.apache.org/maven2/asm/asm-commons/3.2/asm-commons-3.2.pom
[windows-jdk10] [INFO] Downloaded from central: https://repo.maven.apache.org/maven2/asm/asm-commons/3.2/asm-commons-3.2.pom (415 B at 52 kB/s)
[windows-jdk10] [INFO] Downloading from central: https://repo.maven.apache.org/maven2/asm/asm-tree/3.2/asm-tree-3.2.pom
[windows-jdk10] [INFO] Downloaded from central: https://repo.maven.apache.org/maven2/asm/asm-tree/3.2/asm-tree-3.2.pom (404 B at 37 kB/s)
[windows-jdk10] [INFO] Downloading from central: https://repo.maven.apache.org/maven2/asm/asm-util/3.2/asm-util-3.2.pom
[windows-jdk10] [INFO] Downloaded from central: https://repo.maven.apache.org/maven2/asm/asm-util/3.2/asm-util-3.2.pom (409 B at 34 kB/s)
[windows-jdk10] [INFO] Downloading from central: https://repo.maven.apache.org/maven2/asm/asm-analysis/3.2/asm-analysis-3.2.pom
[windows-jdk10] [INFO] Downloaded from central: https://repo.maven.apache.org/maven2/asm/asm-analysis/3.2/asm-analysis-3.2.pom (417 B at 70 kB/s)
[windows-jdk10] [INFO] Downloading from central: https://repo.maven.apache.org/maven2/org/codehaus/plexus/plexus-interactivity-api/1.0-alpha-6/plexus-interactivity-api-1.0-alpha-6.pom
[windows-jdk10] [INFO] Downloaded from central: https://repo.maven.apache.org/maven2/org/codehaus/plexus/plexus-interactivity-api/1.0-alpha-6/plexus-interactivity-api-1.0-alpha-6.pom (726 B at 121 kB/s)
[windows-jdk10] [INFO] Downloading from central: https://repo.maven.apache.org/maven2/org/codehaus/plexus/plexus-interactivity/1.0-alpha-6/plexus-interactivity-1.0-alpha-6.pom
[windows-jdk10] [INFO] Downloaded from central: https://repo.maven.apache.org/maven2/org/codehaus/plexus/plexus-interactivity/1.0-alpha-6/plexus-interactivity-1.0-alpha-6.pom (1.1 kB at 153 kB/s)
[windows-jdk10] [INFO] Downloading from central: https://repo.maven.apache.org/maven2/org/codehaus/plexus/plexus-components/1.1.9/plexus-components-1.1.9.pom
[windows-jdk10] [INFO] Downloaded from central: https://repo.maven.apache.org/maven2/org/codehaus/plexus/plexus-components/1.1.9/plexus-components-1.1.9.pom (2.4 kB at 347 kB/s)
[windows-jdk10] [INFO] Downloading from central: https://repo.maven.apache.org/maven2/org/apache/maven/shared/maven-script-interpreter/1.0/maven-script-interpreter-1.0.pom
[windows-jdk10] [INFO] Downloaded from central: https://repo.maven.apache.org/maven2/org/apache/maven/shared/maven-script-interpreter/1.0/maven-script-interpreter-1.0.pom (3.8 kB at 481 kB/s)
[windows-jdk10] [INFO] Downloading from central: https://repo.maven.apache.org/maven2/org/apache/ant/ant/1.8.1/ant-1.8.1.pom
[windows-jdk10] [INFO] Downloaded from central: https://repo.maven.apache.org/maven2/org/apache/ant/ant/1.8.1/ant-1.8.1.pom (8.8 kB at 1.3 MB/s)
[windows-jdk10] [INFO] Downloading from central: https://repo.maven.apache.org/maven2/org/apache/ant/ant-parent/1.8.1/ant-parent-1.8.1.pom
[windows-jdk10] [INFO] Downloaded from central: https://repo.maven.apache.org/maven2/org/apache/ant/ant-parent/1.8.1/ant-parent-1.8.1.pom (4.3 kB at 428 kB/s)
[windows-jdk10] [INFO] Downloading from central: https://repo.maven.apache.org/maven2/org/apache/maven/archetype/archetype-catalog/3.0.1/archetype-catalog-3.0.1.jar
[windows-jdk10] [INFO] Downloading from central: https://repo.maven.apache.org/maven2/org/apache/maven/archetype/archetype-common/3.0.1/archetype-common-3.0.1.jar
[windows-jdk10] [INFO] Downloading from central: https://repo.maven.apache.org/maven2/org/apache/maven/archetype/archetype-descriptor/3.0.1/archetype-descriptor-3.0.1.jar
[windows-jdk10] [INFO] Downloading from central: https://repo.maven.apache.org/maven2/dom4j/dom4j/1.6.1/dom4j-1.6.1.jar
[windows-jdk10] [INFO] Downloading from central: https://repo.maven.apache.org/maven2/net/sourceforge/jchardet/jchardet/1.0/jchardet-1.0.jar
[windows-jdk10] [INFO] Downloaded from central: https://repo.maven.apache.org/maven2/net/sourceforge/jchardet/jchardet/1.0/jchardet-1.0.jar (27 kB at 1.6 MB/s)
[windows-jdk10] [INFO] Downloading from central: https://repo.maven.apache.org/maven2/xml-apis/xml-apis/1.0.b2/xml-apis-1.0.b2.jar
[windows-jdk10] [INFO] Downloaded from central: https://repo.maven.apache.org/maven2/org/apache/maven/archetype/archetype-common/3.0.1/archetype-common-3.0.1.jar (331 kB at 17 MB/s)
[windows-jdk10] [INFO] Downloading from central: https://repo.maven.apache.org/maven2/jdom/jdom/1.0/jdom-1.0.jar
[windows-jdk10] [INFO] Downloaded from central: https://repo.maven.apache.org/maven2/org/apache/maven/archetype/archetype-descriptor/3.0.1/archetype-descriptor-3.0.1.jar (24 kB at 990 kB/s)
[windows-jdk10] [INFO] Downloading from central: https://repo.maven.apache.org/maven2/org/apache/maven/wagon/wagon-provider-api/2.8/wagon-provider-api-2.8.jar
[windows-jdk10] [INFO] Downloaded from central: https://repo.maven.apache.org/maven2/org/apache/maven/archetype/archetype-catalog/3.0.1/archetype-catalog-3.0.1.jar (19 kB at 731 kB/s)
[windows-jdk10] [INFO] Downloading from central: https://repo.maven.apache.org/maven2/org/codehaus/groovy/groovy/1.8.3/groovy-1.8.3.jar
[windows-jdk10] [INFO] Downloaded from central: https://repo.maven.apache.org/maven2/xml-apis/xml-apis/1.0.b2/xml-apis-1.0.b2.jar (109 kB at 3.8 MB/s)
[windows-jdk10] [INFO] Downloading from central: https://repo.maven.apache.org/maven2/asm/asm/3.2/asm-3.2.jar
[windows-jdk10] [INFO] Downloaded from central: https://repo.maven.apache.org/maven2/jdom/jdom/1.0/jdom-1.0.jar (153 kB at 4.6 MB/s)
[windows-jdk10] [INFO] Downloading from central: https://repo.maven.apache.org/maven2/asm/asm-commons/3.2/asm-commons-3.2.jar
[windows-jdk10] [INFO] Downloaded from central: https://repo.maven.apache.org/maven2/org/apache/maven/wagon/wagon-provider-api/2.8/wagon-provider-api-2.8.jar (53 kB at 1.5 MB/s)
[windows-jdk10] [INFO] Downloading from central: https://repo.maven.apache.org/maven2/asm/asm-util/3.2/asm-util-3.2.jar
[windows-jdk10] [INFO] Downloaded from central: https://repo.maven.apache.org/maven2/dom4j/dom4j/1.6.1/dom4j-1.6.1.jar (314 kB at 8.5 MB/s)
[windows-jdk10] [INFO] Downloading from central: https://repo.maven.apache.org/maven2/asm/asm-analysis/3.2/asm-analysis-3.2.jar
[windows-jdk10] [INFO] Downloaded from central: https://repo.maven.apache.org/maven2/asm/asm/3.2/asm-3.2.jar (43 kB at 1.1 MB/s)
[windows-jdk10] [INFO] Downloading from central: https://repo.maven.apache.org/maven2/asm/asm-tree/3.2/asm-tree-3.2.jar
[windows-jdk10] [INFO] Downloaded from central: https://repo.maven.apache.org/maven2/asm/asm-commons/3.2/asm-commons-3.2.jar (33 kB at 788 kB/s)
[windows-jdk10] [INFO] Downloading from central: https://repo.maven.apache.org/maven2/org/codehaus/plexus/plexus-interactivity-api/1.0-alpha-6/plexus-interactivity-api-1.0-alpha-6.jar
[windows-jdk10] [INFO] Downloaded from central: https://repo.maven.apache.org/maven2/asm/asm-util/3.2/asm-util-3.2.jar (37 kB at 831 kB/s)
[windows-jdk10] [INFO] Downloading from central: https://repo.maven.apache.org/maven2/org/apache/maven/shared/maven-invoker/2.2/maven-invoker-2.2.jar
[windows-jdk10] [INFO] Downloaded from central: https://repo.maven.apache.org/maven2/asm/asm-analysis/3.2/asm-analysis-3.2.jar (18 kB at 400 kB/s)
[windows-jdk10] [INFO] Downloading from central: https://repo.maven.apache.org/maven2/org/apache/maven/shared/maven-artifact-transfer/0.9.0/maven-artifact-transfer-0.9.0.jar
[windows-jdk10] [INFO] Downloaded from central: https://repo.maven.apache.org/maven2/asm/asm-tree/3.2/asm-tree-3.2.jar (22 kB at 429 kB/s)
[windows-jdk10] [INFO] Downloading from central: https://repo.maven.apache.org/maven2/org/apache/maven/shared/maven-common-artifact-filters/3.0.0/maven-common-artifact-filters-3.0.0.jar
[windows-jdk10] [INFO] Downloaded from central: https://repo.maven.apache.org/maven2/org/codehaus/plexus/plexus-interactivity-api/1.0-alpha-6/plexus-interactivity-api-1.0-alpha-6.jar (12 kB at 214 kB/s)
[windows-jdk10] [INFO] Downloading from central: https://repo.maven.apache.org/maven2/commons-codec/commons-codec/1.6/commons-codec-1.6.jar
[windows-jdk10] [INFO] Downloaded from central: https://repo.maven.apache.org/maven2/org/apache/maven/shared/maven-invoker/2.2/maven-invoker-2.2.jar (30 kB at 530 kB/s)
[windows-jdk10] [INFO] Downloading from central: https://repo.maven.apache.org/maven2/org/slf4j/slf4j-api/1.7.5/slf4j-api-1.7.5.jar
[windows-jdk10] [INFO] Downloaded from central: https://repo.maven.apache.org/maven2/org/apache/maven/shared/maven-artifact-transfer/0.9.0/maven-artifact-transfer-0.9.0.jar (123 kB at 2.1 MB/s)
[windows-jdk10] [INFO] Downloading from central: https://repo.maven.apache.org/maven2/org/apache/maven/shared/maven-script-interpreter/1.0/maven-script-interpreter-1.0.jar
[windows-jdk10] [INFO] Downloaded from central: https://repo.maven.apache.org/maven2/org/slf4j/slf4j-api/1.7.5/slf4j-api-1.7.5.jar (26 kB at 378 kB/s)
[windows-jdk10] [INFO] Downloading from central: https://repo.maven.apache.org/maven2/org/apache/ant/ant/1.8.1/ant-1.8.1.jar
[windows-jdk10] [INFO] Downloaded from central: https://repo.maven.apache.org/maven2/commons-codec/commons-codec/1.6/commons-codec-1.6.jar (233 kB at 3.1 MB/s)
[windows-jdk10] [INFO] Downloaded from central: https://repo.maven.apache.org/maven2/org/apache/maven/shared/maven-common-artifact-filters/3.0.0/maven-common-artifact-filters-3.0.0.jar (57 kB at 743 kB/s)
[windows-jdk10] [INFO] Downloaded from central: https://repo.maven.apache.org/maven2/org/apache/maven/shared/maven-script-interpreter/1.0/maven-script-interpreter-1.0.jar (21 kB at 162 kB/s)
[windows-jdk10] [INFO] Downloaded from central: https://repo.maven.apache.org/maven2/org/codehaus/groovy/groovy/1.8.3/groovy-1.8.3.jar (5.5 MB at 34 MB/s)
[windows-jdk10] [INFO] Downloaded from central: https://repo.maven.apache.org/maven2/org/apache/ant/ant/1.8.1/ant-1.8.1.jar (1.5 MB at 9.2 MB/s)
[windows-jdk10] [INFO] Building archetype jar: F:\jenkins\jenkins-slave\workspace\box_maven-archetypes_master-CWQIX33IMRENQAEK6YQUG4YRNL2FP25GOPO4YFHLPIHFEWUYVBDQ\m\maven-archetype-archetype\target\maven-archetype-archetype-1.4-SNAPSHOT
[windows-jdk10] [INFO]
[windows-jdk10] [INFO] --- maven-site-plugin:3.7:attach-descriptor (attach-descriptor) @ maven-archetype-archetype ---
[windows-jdk10] [INFO] Skipping because packaging 'maven-archetype' is not pom.
[windows-jdk10] [INFO]
[windows-jdk10] [INFO] --- maven-archetype-plugin:3.0.1:integration-test (default-integration-test) @ maven-archetype-archetype ---
[windows-jdk10] [INFO] Processing Archetype IT project: it-basic
[windows-jdk10] [INFO] ----------------------------------------------------------------------------
[windows-jdk10] [INFO] Using following parameters for creating project from Archetype: maven-archetype-archetype:1.4-SNAPSHOT
[windows-jdk10] [INFO] ----------------------------------------------------------------------------
[windows-jdk10] [INFO] Parameter: groupId, Value: archetype.it
[windows-jdk10] [INFO] Parameter: artifactId, Value: basic-archetype
[windows-jdk10] [INFO] Parameter: version, Value: 0.1-SNAPSHOT
[windows-jdk10] [INFO] Parameter: package, Value: null
[windows-jdk10] [INFO] Parameter: packageInPathFormat, Value: null
[windows-jdk10] [INFO] Parameter: groupId, Value: archetype.it
[windows-jdk10] [INFO] Parameter: artifactId, Value: basic-archetype
[windows-jdk10] [INFO] Parameter: version, Value: 0.1-SNAPSHOT
[windows-jdk10] [INFO] Project created from Archetype in dir: F:\jenkins\jenkins-slave\workspace\box_maven-archetypes_master-CWQIX33IMRENQAEK6YQUG4YRNL2FP25GOPO4YFHLPIHFEWUYVBDQ\m\maven-archetype-archetype\target\test-classes\projects\it-basic\project\basic-archetype
[windows-jdk10] [INFO] Invoking post-archetype-generation goals: verify
[windows-jdk10] [INFO] Picked up JAVA_TOOL_OPTIONS: -Dmaven.ext.class.path="f:\jenkins\jenkins-slave\workspace\box_maven-archetypes_master-CWQIX33IMRENQAEK6YQUG4YRNL2FP25GOPO4YFHLPIHFEWUYVBDQ@tmp\withMaven8b793446\pipeline-maven-spy.jar" -Dorg.jenkinsci.plugins.pipeline.maven.reportsFolder="f:\jenkins\jenkins-slave\workspace\box_maven-archetypes_master-CWQIX33IMRENQAEK6YQUG4YRNL2FP25GOPO4YFHLPIHFEWUYVBDQ@tmp\withMaven8b793446"
[windows-jdk10] [INFO] [INFO] [jenkins-event-spy] Generate F:\jenkins\jenkins-slave\workspace\box_maven-archetypes_master-CWQIX33IMRENQAEK6YQUG4YRNL2FP25GOPO4YFHLPIHFEWUYVBDQ@tmp\withMaven8b793446\maven-spy-20180914-143449-77410660384407525888360.log.tmp ...
[windows-jdk10] [INFO] [INFO] Error stacktraces are turned on.
[windows-jdk10] [INFO] [INFO] Scanning for projects...
[windows-jdk10] [INFO] [INFO]
[windows-jdk10] [INFO] [INFO] ------------------------------------------------------------------------
[windows-jdk10] [INFO] [INFO] Building Archetype - basic-archetype 0.1-SNAPSHOT
[windows-jdk10] [INFO] [INFO] ------------------------------------------------------------------------
[windows-jdk10] [INFO] [INFO]
[windows-jdk10] [INFO] [INFO] --- maven-resources-plugin:3.0.2:resources (default-resources) @ basic-archetype ---
[windows-jdk10] [INFO] [INFO] Using 'UTF-8' encoding to copy filtered resources.
[windows-jdk10] [INFO] [INFO] Copying 4 resources
[windows-jdk10] [INFO] [INFO]
[windows-jdk10] [INFO] [INFO] --- maven-resources-plugin:3.0.2:testResources (default-testResources) @ basic-archetype ---
[windows-jdk10] [INFO] [INFO] Using 'UTF-8' encoding to copy filtered resources.
[windows-jdk10] [INFO] [INFO] Copying 2 resources
[windows-jdk10] [INFO] [INFO]
[windows-jdk10] [INFO] [INFO] --- maven-archetype-plugin:3.0.1:jar (default-jar) @ basic-archetype ---
[windows-jdk10] [INFO] [INFO] Building archetype jar: F:\jenkins\jenkins-slave\workspace\box_maven-archetypes_master-CWQIX33IMRENQAEK6YQUG4YRNL2FP25GOPO4YFHLPIHFEWUYVBDQ\m\maven-archetype-archetype\target\test-classes\projects\it-basic\project\basic-archetype\target\basic-archetype-0.1-SNAPSHOT
[windows-jdk10] [INFO] [INFO]
[windows-jdk10] [INFO] [INFO] --- maven-archetype-plugin:3.0.1:integration-test (default-integration-test) @ basic-archetype ---
[windows-jdk10] [INFO] [INFO] Processing Archetype IT project: it-basic
[windows-jdk10] [INFO] [INFO] ----------------------------------------------------------------------------
[windows-jdk10] [INFO] [INFO] Using following parameters for creating project from Archetype: basic-archetype:0.1-SNAPSHOT
[windows-jdk10] [INFO] [INFO] ----------------------------------------------------------------------------
[windows-jdk10] [INFO] [INFO] Parameter: groupId, Value: archetype.it
[windows-jdk10] [INFO] [INFO] Parameter: artifactId, Value: basic-project
[windows-jdk10] [INFO] [INFO] Parameter: version, Value: 0.1-SNAPSHOT
[windows-jdk10] [INFO] [INFO] Parameter: package, Value: it.pkg
[windows-jdk10] [INFO] [INFO] Parameter: packageInPathFormat, Value: it/pkg
[windows-jdk10] [INFO] [INFO] Parameter: package, Value: it.pkg
[windows-jdk10] [INFO] [INFO] Parameter: groupId, Value: archetype.it
[windows-jdk10] [INFO] [INFO] Parameter: artifactId, Value: basic-project
[windows-jdk10] [INFO] [INFO] Parameter: version, Value: 0.1-SNAPSHOT
[windows-jdk10] [INFO] [INFO] Project created from Archetype in dir: F:\jenkins\jenkins-slave\workspace\box_maven-archetypes_master-CWQIX33IMRENQAEK6YQUG4YRNL2FP25GOPO4YFHLPIHFEWUYVBDQ\m\maven-archetype-archetype\target\test-classes\projects\it-basic\project\basic-archetype\target\test-classes\projects\it-basic\project\basic-project
[windows-jdk10] [INFO] [INFO] Invoking post-archetype-generation goals: verify
[windows-jdk10] [INFO] [INFO] Post-archetype-generation invoker exit code: -2147483648
[windows-jdk10] [INFO] [INFO] ------------------------------------------------------------------------
[windows-jdk10] [INFO] [INFO] BUILD FAILURE
[windows-jdk10] [INFO] [INFO] ------------------------------------------------------------------------
[windows-jdk10] [INFO] [INFO] Total time: 1.705 s
[windows-jdk10] [INFO] [INFO] Finished at: 2018-09-14T14:34:51Z
[windows-jdk10] [INFO] [INFO] Final Memory: 12M/47M
[windows-jdk10] [INFO] [INFO] ------------------------------------------------------------------------
[windows-jdk10] [INFO] [INFO] [jenkins-event-spy] Generated F:\jenkins\jenkins-slave\workspace\box_maven-archetypes_master-CWQIX33IMRENQAEK6YQUG4YRNL2FP25GOPO4YFHLPIHFEWUYVBDQ@tmp\withMaven8b793446\maven-spy-20180914-143449-77410660384407525888360.log
[windows-jdk10] [INFO] [ERROR] Failed to execute goal org.apache.maven.plugins:maven-archetype-plugin:3.0.1:integration-test (default-integration-test) on project basic-archetype:
[windows-jdk10] [INFO] [ERROR] Archetype IT 'it-basic' failed: Execution failure: exit code = -2147483648
[windows-jdk10] [INFO] [ERROR] -> [Help 1]
[windows-jdk10] [INFO] org.apache.maven.lifecycle.LifecycleExecutionException: Failed to execute goal org.apache.maven.plugins:maven-archetype-plugin:3.0.1:integration-test (default-integration-test) on project basic-archetype:
[windows-jdk10] [INFO] Archetype IT 'it-basic' failed: Execution failure: exit code = -2147483648
[windows-jdk10] [INFO]     at org.apache.maven.lifecycle.internal.MojoExecutor.execute (MojoExecutor.java:213)
[windows-jdk10] [INFO]     at org.apache.maven.lifecycle.internal.MojoExecutor.execute (MojoExecutor.java:154)
[windows-jdk10] [INFO]     at org.apache.maven.lifecycle.internal.MojoExecutor.execute (MojoExecutor.java:146)
[windows-jdk10] [INFO]     at org.apache.maven.lifecycle.internal.LifecycleModuleBuilder.buildProject (LifecycleModuleBuilder.java:117)
[windows-jdk10] [INFO]     at org.apache.maven.lifecycle.internal.LifecycleModuleBuilder.buildProject (LifecycleModuleBuilder.java:81)
[windows-jdk10] [INFO]     at org.apache.maven.lifecycle.internal.builder.singlethreaded.SingleThreadedBuilder.build (SingleThreadedBuilder.java:51)
[windows-jdk10] [INFO]     at org.apache.maven.lifecycle.internal.LifecycleStarter.execute (LifecycleStarter.java:128)
[windows-jdk10] [INFO]     at org.apache.maven.DefaultMaven.doExecute (DefaultMaven.java:309)
[windows-jdk10] [INFO]     at org.apache.maven.DefaultMaven.doExecute (DefaultMaven.java:194)
[windows-jdk10] [INFO]     at org.apache.maven.DefaultMaven.execute (DefaultMaven.java:107)
[windows-jdk10] [INFO]     at org.apache.maven.cli.MavenCli.execute (MavenCli.java:955)
[windows-jdk10] [INFO]     at org.apache.maven.cli.MavenCli.doMain (MavenCli.java:290)
[windows-jdk10] [INFO]     at org.apache.maven.cli.MavenCli.main (MavenCli.java:194)
[windows-jdk10] [INFO]     at jdk.internal.reflect.NativeMethodAccessorImpl.invoke0 (Native Method)
[windows-jdk10] [INFO]     at jdk.internal.reflect.NativeMethodAccessorImpl.invoke (NativeMethodAccessorImpl.java:62)
[windows-jdk10] [INFO]     at jdk.internal.reflect.DelegatingMethodAccessorImpl.invoke (DelegatingMethodAccessorImpl.java:43)
[windows-jdk10] [INFO]     at java.lang.reflect.Method.invoke (Method.java:564)
[windows-jdk10] [INFO]     at org.codehaus.plexus.classworlds.launcher.Launcher.launchEnhanced (Launcher.java:289)
[windows-jdk10] [INFO]     at org.codehaus.plexus.classworlds.launcher.Launcher.launch (Launcher.java:229)
[windows-jdk10] [INFO]     at org.codehaus.plexus.classworlds.launcher.Launcher.mainWithExitCode (Launcher.java:415)
[windows-jdk10] [INFO]     at org.codehaus.plexus.classworlds.launcher.Launcher.main (Launcher.java:356)
[windows-jdk10] [INFO] Caused by: org.apache.maven.plugin.MojoExecutionException:
[windows-jdk10] [INFO] Archetype IT 'it-basic' failed: Execution failure: exit code = -2147483648
[windows-jdk10] [INFO]     at org.apache.maven.archetype.mojos.IntegrationTestMojo.execute (IntegrationTestMojo.java:325)
[windows-jdk10] [INFO]     at org.apache.maven.plugin.DefaultBuildPluginManager.executeMojo (DefaultBuildPluginManager.java:134)
[windows-jdk10] [INFO]     at org.apache.maven.lifecycle.internal.MojoExecutor.execute (MojoExecutor.java:208)
[windows-jdk10] [INFO]     at org.apache.maven.lifecycle.internal.MojoExecutor.execute (MojoExecutor.java:154)
[windows-jdk10] [INFO]     at org.apache.maven.lifecycle.internal.MojoExecutor.execute (MojoExecutor.java:146)
[windows-jdk10] [INFO]     at org.apache.maven.lifecycle.internal.LifecycleModuleBuilder.buildProject (LifecycleModuleBuilder.java:117)
[windows-jdk10] [INFO]     at org.apache.maven.lifecycle.internal.LifecycleModuleBuilder.buildProject (LifecycleModuleBuilder.java:81)
[windows-jdk10] [INFO]     at org.apache.maven.lifecycle.internal.builder.singlethreaded.SingleThreadedBuilder.build (SingleThreadedBuilder.java:51)
[windows-jdk10] [INFO]     at org.apache.maven.lifecycle.internal.LifecycleStarter.execute (LifecycleStarter.java:128)
[windows-jdk10] [INFO]     at org.apache.maven.DefaultMaven.doExecute (DefaultMaven.java:309)
[windows-jdk10] [INFO]     at org.apache.maven.DefaultMaven.doExecute (DefaultMaven.java:194)
[windows-jdk10] [INFO]     at org.apache.maven.DefaultMaven.execute (DefaultMaven.java:107)
[windows-jdk10] [INFO]     at org.apache.maven.cli.MavenCli.execute (MavenCli.java:955)
[windows-jdk10] [INFO]     at org.apache.maven.cli.MavenCli.doMain (MavenCli.java:290)
[windows-jdk10] [INFO]     at org.apache.maven.cli.MavenCli.main (MavenCli.java:194)
[windows-jdk10] [INFO]     at jdk.internal.reflect.NativeMethodAccessorImpl.invoke0 (Native Method)
[windows-jdk10] [INFO]     at jdk.internal.reflect.NativeMethodAccessorImpl.invoke (NativeMethodAccessorImpl.java:62)
[windows-jdk10] [INFO]     at jdk.internal.reflect.DelegatingMethodAccessorImpl.invoke (DelegatingMethodAccessorImpl.java:43)
[windows-jdk10] [INFO]     at java.lang.reflect.Method.invoke (Method.java:564)
[windows-jdk10] [INFO]     at org.codehaus.plexus.classworlds.launcher.Launcher.launchEnhanced (Launcher.java:289)
[windows-jdk10] [INFO]     at org.codehaus.plexus.classworlds.launcher.Launcher.launch (Launcher.java:229)
[windows-jdk10] [INFO]     at org.codehaus.plexus.classworlds.launcher.Launcher.mainWithExitCode (Launcher.java:415)
[windows-jdk10] [INFO]     at org.codehaus.plexus.classworlds.launcher.Launcher.main (Launcher.java:356)
[windows-jdk10] [INFO] [ERROR]
[windows-jdk10] [INFO] [ERROR] Re-run Maven using the -X switch to enable full debug logging.
[windows-jdk10] [INFO] [ERROR]
[windows-jdk10] [INFO] [ERROR] For more information about the errors and possible solutions, please read the following articles:
[windows-jdk10] [INFO] [ERROR] [Help 1] http://cwiki.apache.org/confluence/display/MAVEN/MojoExecutionException
[windows-jdk10] [INFO] Post-archetype-generation invoker exit code: 1
[windows-jdk10] [INFO] ------------------------------------------------------------------------
[windows-jdk10] [INFO] Reactor Summary:
[windows-jdk10] [INFO]
[windows-jdk10] [INFO] Apache Maven Archetypes ............................ SUCCESS [ 15.027 s]
[windows-jdk10] [INFO] Maven Archetype Archetype .......................... FAILURE [  5.866 s]
[windows-jdk10] [INFO] Maven Simple J2EE Archetype ........................ SKIPPED
[windows-jdk10] [INFO] Maven Plugin Archetype ............................. SKIPPED
[windows-jdk10] [INFO] Maven Plugin Site Archetype ........................ SKIPPED
[windows-jdk10] [INFO] Maven Portlet Archetype ............................ SKIPPED
[windows-jdk10] [INFO] Maven Quickstart Archetype ......................... SKIPPED
[windows-jdk10] [INFO] Maven Simple Project Archetype ..................... SKIPPED
[windows-jdk10] [INFO] Maven Site Archetype ............................... SKIPPED
[windows-jdk10] [INFO] Maven Archetype for Simple Site .................... SKIPPED
[windows-jdk10] [INFO] Maven Site Skin Archetype .......................... SKIPPED
[windows-jdk10] [INFO] Maven Webapp Archetype ............................. SKIPPED
[windows-jdk10] [INFO] ------------------------------------------------------------------------
[windows-jdk10] [INFO] BUILD FAILURE
[windows-jdk10] [INFO] ------------------------------------------------------------------------
[windows-jdk10] [INFO] Total time: 22.322 s
[windows-jdk10] [INFO] Finished at: 2018-09-14T14:34:51Z
[windows-jdk10] [INFO] Final Memory: 31M/110M
[windows-jdk10] [INFO] ------------------------------------------------------------------------
[windows-jdk10] [WARNING] The requested profile "run-its" could not be activated because it does not exist.
[windows-jdk10] [INFO] [jenkins-event-spy] Generated F:\jenkins\jenkins-slave\workspace\box_maven-archetypes_master-CWQIX33IMRENQAEK6YQUG4YRNL2FP25GOPO4YFHLPIHFEWUYVBDQ@tmp\withMaven8b793446\maven-spy-20180914-143429-2595588852377099934136.log
[windows-jdk10] [ERROR] Failed to execute goal org.apache.maven.plugins:maven-archetype-plugin:3.0.1:integration-test (default-integration-test) on project maven-archetype-archetype:
[windows-jdk10] [ERROR] Archetype IT 'it-basic' failed: Execution failure: exit code = 1
[windows-jdk10] [ERROR] -> [Help 1]
[windows-jdk10] [ERROR]
[windows-jdk10] [ERROR] To see the full stack trace of the errors, re-run Maven with the -e switch.
[windows-jdk10] [ERROR] Re-run Maven using the -X switch to enable full debug logging.
[windows-jdk10] [ERROR]
[windows-jdk10] [ERROR] For more information about the errors and possible solutions, please read the following articles:
[windows-jdk10] [ERROR] [Help 1] http://cwiki.apache.org/confluence/display/MAVEN/MojoExecutionException
[windows-jdk10] [ERROR]
[windows-jdk10] [ERROR] After correcting the problems, you can resume the build with the command
[windows-jdk10] [ERROR]   mvn <goals> -rf :maven-archetype-archetype
[Pipeline] [windows-jdk10] }
[Pipeline] [windows-jdk10] // dir
[Pipeline] [windows-jdk10] }
[Pipeline] [windows-jdk10] // withMaven
[Pipeline] [windows-jdk10] cleanWs
[windows-jdk10] [WS-CLEANUP] Deleting project workspace...[WS-CLEANUP] done
[Pipeline] [windows-jdk10] cleanWs
[windows-jdk10] [WS-CLEANUP] Deleting project workspace...[WS-CLEANUP] done
[Pipeline] [windows-jdk10] }
[Pipeline] [windows-jdk10] // stage
[Pipeline] [windows-jdk10] }
[Pipeline] [windows-jdk10] // node
[Pipeline] [windows-jdk10] }
[windows-jdk10] Failed in branch windows-jdk10
[Pipeline] // parallel
[Pipeline] stage
[Pipeline] { (Notifications)
[Pipeline] echo
Build result: FAILURE
[Pipeline] jiraIssueSelector
[Pipeline] emailext
Reply | Threaded
Open this post in threaded view
|

Build failed in Jenkins: Maven TLP » maven-archetypes » master #23

Apache Jenkins Server-2
See https://builds.apache.org/job/maven-box/job/maven-archetypes/job/master/23/

Changes:

* Exclude H25
* Exclude H31 cause master is failing constantly.
* no need to test anymore with '3.0.x'
* Add Java 11 to defaults
* Try to shorten path for Windows by using tempDir
* Fix arguments
* Add option for temp workspace
* disable tmpWs
* enable tmpWs
* Use def
* Try to shorten wsDir

All tests passed

Build log:
[...truncated 3.36 MB...]
[windows-jdk10] [INFO] Downloading from central: https://repo.maven.apache.org/maven2/org/codehaus/groovy/groovy/1.8.3/groovy-1.8.3.pom
[windows-jdk10] [INFO] Downloaded from central: https://repo.maven.apache.org/maven2/org/codehaus/groovy/groovy/1.8.3/groovy-1.8.3.pom (32 kB at 3.2 MB/s)
[windows-jdk10] [INFO] Downloading from central: https://repo.maven.apache.org/maven2/asm/asm/3.2/asm-3.2.pom
[windows-jdk10] [INFO] Downloaded from central: https://repo.maven.apache.org/maven2/asm/asm/3.2/asm-3.2.pom (264 B at 38 kB/s)
[windows-jdk10] [INFO] Downloading from central: https://repo.maven.apache.org/maven2/asm/asm-parent/3.2/asm-parent-3.2.pom
[windows-jdk10] [INFO] Downloaded from central: https://repo.maven.apache.org/maven2/asm/asm-parent/3.2/asm-parent-3.2.pom (4.4 kB at 622 kB/s)
[windows-jdk10] [INFO] Downloading from central: https://repo.maven.apache.org/maven2/asm/asm-commons/3.2/asm-commons-3.2.pom
[windows-jdk10] [INFO] Downloaded from central: https://repo.maven.apache.org/maven2/asm/asm-commons/3.2/asm-commons-3.2.pom (415 B at 52 kB/s)
[windows-jdk10] [INFO] Downloading from central: https://repo.maven.apache.org/maven2/asm/asm-tree/3.2/asm-tree-3.2.pom
[windows-jdk10] [INFO] Downloaded from central: https://repo.maven.apache.org/maven2/asm/asm-tree/3.2/asm-tree-3.2.pom (404 B at 45 kB/s)
[windows-jdk10] [INFO] Downloading from central: https://repo.maven.apache.org/maven2/asm/asm-util/3.2/asm-util-3.2.pom
[windows-jdk10] [INFO] Downloaded from central: https://repo.maven.apache.org/maven2/asm/asm-util/3.2/asm-util-3.2.pom (409 B at 51 kB/s)
[windows-jdk10] [INFO] Downloading from central: https://repo.maven.apache.org/maven2/asm/asm-analysis/3.2/asm-analysis-3.2.pom
[windows-jdk10] [INFO] Downloaded from central: https://repo.maven.apache.org/maven2/asm/asm-analysis/3.2/asm-analysis-3.2.pom (417 B at 52 kB/s)
[windows-jdk10] [INFO] Downloading from central: https://repo.maven.apache.org/maven2/org/codehaus/plexus/plexus-interactivity-api/1.0-alpha-6/plexus-interactivity-api-1.0-alpha-6.pom
[windows-jdk10] [INFO] Downloaded from central: https://repo.maven.apache.org/maven2/org/codehaus/plexus/plexus-interactivity-api/1.0-alpha-6/plexus-interactivity-api-1.0-alpha-6.pom (726 B at 104 kB/s)
[windows-jdk10] [INFO] Downloading from central: https://repo.maven.apache.org/maven2/org/codehaus/plexus/plexus-interactivity/1.0-alpha-6/plexus-interactivity-1.0-alpha-6.pom
[windows-jdk10] [INFO] Downloaded from central: https://repo.maven.apache.org/maven2/org/codehaus/plexus/plexus-interactivity/1.0-alpha-6/plexus-interactivity-1.0-alpha-6.pom (1.1 kB at 153 kB/s)
[windows-jdk10] [INFO] Downloading from central: https://repo.maven.apache.org/maven2/org/codehaus/plexus/plexus-components/1.1.9/plexus-components-1.1.9.pom
[windows-jdk10] [INFO] Downloaded from central: https://repo.maven.apache.org/maven2/org/codehaus/plexus/plexus-components/1.1.9/plexus-components-1.1.9.pom (2.4 kB at 347 kB/s)
[windows-jdk10] [INFO] Downloading from central: https://repo.maven.apache.org/maven2/org/apache/maven/shared/maven-script-interpreter/1.0/maven-script-interpreter-1.0.pom
[windows-jdk10] [INFO] Downloaded from central: https://repo.maven.apache.org/maven2/org/apache/maven/shared/maven-script-interpreter/1.0/maven-script-interpreter-1.0.pom (3.8 kB at 256 kB/s)
[windows-jdk10] [INFO] Downloading from central: https://repo.maven.apache.org/maven2/org/apache/ant/ant/1.8.1/ant-1.8.1.pom
[windows-jdk10] [INFO] Downloaded from central: https://repo.maven.apache.org/maven2/org/apache/ant/ant/1.8.1/ant-1.8.1.pom (8.8 kB at 1.1 MB/s)
[windows-jdk10] [INFO] Downloading from central: https://repo.maven.apache.org/maven2/org/apache/ant/ant-parent/1.8.1/ant-parent-1.8.1.pom
[windows-jdk10] [INFO] Downloaded from central: https://repo.maven.apache.org/maven2/org/apache/ant/ant-parent/1.8.1/ant-parent-1.8.1.pom (4.3 kB at 535 kB/s)
[windows-jdk10] [INFO] Downloading from central: https://repo.maven.apache.org/maven2/org/apache/maven/archetype/archetype-catalog/3.0.1/archetype-catalog-3.0.1.jar
[windows-jdk10] [INFO] Downloading from central: https://repo.maven.apache.org/maven2/org/apache/maven/archetype/archetype-descriptor/3.0.1/archetype-descriptor-3.0.1.jar
[windows-jdk10] [INFO] Downloading from central: https://repo.maven.apache.org/maven2/net/sourceforge/jchardet/jchardet/1.0/jchardet-1.0.jar
[windows-jdk10] [INFO] Downloading from central: https://repo.maven.apache.org/maven2/org/apache/maven/archetype/archetype-common/3.0.1/archetype-common-3.0.1.jar
[windows-jdk10] [INFO] Downloading from central: https://repo.maven.apache.org/maven2/dom4j/dom4j/1.6.1/dom4j-1.6.1.jar
[windows-jdk10] [INFO] Downloaded from central: https://repo.maven.apache.org/maven2/net/sourceforge/jchardet/jchardet/1.0/jchardet-1.0.jar (27 kB at 2.0 MB/s)
[windows-jdk10] [INFO] Downloading from central: https://repo.maven.apache.org/maven2/xml-apis/xml-apis/1.0.b2/xml-apis-1.0.b2.jar
[windows-jdk10] [INFO] Downloaded from central: https://repo.maven.apache.org/maven2/org/apache/maven/archetype/archetype-descriptor/3.0.1/archetype-descriptor-3.0.1.jar (24 kB at 1.5 MB/s)
[windows-jdk10] [INFO] Downloading from central: https://repo.maven.apache.org/maven2/jdom/jdom/1.0/jdom-1.0.jar
[windows-jdk10] [INFO] Downloaded from central: https://repo.maven.apache.org/maven2/org/apache/maven/archetype/archetype-catalog/3.0.1/archetype-catalog-3.0.1.jar (19 kB at 1.1 MB/s)
[windows-jdk10] [INFO] Downloading from central: https://repo.maven.apache.org/maven2/org/apache/maven/wagon/wagon-provider-api/2.8/wagon-provider-api-2.8.jar
[windows-jdk10] [INFO] Downloaded from central: https://repo.maven.apache.org/maven2/org/apache/maven/archetype/archetype-common/3.0.1/archetype-common-3.0.1.jar (331 kB at 12 MB/s)
[windows-jdk10] [INFO] Downloading from central: https://repo.maven.apache.org/maven2/org/codehaus/groovy/groovy/1.8.3/groovy-1.8.3.jar
[windows-jdk10] [INFO] Downloaded from central: https://repo.maven.apache.org/maven2/xml-apis/xml-apis/1.0.b2/xml-apis-1.0.b2.jar (109 kB at 3.8 MB/s)
[windows-jdk10] [INFO] Downloading from central: https://repo.maven.apache.org/maven2/asm/asm/3.2/asm-3.2.jar
[windows-jdk10] [INFO] Downloaded from central: https://repo.maven.apache.org/maven2/org/apache/maven/wagon/wagon-provider-api/2.8/wagon-provider-api-2.8.jar (53 kB at 1.7 MB/s)
[windows-jdk10] [INFO] Downloading from central: https://repo.maven.apache.org/maven2/asm/asm-commons/3.2/asm-commons-3.2.jar
[windows-jdk10] [INFO] Downloaded from central: https://repo.maven.apache.org/maven2/dom4j/dom4j/1.6.1/dom4j-1.6.1.jar (314 kB at 9.5 MB/s)
[windows-jdk10] [INFO] Downloading from central: https://repo.maven.apache.org/maven2/asm/asm-util/3.2/asm-util-3.2.jar
[windows-jdk10] [INFO] Downloaded from central: https://repo.maven.apache.org/maven2/jdom/jdom/1.0/jdom-1.0.jar (153 kB at 4.4 MB/s)
[windows-jdk10] [INFO] Downloading from central: https://repo.maven.apache.org/maven2/asm/asm-analysis/3.2/asm-analysis-3.2.jar
[windows-jdk10] [INFO] Downloaded from central: https://repo.maven.apache.org/maven2/asm/asm/3.2/asm-3.2.jar (43 kB at 1.1 MB/s)
[windows-jdk10] [INFO] Downloading from central: https://repo.maven.apache.org/maven2/asm/asm-tree/3.2/asm-tree-3.2.jar
[windows-jdk10] [INFO] Downloaded from central: https://repo.maven.apache.org/maven2/asm/asm-commons/3.2/asm-commons-3.2.jar (33 kB at 827 kB/s)
[windows-jdk10] [INFO] Downloading from central: https://repo.maven.apache.org/maven2/org/codehaus/plexus/plexus-interactivity-api/1.0-alpha-6/plexus-interactivity-api-1.0-alpha-6.jar
[windows-jdk10] [INFO] Downloaded from central: https://repo.maven.apache.org/maven2/asm/asm-util/3.2/asm-util-3.2.jar (37 kB at 870 kB/s)
[windows-jdk10] [INFO] Downloading from central: https://repo.maven.apache.org/maven2/org/apache/maven/shared/maven-invoker/2.2/maven-invoker-2.2.jar
[windows-jdk10] [INFO] Downloaded from central: https://repo.maven.apache.org/maven2/asm/asm-analysis/3.2/asm-analysis-3.2.jar (18 kB at 409 kB/s)
[windows-jdk10] [INFO] Downloading from central: https://repo.maven.apache.org/maven2/org/apache/maven/shared/maven-artifact-transfer/0.9.0/maven-artifact-transfer-0.9.0.jar
[windows-jdk10] [INFO] Downloaded from central: https://repo.maven.apache.org/maven2/org/codehaus/plexus/plexus-interactivity-api/1.0-alpha-6/plexus-interactivity-api-1.0-alpha-6.jar (12 kB at 236 kB/s)
[windows-jdk10] [INFO] Downloading from central: https://repo.maven.apache.org/maven2/org/apache/maven/shared/maven-common-artifact-filters/3.0.0/maven-common-artifact-filters-3.0.0.jar
[windows-jdk10] [INFO] Downloaded from central: https://repo.maven.apache.org/maven2/org/apache/maven/shared/maven-invoker/2.2/maven-invoker-2.2.jar (30 kB at 504 kB/s)
[windows-jdk10] [INFO] Downloading from central: https://repo.maven.apache.org/maven2/commons-codec/commons-codec/1.6/commons-codec-1.6.jar
[windows-jdk10] [INFO] Downloaded from central: https://repo.maven.apache.org/maven2/org/apache/maven/shared/maven-artifact-transfer/0.9.0/maven-artifact-transfer-0.9.0.jar (123 kB at 2.0 MB/s)
[windows-jdk10] [INFO] Downloading from central: https://repo.maven.apache.org/maven2/org/slf4j/slf4j-api/1.7.5/slf4j-api-1.7.5.jar
[windows-jdk10] [INFO] Downloaded from central: https://repo.maven.apache.org/maven2/org/apache/maven/shared/maven-common-artifact-filters/3.0.0/maven-common-artifact-filters-3.0.0.jar (57 kB at 753 kB/s)
[windows-jdk10] [INFO] Downloading from central: https://repo.maven.apache.org/maven2/org/apache/maven/shared/maven-script-interpreter/1.0/maven-script-interpreter-1.0.jar
[windows-jdk10] [INFO] Downloaded from central: https://repo.maven.apache.org/maven2/org/slf4j/slf4j-api/1.7.5/slf4j-api-1.7.5.jar (26 kB at 334 kB/s)
[windows-jdk10] [INFO] Downloading from central: https://repo.maven.apache.org/maven2/org/apache/ant/ant/1.8.1/ant-1.8.1.jar
[windows-jdk10] [INFO] Downloaded from central: https://repo.maven.apache.org/maven2/commons-codec/commons-codec/1.6/commons-codec-1.6.jar (233 kB at 2.8 MB/s)
[windows-jdk10] [INFO] Downloaded from central: https://repo.maven.apache.org/maven2/org/apache/maven/shared/maven-script-interpreter/1.0/maven-script-interpreter-1.0.jar (21 kB at 239 kB/s)
[windows-jdk10] [INFO] Downloaded from central: https://repo.maven.apache.org/maven2/asm/asm-tree/3.2/asm-tree-3.2.jar (22 kB at 210 kB/s)
[windows-jdk10] [INFO] Downloaded from central: https://repo.maven.apache.org/maven2/org/apache/ant/ant/1.8.1/ant-1.8.1.jar (1.5 MB at 11 MB/s)
[windows-jdk10] [INFO] Downloaded from central: https://repo.maven.apache.org/maven2/org/codehaus/groovy/groovy/1.8.3/groovy-1.8.3.jar (5.5 MB at 28 MB/s)
[windows-jdk10] [INFO] Building archetype jar: F:\jenkins\jenkins-slave\workspace\box_maven-archetypes_master-CWQIX33IMRENQAEK6YQUG4YRNL2FP25GOPO4YFHLPIHFEWUYVBDQ\m\maven-archetype-archetype\target\maven-archetype-archetype-1.4-SNAPSHOT
[windows-jdk10] [INFO]
[windows-jdk10] [INFO] --- maven-site-plugin:3.7:attach-descriptor (attach-descriptor) @ maven-archetype-archetype ---
[windows-jdk10] [INFO] Skipping because packaging 'maven-archetype' is not pom.
[windows-jdk10] [INFO]
[windows-jdk10] [INFO] --- maven-archetype-plugin:3.0.1:integration-test (default-integration-test) @ maven-archetype-archetype ---
[windows-jdk10] [INFO] Processing Archetype IT project: it-basic
[windows-jdk10] [INFO] ----------------------------------------------------------------------------
[windows-jdk10] [INFO] Using following parameters for creating project from Archetype: maven-archetype-archetype:1.4-SNAPSHOT
[windows-jdk10] [INFO] ----------------------------------------------------------------------------
[windows-jdk10] [INFO] Parameter: groupId, Value: archetype.it
[windows-jdk10] [INFO] Parameter: artifactId, Value: basic-archetype
[windows-jdk10] [INFO] Parameter: version, Value: 0.1-SNAPSHOT
[windows-jdk10] [INFO] Parameter: package, Value: null
[windows-jdk10] [INFO] Parameter: packageInPathFormat, Value: null
[windows-jdk10] [INFO] Parameter: groupId, Value: archetype.it
[windows-jdk10] [INFO] Parameter: artifactId, Value: basic-archetype
[windows-jdk10] [INFO] Parameter: version, Value: 0.1-SNAPSHOT
[windows-jdk10] [INFO] Project created from Archetype in dir: F:\jenkins\jenkins-slave\workspace\box_maven-archetypes_master-CWQIX33IMRENQAEK6YQUG4YRNL2FP25GOPO4YFHLPIHFEWUYVBDQ\m\maven-archetype-archetype\target\test-classes\projects\it-basic\project\basic-archetype
[windows-jdk10] [INFO] Invoking post-archetype-generation goals: verify
[windows-jdk10] [INFO] Picked up JAVA_TOOL_OPTIONS: -Dmaven.ext.class.path="f:\jenkins\jenkins-slave\workspace\box_maven-archetypes_master-CWQIX33IMRENQAEK6YQUG4YRNL2FP25GOPO4YFHLPIHFEWUYVBDQ@tmp\withMaven6373cead\pipeline-maven-spy.jar" -Dorg.jenkinsci.plugins.pipeline.maven.reportsFolder="f:\jenkins\jenkins-slave\workspace\box_maven-archetypes_master-CWQIX33IMRENQAEK6YQUG4YRNL2FP25GOPO4YFHLPIHFEWUYVBDQ@tmp\withMaven6373cead"
[windows-jdk10] [INFO] [INFO] [jenkins-event-spy] Generate F:\jenkins\jenkins-slave\workspace\box_maven-archetypes_master-CWQIX33IMRENQAEK6YQUG4YRNL2FP25GOPO4YFHLPIHFEWUYVBDQ@tmp\withMaven6373cead\maven-spy-20181010-134343-67413776798862108340457.log.tmp ...
[windows-jdk10] [INFO] [INFO] Error stacktraces are turned on.
[windows-jdk10] [INFO] [INFO] Scanning for projects...
[windows-jdk10] [INFO] [INFO]
[windows-jdk10] [INFO] [INFO] ------------------------------------------------------------------------
[windows-jdk10] [INFO] [INFO] Building Archetype - basic-archetype 0.1-SNAPSHOT
[windows-jdk10] [INFO] [INFO] ------------------------------------------------------------------------
[windows-jdk10] [INFO] [INFO]
[windows-jdk10] [INFO] [INFO] --- maven-resources-plugin:3.0.2:resources (default-resources) @ basic-archetype ---
[windows-jdk10] [INFO] [INFO] Using 'UTF-8' encoding to copy filtered resources.
[windows-jdk10] [INFO] [INFO] Copying 4 resources
[windows-jdk10] [INFO] [INFO]
[windows-jdk10] [INFO] [INFO] --- maven-resources-plugin:3.0.2:testResources (default-testResources) @ basic-archetype ---
[windows-jdk10] [INFO] [INFO] Using 'UTF-8' encoding to copy filtered resources.
[windows-jdk10] [INFO] [INFO] Copying 2 resources
[windows-jdk10] [INFO] [INFO]
[windows-jdk10] [INFO] [INFO] --- maven-archetype-plugin:3.0.1:jar (default-jar) @ basic-archetype ---
[windows-jdk10] [INFO] [INFO] Building archetype jar: F:\jenkins\jenkins-slave\workspace\box_maven-archetypes_master-CWQIX33IMRENQAEK6YQUG4YRNL2FP25GOPO4YFHLPIHFEWUYVBDQ\m\maven-archetype-archetype\target\test-classes\projects\it-basic\project\basic-archetype\target\basic-archetype-0.1-SNAPSHOT
[windows-jdk10] [INFO] [INFO]
[windows-jdk10] [INFO] [INFO] --- maven-archetype-plugin:3.0.1:integration-test (default-integration-test) @ basic-archetype ---
[windows-jdk10] [INFO] [INFO] Processing Archetype IT project: it-basic
[windows-jdk10] [INFO] [INFO] ----------------------------------------------------------------------------
[windows-jdk10] [INFO] [INFO] Using following parameters for creating project from Archetype: basic-archetype:0.1-SNAPSHOT
[windows-jdk10] [INFO] [INFO] ----------------------------------------------------------------------------
[windows-jdk10] [INFO] [INFO] Parameter: groupId, Value: archetype.it
[windows-jdk10] [INFO] [INFO] Parameter: artifactId, Value: basic-project
[windows-jdk10] [INFO] [INFO] Parameter: version, Value: 0.1-SNAPSHOT
[windows-jdk10] [INFO] [INFO] Parameter: package, Value: it.pkg
[windows-jdk10] [INFO] [INFO] Parameter: packageInPathFormat, Value: it/pkg
[windows-jdk10] [INFO] [INFO] Parameter: package, Value: it.pkg
[windows-jdk10] [INFO] [INFO] Parameter: groupId, Value: archetype.it
[windows-jdk10] [INFO] [INFO] Parameter: artifactId, Value: basic-project
[windows-jdk10] [INFO] [INFO] Parameter: version, Value: 0.1-SNAPSHOT
[windows-jdk10] [INFO] [INFO] Project created from Archetype in dir: F:\jenkins\jenkins-slave\workspace\box_maven-archetypes_master-CWQIX33IMRENQAEK6YQUG4YRNL2FP25GOPO4YFHLPIHFEWUYVBDQ\m\maven-archetype-archetype\target\test-classes\projects\it-basic\project\basic-archetype\target\test-classes\projects\it-basic\project\basic-project
[windows-jdk10] [INFO] [INFO] Invoking post-archetype-generation goals: verify
[windows-jdk10] [INFO] [INFO] Post-archetype-generation invoker exit code: -2147483648
[windows-jdk10] [INFO] [INFO] ------------------------------------------------------------------------
[windows-jdk10] [INFO] [INFO] BUILD FAILURE
[windows-jdk10] [INFO] [INFO] ------------------------------------------------------------------------
[windows-jdk10] [INFO] [INFO] Total time: 1.923 s
[windows-jdk10] [INFO] [INFO] Finished at: 2018-10-10T13:43:46Z
[windows-jdk10] [INFO] [INFO] Final Memory: 12M/47M
[windows-jdk10] [INFO] [INFO] ------------------------------------------------------------------------
[windows-jdk10] [INFO] [INFO] [jenkins-event-spy] Generated F:\jenkins\jenkins-slave\workspace\box_maven-archetypes_master-CWQIX33IMRENQAEK6YQUG4YRNL2FP25GOPO4YFHLPIHFEWUYVBDQ@tmp\withMaven6373cead\maven-spy-20181010-134343-67413776798862108340457.log
[windows-jdk10] [INFO] [ERROR] Failed to execute goal org.apache.maven.plugins:maven-archetype-plugin:3.0.1:integration-test (default-integration-test) on project basic-archetype:
[windows-jdk10] [INFO] [ERROR] Archetype IT 'it-basic' failed: Execution failure: exit code = -2147483648
[windows-jdk10] [INFO] [ERROR] -> [Help 1]
[windows-jdk10] [INFO] org.apache.maven.lifecycle.LifecycleExecutionException: Failed to execute goal org.apache.maven.plugins:maven-archetype-plugin:3.0.1:integration-test (default-integration-test) on project basic-archetype:
[windows-jdk10] [INFO] Archetype IT 'it-basic' failed: Execution failure: exit code = -2147483648
[windows-jdk10] [INFO]     at org.apache.maven.lifecycle.internal.MojoExecutor.execute (MojoExecutor.java:213)
[windows-jdk10] [INFO]     at org.apache.maven.lifecycle.internal.MojoExecutor.execute (MojoExecutor.java:154)
[windows-jdk10] [INFO]     at org.apache.maven.lifecycle.internal.MojoExecutor.execute (MojoExecutor.java:146)
[windows-jdk10] [INFO]     at org.apache.maven.lifecycle.internal.LifecycleModuleBuilder.buildProject (LifecycleModuleBuilder.java:117)
[windows-jdk10] [INFO]     at org.apache.maven.lifecycle.internal.LifecycleModuleBuilder.buildProject (LifecycleModuleBuilder.java:81)
[windows-jdk10] [INFO]     at org.apache.maven.lifecycle.internal.builder.singlethreaded.SingleThreadedBuilder.build (SingleThreadedBuilder.java:51)
[windows-jdk10] [INFO]     at org.apache.maven.lifecycle.internal.LifecycleStarter.execute (LifecycleStarter.java:128)
[windows-jdk10] [INFO]     at org.apache.maven.DefaultMaven.doExecute (DefaultMaven.java:309)
[windows-jdk10] [INFO]     at org.apache.maven.DefaultMaven.doExecute (DefaultMaven.java:194)
[windows-jdk10] [INFO]     at org.apache.maven.DefaultMaven.execute (DefaultMaven.java:107)
[windows-jdk10] [INFO]     at org.apache.maven.cli.MavenCli.execute (MavenCli.java:955)
[windows-jdk10] [INFO]     at org.apache.maven.cli.MavenCli.doMain (MavenCli.java:290)
[windows-jdk10] [INFO]     at org.apache.maven.cli.MavenCli.main (MavenCli.java:194)
[windows-jdk10] [INFO]     at jdk.internal.reflect.NativeMethodAccessorImpl.invoke0 (Native Method)
[windows-jdk10] [INFO]     at jdk.internal.reflect.NativeMethodAccessorImpl.invoke (NativeMethodAccessorImpl.java:62)
[windows-jdk10] [INFO]     at jdk.internal.reflect.DelegatingMethodAccessorImpl.invoke (DelegatingMethodAccessorImpl.java:43)
[windows-jdk10] [INFO]     at java.lang.reflect.Method.invoke (Method.java:564)
[windows-jdk10] [INFO]     at org.codehaus.plexus.classworlds.launcher.Launcher.launchEnhanced (Launcher.java:289)
[windows-jdk10] [INFO]     at org.codehaus.plexus.classworlds.launcher.Launcher.launch (Launcher.java:229)
[windows-jdk10] [INFO]     at org.codehaus.plexus.classworlds.launcher.Launcher.mainWithExitCode (Launcher.java:415)
[windows-jdk10] [INFO]     at org.codehaus.plexus.classworlds.launcher.Launcher.main (Launcher.java:356)
[windows-jdk10] [INFO] Caused by: org.apache.maven.plugin.MojoExecutionException:
[windows-jdk10] [INFO] Archetype IT 'it-basic' failed: Execution failure: exit code = -2147483648
[windows-jdk10] [INFO]     at org.apache.maven.archetype.mojos.IntegrationTestMojo.execute (IntegrationTestMojo.java:325)
[windows-jdk10] [INFO]     at org.apache.maven.plugin.DefaultBuildPluginManager.executeMojo (DefaultBuildPluginManager.java:134)
[windows-jdk10] [INFO]     at org.apache.maven.lifecycle.internal.MojoExecutor.execute (MojoExecutor.java:208)
[windows-jdk10] [INFO]     at org.apache.maven.lifecycle.internal.MojoExecutor.execute (MojoExecutor.java:154)
[windows-jdk10] [INFO]     at org.apache.maven.lifecycle.internal.MojoExecutor.execute (MojoExecutor.java:146)
[windows-jdk10] [INFO]     at org.apache.maven.lifecycle.internal.LifecycleModuleBuilder.buildProject (LifecycleModuleBuilder.java:117)
[windows-jdk10] [INFO]     at org.apache.maven.lifecycle.internal.LifecycleModuleBuilder.buildProject (LifecycleModuleBuilder.java:81)
[windows-jdk10] [INFO]     at org.apache.maven.lifecycle.internal.builder.singlethreaded.SingleThreadedBuilder.build (SingleThreadedBuilder.java:51)
[windows-jdk10] [INFO]     at org.apache.maven.lifecycle.internal.LifecycleStarter.execute (LifecycleStarter.java:128)
[windows-jdk10] [INFO]     at org.apache.maven.DefaultMaven.doExecute (DefaultMaven.java:309)
[windows-jdk10] [INFO]     at org.apache.maven.DefaultMaven.doExecute (DefaultMaven.java:194)
[windows-jdk10] [INFO]     at org.apache.maven.DefaultMaven.execute (DefaultMaven.java:107)
[windows-jdk10] [INFO]     at org.apache.maven.cli.MavenCli.execute (MavenCli.java:955)
[windows-jdk10] [INFO]     at org.apache.maven.cli.MavenCli.doMain (MavenCli.java:290)
[windows-jdk10] [INFO]     at org.apache.maven.cli.MavenCli.main (MavenCli.java:194)
[windows-jdk10] [INFO]     at jdk.internal.reflect.NativeMethodAccessorImpl.invoke0 (Native Method)
[windows-jdk10] [INFO]     at jdk.internal.reflect.NativeMethodAccessorImpl.invoke (NativeMethodAccessorImpl.java:62)
[windows-jdk10] [INFO]     at jdk.internal.reflect.DelegatingMethodAccessorImpl.invoke (DelegatingMethodAccessorImpl.java:43)
[windows-jdk10] [INFO]     at java.lang.reflect.Method.invoke (Method.java:564)
[windows-jdk10] [INFO]     at org.codehaus.plexus.classworlds.launcher.Launcher.launchEnhanced (Launcher.java:289)
[windows-jdk10] [INFO]     at org.codehaus.plexus.classworlds.launcher.Launcher.launch (Launcher.java:229)
[windows-jdk10] [INFO]     at org.codehaus.plexus.classworlds.launcher.Launcher.mainWithExitCode (Launcher.java:415)
[windows-jdk10] [INFO]     at org.codehaus.plexus.classworlds.launcher.Launcher.main (Launcher.java:356)
[windows-jdk10] [INFO] [ERROR]
[windows-jdk10] [INFO] [ERROR] Re-run Maven using the -X switch to enable full debug logging.
[windows-jdk10] [INFO] [ERROR]
[windows-jdk10] [INFO] [ERROR] For more information about the errors and possible solutions, please read the following articles:
[windows-jdk10] [INFO] [ERROR] [Help 1] http://cwiki.apache.org/confluence/display/MAVEN/MojoExecutionException
[windows-jdk10] [INFO] Post-archetype-generation invoker exit code: 1
[windows-jdk10] [INFO] ------------------------------------------------------------------------
[windows-jdk10] [INFO] Reactor Summary:
[windows-jdk10] [INFO]
[windows-jdk10] [INFO] Apache Maven Archetypes ............................ SUCCESS [ 14.656 s]
[windows-jdk10] [INFO] Maven Archetype Archetype .......................... FAILURE [  6.724 s]
[windows-jdk10] [INFO] Maven Simple J2EE Archetype ........................ SKIPPED
[windows-jdk10] [INFO] Maven Plugin Archetype ............................. SKIPPED
[windows-jdk10] [INFO] Maven Plugin Site Archetype ........................ SKIPPED
[windows-jdk10] [INFO] Maven Portlet Archetype ............................ SKIPPED
[windows-jdk10] [INFO] Maven Quickstart Archetype ......................... SKIPPED
[windows-jdk10] [INFO] Maven Simple Project Archetype ..................... SKIPPED
[windows-jdk10] [INFO] Maven Site Archetype ............................... SKIPPED
[windows-jdk10] [INFO] Maven Archetype for Simple Site .................... SKIPPED
[windows-jdk10] [INFO] Maven Site Skin Archetype .......................... SKIPPED
[windows-jdk10] [INFO] Maven Webapp Archetype ............................. SKIPPED
[windows-jdk10] [INFO] ------------------------------------------------------------------------
[windows-jdk10] [INFO] BUILD FAILURE
[windows-jdk10] [INFO] ------------------------------------------------------------------------
[windows-jdk10] [INFO] Total time: 22.855 s
[windows-jdk10] [INFO] Finished at: 2018-10-10T13:43:46Z
[windows-jdk10] [INFO] Final Memory: 31M/110M
[windows-jdk10] [INFO] ------------------------------------------------------------------------
[windows-jdk10] [WARNING] The requested profile "run-its" could not be activated because it does not exist.
[windows-jdk10] [INFO] [jenkins-event-spy] Generated F:\jenkins\jenkins-slave\workspace\box_maven-archetypes_master-CWQIX33IMRENQAEK6YQUG4YRNL2FP25GOPO4YFHLPIHFEWUYVBDQ@tmp\withMaven6373cead\maven-spy-20181010-134323-2710005469143719459420.log
[windows-jdk10] [ERROR] Failed to execute goal org.apache.maven.plugins:maven-archetype-plugin:3.0.1:integration-test (default-integration-test) on project maven-archetype-archetype:
[windows-jdk10] [ERROR] Archetype IT 'it-basic' failed: Execution failure: exit code = 1
[windows-jdk10] [ERROR] -> [Help 1]
[windows-jdk10] [ERROR]
[windows-jdk10] [ERROR] To see the full stack trace of the errors, re-run Maven with the -e switch.
[windows-jdk10] [ERROR] Re-run Maven using the -X switch to enable full debug logging.
[windows-jdk10] [ERROR]
[windows-jdk10] [ERROR] For more information about the errors and possible solutions, please read the following articles:
[windows-jdk10] [ERROR] [Help 1] http://cwiki.apache.org/confluence/display/MAVEN/MojoExecutionException
[windows-jdk10] [ERROR]
[windows-jdk10] [ERROR] After correcting the problems, you can resume the build with the command
[windows-jdk10] [ERROR]   mvn <goals> -rf :maven-archetype-archetype
[Pipeline] [windows-jdk10] }
[Pipeline] [windows-jdk10] // dir
[Pipeline] [windows-jdk10] }
[Pipeline] [windows-jdk10] // withMaven
[Pipeline] [windows-jdk10] cleanWs
[windows-jdk10] [WS-CLEANUP] Deleting project workspace...[WS-CLEANUP] done
[Pipeline] [windows-jdk10] cleanWs
[windows-jdk10] [WS-CLEANUP] Deleting project workspace...[WS-CLEANUP] done
[Pipeline] [windows-jdk10] }
[Pipeline] [windows-jdk10] // stage
[Pipeline] [windows-jdk10] }
[Pipeline] [windows-jdk10] // node
[Pipeline] [windows-jdk10] }
[windows-jdk10] Failed in branch windows-jdk10
[Pipeline] // parallel
[Pipeline] stage
[Pipeline] { (Notifications)
[Pipeline] echo
Build result: FAILURE
[Pipeline] jiraIssueSelector
[Pipeline] emailext
Reply | Threaded
Open this post in threaded view
|

Build failed in Jenkins: Maven TLP » maven-archetypes » master #24

Apache Jenkins Server-2
See https://builds.apache.org/job/maven-box/job/maven-archetypes/job/master/24/

Changes:

* Update Maven Compiler and Surefire plugins
* Update Maven Compiler and Surefire plugins
* Update Maven Compiler and Surefire plugins
* Update Maven Compiler and Surefire plugins
* Update Maven Compiler and Surefire plugins
* Update Maven Compiler and Surefire plugins
* Update Maven Compiler and Surefire plugins
* Update Maven Compiler and Surefire plugins

All tests passed

Build log:
[...truncated 3.94 MB...]
[linux-jdk10] None of the test reports contained any result
[linux-jdk10] [withMaven] junitPublisher - Archive test results for Maven artifact archetype.it:basic-webapp:0.1-SNAPSHOT generated by maven-surefire-plugin:test (default-test): m/maven-archetype-webapp/target/test-classes/projects/it-basic/project/basic-webapp/target/surefire-reports/*.xml
[linux-jdk10] Recording test results
[linux-jdk10] None of the test reports contained any result
[Pipeline] [linux-jdk10] // withMaven
[Pipeline] [linux-jdk10] cleanWs
[linux-jdk10] [WS-CLEANUP] Deleting project workspace...[WS-CLEANUP] done
[Pipeline] [linux-jdk10] }
[Pipeline] [linux-jdk10] // stage
[Pipeline] [linux-jdk10] }
[Pipeline] [linux-jdk10] // node
[Pipeline] [linux-jdk10] }
[linux-jdk9] [INFO] [INFO] [jenkins-event-spy] Generate /home/jenkins/jenkins-slave/workspace/box_maven-archetypes_master-CWQIX33IMRENQAEK6YQUG4YRNL2FP25GOPO4YFHLPIHFEWUYVBDQ@2@tmp/withMaven71552291/maven-spy-20181013-233754-29214295972245502123886.log.tmp ...
[linux-jdk8] [INFO] [INFO] [jenkins-event-spy] Generate /home/jenkins/jenkins-slave/workspace/box_maven-archetypes_master-CWQIX33IMRENQAEK6YQUG4YRNL2FP25GOPO4YFHLPIHFEWUYVBDQ@tmp/withMavenb27c7883/maven-spy-20181013-233753-8706712720443411561045.log.tmp ...
[linux-jdk8] [INFO] [INFO] Error stacktraces are turned on.
[linux-jdk8] [INFO] [INFO] Scanning for projects...
[linux-jdk8] [INFO] [INFO]
[linux-jdk8] [INFO] [INFO] ---------------------< archetype.it:basic-webapp >----------------------
[linux-jdk8] [INFO] [INFO] Building basic-webapp Maven Webapp 0.1-SNAPSHOT
[linux-jdk8] [INFO] [INFO] --------------------------------[ war ]---------------------------------
[linux-jdk9] [INFO] [INFO] Error stacktraces are turned on.
[linux-jdk9] [INFO] [INFO] Scanning for projects...
[linux-jdk9] [INFO] [INFO]
[linux-jdk9] [INFO] [INFO] ---------------------< archetype.it:basic-webapp >----------------------
[linux-jdk9] [INFO] [INFO] Building basic-webapp Maven Webapp 0.1-SNAPSHOT
[linux-jdk9] [INFO] [INFO] --------------------------------[ war ]---------------------------------
[linux-jdk9] [INFO] [INFO]
[linux-jdk9] [INFO] [INFO] --- maven-resources-plugin:3.0.2:resources (default-resources) @ basic-webapp ---
[linux-jdk9] [INFO] [INFO] Using 'UTF-8' encoding to copy filtered resources.
[linux-jdk9] [INFO] [INFO] skip non existing resourceDirectory /home/jenkins/jenkins-slave/workspace/box_maven-archetypes_master-CWQIX33IMRENQAEK6YQUG4YRNL2FP25GOPO4YFHLPIHFEWUYVBDQ@2/m/maven-archetype-webapp/target/test-classes/projects/it-basic/project/basic-webapp/src/main/resources
[linux-jdk9] [INFO] [INFO]
[linux-jdk9] [INFO] [INFO] --- maven-compiler-plugin:3.8.0:compile (default-compile) @ basic-webapp ---
[linux-jdk8] [INFO] [INFO]
[linux-jdk8] [INFO] [INFO] --- maven-resources-plugin:3.0.2:resources (default-resources) @ basic-webapp ---
[linux-jdk8] [INFO] [INFO] Using 'UTF-8' encoding to copy filtered resources.
[linux-jdk8] [INFO] [INFO] skip non existing resourceDirectory /home/jenkins/jenkins-slave/workspace/box_maven-archetypes_master-CWQIX33IMRENQAEK6YQUG4YRNL2FP25GOPO4YFHLPIHFEWUYVBDQ/m/maven-archetype-webapp/target/test-classes/projects/it-basic/project/basic-webapp/src/main/resources
[linux-jdk8] [INFO] [INFO]
[linux-jdk8] [INFO] [INFO] --- maven-compiler-plugin:3.8.0:compile (default-compile) @ basic-webapp ---
[linux-jdk8] [INFO] [INFO] No sources to compile
[linux-jdk8] [INFO] [INFO]
[linux-jdk8] [INFO] [INFO] --- maven-resources-plugin:3.0.2:testResources (default-testResources) @ basic-webapp ---
[linux-jdk8] [INFO] [INFO] Using 'UTF-8' encoding to copy filtered resources.
[linux-jdk8] [INFO] [INFO] skip non existing resourceDirectory /home/jenkins/jenkins-slave/workspace/box_maven-archetypes_master-CWQIX33IMRENQAEK6YQUG4YRNL2FP25GOPO4YFHLPIHFEWUYVBDQ/m/maven-archetype-webapp/target/test-classes/projects/it-basic/project/basic-webapp/src/test/resources
[linux-jdk8] [INFO] [INFO]
[linux-jdk8] [INFO] [INFO] --- maven-compiler-plugin:3.8.0:testCompile (default-testCompile) @ basic-webapp ---
[linux-jdk8] [INFO] [INFO] No sources to compile
[linux-jdk8] [INFO] [INFO]
[linux-jdk8] [INFO] [INFO] --- maven-surefire-plugin:2.22.1:test (default-test) @ basic-webapp ---
[linux-jdk8] [INFO] [INFO] No tests to run.
[linux-jdk8] [INFO] [INFO]
[linux-jdk8] [INFO] [INFO] --- maven-war-plugin:3.2.0:war (default-war) @ basic-webapp ---
[linux-jdk9] [INFO] [INFO] No sources to compile
[linux-jdk9] [INFO] [INFO]
[linux-jdk9] [INFO] [INFO] --- maven-resources-plugin:3.0.2:testResources (default-testResources) @ basic-webapp ---
[linux-jdk9] [INFO] [INFO] Using 'UTF-8' encoding to copy filtered resources.
[linux-jdk9] [INFO] [INFO] skip non existing resourceDirectory /home/jenkins/jenkins-slave/workspace/box_maven-archetypes_master-CWQIX33IMRENQAEK6YQUG4YRNL2FP25GOPO4YFHLPIHFEWUYVBDQ@2/m/maven-archetype-webapp/target/test-classes/projects/it-basic/project/basic-webapp/src/test/resources
[linux-jdk9] [INFO] [INFO]
[linux-jdk9] [INFO] [INFO] --- maven-compiler-plugin:3.8.0:testCompile (default-testCompile) @ basic-webapp ---
[linux-jdk9] [INFO] [INFO] No sources to compile
[linux-jdk9] [INFO] [INFO]
[linux-jdk9] [INFO] [INFO] --- maven-surefire-plugin:2.22.1:test (default-test) @ basic-webapp ---
[linux-jdk9] [INFO] [INFO] No tests to run.
[linux-jdk9] [INFO] [INFO]
[linux-jdk9] [INFO] [INFO] --- maven-war-plugin:3.2.0:war (default-war) @ basic-webapp ---
[linux-jdk8] [INFO] [INFO] Packaging webapp
[linux-jdk8] [INFO] [INFO] Assembling webapp [basic-webapp] in [/home/jenkins/jenkins-slave/workspace/box_maven-archetypes_master-CWQIX33IMRENQAEK6YQUG4YRNL2FP25GOPO4YFHLPIHFEWUYVBDQ/m/maven-archetype-webapp/target/test-classes/projects/it-basic/project/basic-webapp/target/basic-webapp]
[linux-jdk8] [INFO] [INFO] Processing war project
[linux-jdk8] [INFO] [INFO] Copying webapp resources [/home/jenkins/jenkins-slave/workspace/box_maven-archetypes_master-CWQIX33IMRENQAEK6YQUG4YRNL2FP25GOPO4YFHLPIHFEWUYVBDQ/m/maven-archetype-webapp/target/test-classes/projects/it-basic/project/basic-webapp/src/main/webapp]
[linux-jdk8] [INFO] [INFO] Webapp assembled in [48 msecs]
[linux-jdk8] [INFO] [INFO] Building war: /home/jenkins/jenkins-slave/workspace/box_maven-archetypes_master-CWQIX33IMRENQAEK6YQUG4YRNL2FP25GOPO4YFHLPIHFEWUYVBDQ/m/maven-archetype-webapp/target/test-classes/projects/it-basic/project/basic-webapp/target/basic-webapp.war
[linux-jdk8] [INFO] [INFO] ------------------------------------------------------------------------
[linux-jdk8] [INFO] [INFO] BUILD SUCCESS
[linux-jdk8] [INFO] [INFO] ------------------------------------------------------------------------
[linux-jdk8] [INFO] [INFO] Total time: 2.536 s
[linux-jdk8] [INFO] [INFO] Finished at: 2018-10-13T23:37:56Z
[linux-jdk8] [INFO] [INFO] ------------------------------------------------------------------------
[linux-jdk8] [INFO] [INFO] [jenkins-event-spy] Generated /home/jenkins/jenkins-slave/workspace/box_maven-archetypes_master-CWQIX33IMRENQAEK6YQUG4YRNL2FP25GOPO4YFHLPIHFEWUYVBDQ@tmp/withMavenb27c7883/maven-spy-20181013-233753-8706712720443411561045.log
[linux-jdk9] [INFO] [INFO] Packaging webapp
[linux-jdk9] [INFO] [INFO] Assembling webapp [basic-webapp] in [/home/jenkins/jenkins-slave/workspace/box_maven-archetypes_master-CWQIX33IMRENQAEK6YQUG4YRNL2FP25GOPO4YFHLPIHFEWUYVBDQ@2/m/maven-archetype-webapp/target/test-classes/projects/it-basic/project/basic-webapp/target/basic-webapp]
[linux-jdk9] [INFO] [INFO] Processing war project
[linux-jdk9] [INFO] [INFO] Copying webapp resources [/home/jenkins/jenkins-slave/workspace/box_maven-archetypes_master-CWQIX33IMRENQAEK6YQUG4YRNL2FP25GOPO4YFHLPIHFEWUYVBDQ@2/m/maven-archetype-webapp/target/test-classes/projects/it-basic/project/basic-webapp/src/main/webapp]
[linux-jdk9] [INFO] [INFO] Webapp assembled in [40 msecs]
[linux-jdk9] [INFO] [INFO] Building war: /home/jenkins/jenkins-slave/workspace/box_maven-archetypes_master-CWQIX33IMRENQAEK6YQUG4YRNL2FP25GOPO4YFHLPIHFEWUYVBDQ@2/m/maven-archetype-webapp/target/test-classes/projects/it-basic/project/basic-webapp/target/basic-webapp.war
[linux-jdk9] [INFO] [INFO] ------------------------------------------------------------------------
[linux-jdk9] [INFO] [INFO] BUILD SUCCESS
[linux-jdk9] [INFO] [INFO] ------------------------------------------------------------------------
[linux-jdk9] [INFO] [INFO] Total time: 2.322 s
[linux-jdk9] [INFO] [INFO] Finished at: 2018-10-13T23:37:56Z
[linux-jdk9] [INFO] [INFO] ------------------------------------------------------------------------
[linux-jdk9] [INFO] [INFO] [jenkins-event-spy] Generated /home/jenkins/jenkins-slave/workspace/box_maven-archetypes_master-CWQIX33IMRENQAEK6YQUG4YRNL2FP25GOPO4YFHLPIHFEWUYVBDQ@2@tmp/withMaven71552291/maven-spy-20181013-233754-29214295972245502123886.log
[linux-jdk9] [INFO] Post-archetype-generation invoker exit code: 0
[linux-jdk9] [INFO]
[linux-jdk9] [INFO] --- maven-checkstyle-plugin:3.0.0:check (checkstyle-check) @ maven-archetype-webapp ---
[linux-jdk8] [INFO] Post-archetype-generation invoker exit code: 0
[linux-jdk8] [INFO]
[linux-jdk8] [INFO] --- maven-checkstyle-plugin:3.0.0:check (checkstyle-check) @ maven-archetype-webapp ---
[linux-jdk8] [INFO] ------------------------------------------------------------------------
[linux-jdk8] [INFO] Reactor Summary:
[linux-jdk8] [INFO]
[linux-jdk8] [INFO] Apache Maven Archetypes 1.4-SNAPSHOT ............... SUCCESS [ 15.456 s]
[linux-jdk8] [INFO] Maven Archetype Archetype .......................... SUCCESS [ 15.536 s]
[linux-jdk8] [INFO] Maven Simple J2EE Archetype ........................ SUCCESS [  8.899 s]
[linux-jdk8] [INFO] Maven Plugin Archetype ............................. SUCCESS [ 25.404 s]
[linux-jdk8] [INFO] Maven Plugin Site Archetype ........................ SUCCESS [ 13.195 s]
[linux-jdk8] [INFO] Maven Portlet Archetype ............................ SUCCESS [  7.651 s]
[linux-jdk8] [INFO] Maven Quickstart Archetype ......................... SUCCESS [  7.137 s]
[linux-jdk8] [INFO] Maven Simple Project Archetype ..................... SUCCESS [ 11.801 s]
[linux-jdk8] [INFO] Maven Site Archetype ............................... SUCCESS [ 12.095 s]
[linux-jdk8] [INFO] Maven Archetype for Simple Site .................... SUCCESS [  8.379 s]
[linux-jdk8] [INFO] Maven Site Skin Archetype .......................... SUCCESS [ 19.524 s]
[linux-jdk8] [INFO] Maven Webapp Archetype 1.4-SNAPSHOT ................ SUCCESS [  5.557 s]
[linux-jdk8] [INFO] ------------------------------------------------------------------------
[linux-jdk8] [INFO] BUILD SUCCESS
[linux-jdk8] [INFO] ------------------------------------------------------------------------
[linux-jdk8] [INFO] Total time: 02:32 min
[linux-jdk8] [INFO] Finished at: 2018-10-13T23:37:57Z
[linux-jdk8] [INFO] ------------------------------------------------------------------------
[linux-jdk8] [WARNING] The requested profile "run-its" could not be activated because it does not exist.
[linux-jdk8] [INFO] [jenkins-event-spy] Generated /home/jenkins/jenkins-slave/workspace/box_maven-archetypes_master-CWQIX33IMRENQAEK6YQUG4YRNL2FP25GOPO4YFHLPIHFEWUYVBDQ@tmp/withMavenb27c7883/maven-spy-20181013-233524-4442417639589267282165.log
[Pipeline] [linux-jdk8] }
[Pipeline] [linux-jdk8] // dir
[linux-jdk9] [INFO] ------------------------------------------------------------------------
[linux-jdk9] [INFO] Reactor Summary:
[linux-jdk9] [INFO]
[linux-jdk9] [INFO] Apache Maven Archetypes 1.4-SNAPSHOT ............... SUCCESS [ 14.895 s]
[linux-jdk9] [INFO] Maven Archetype Archetype .......................... SUCCESS [ 15.977 s]
[linux-jdk9] [INFO] Maven Simple J2EE Archetype ........................ SUCCESS [  9.169 s]
[linux-jdk9] [INFO] Maven Plugin Archetype ............................. SUCCESS [ 27.068 s]
[linux-jdk9] [INFO] Maven Plugin Site Archetype ........................ SUCCESS [ 13.072 s]
[linux-jdk9] [INFO] Maven Portlet Archetype ............................ SUCCESS [  8.006 s]
[linux-jdk9] [INFO] Maven Quickstart Archetype ......................... SUCCESS [  7.260 s]
[linux-jdk9] [INFO] Maven Simple Project Archetype ..................... SUCCESS [ 13.086 s]
[linux-jdk9] [INFO] Maven Site Archetype ............................... SUCCESS [ 13.003 s]
[linux-jdk9] [INFO] Maven Archetype for Simple Site .................... SUCCESS [  8.758 s]
[linux-jdk9] [INFO] Maven Site Skin Archetype .......................... SUCCESS [ 19.782 s]
[linux-jdk9] [INFO] Maven Webapp Archetype 1.4-SNAPSHOT ................ SUCCESS [  5.591 s]
[linux-jdk9] [INFO] ------------------------------------------------------------------------
[linux-jdk9] [INFO] BUILD SUCCESS
[linux-jdk9] [INFO] ------------------------------------------------------------------------
[linux-jdk9] [INFO] Total time: 02:37 min
[linux-jdk9] [INFO] Finished at: 2018-10-13T23:37:57Z
[linux-jdk9] [INFO] ------------------------------------------------------------------------
[linux-jdk9] [WARNING] The requested profile "run-its" could not be activated because it does not exist.
[linux-jdk9] [INFO] [jenkins-event-spy] Generated /home/jenkins/jenkins-slave/workspace/box_maven-archetypes_master-CWQIX33IMRENQAEK6YQUG4YRNL2FP25GOPO4YFHLPIHFEWUYVBDQ@2@tmp/withMaven71552291/maven-spy-20181013-233520-351068106706675845920.log
[Pipeline] [linux-jdk8] }
[linux-jdk8] [withMaven] junitPublisher - Archive test results for Maven artifact archetype.it:basic-project:0.1-SNAPSHOT generated by maven-surefire-plugin:test (default-test): m/maven-archetype-archetype/target/test-classes/projects/it-basic/project/basic-archetype/target/test-classes/projects/it-basic/project/basic-project/target/surefire-reports/*.xml
[linux-jdk8] Recording test results
[linux-jdk8] [withMaven] junitPublisher - Archive test results for Maven artifact archetype.it:logging:0.1-SNAPSHOT generated by maven-surefire-plugin:test (default-test): m/maven-archetype-j2ee-simple/target/test-classes/projects/it-basic/project/basic-j2ee-simple/projects/logging/target/surefire-reports/*.xml
[linux-jdk8] Recording test results
[linux-jdk8] None of the test reports contained any result
[linux-jdk8] [withMaven] junitPublisher - Archive test results for Maven artifact archetype.it:primary-source:0.1-SNAPSHOT generated by maven-surefire-plugin:test (default-test): m/maven-archetype-j2ee-simple/target/test-classes/projects/it-basic/project/basic-j2ee-simple/primary-source/target/surefire-reports/*.xml
[linux-jdk8] Recording test results
[linux-jdk8] None of the test reports contained any result
[linux-jdk8] [withMaven] junitPublisher - Archive test results for Maven artifact archetype.it:servlet:0.1-SNAPSHOT generated by maven-surefire-plugin:test (default-test): m/maven-archetype-j2ee-simple/target/test-classes/projects/it-basic/project/basic-j2ee-simple/servlets/servlet/target/surefire-reports/*.xml
[linux-jdk8] Recording test results
[linux-jdk8] None of the test reports contained any result
[linux-jdk8] [withMaven] junitPublisher - Archive test results for Maven artifact archetype.it:ejbs:0.1-SNAPSHOT generated by maven-surefire-plugin:test (default-test): m/maven-archetype-j2ee-simple/target/test-classes/projects/it-basic/project/basic-j2ee-simple/ejbs/target/surefire-reports/*.xml
[linux-jdk8] Recording test results
[linux-jdk8] None of the test reports contained any result
[linux-jdk8] [withMaven] invokerPublisher - Archive invoker results for Maven artifact MavenArtifact{archetype.it:basic-plugin::0.1-SNAPSHOT(version: 0.1-SNAPSHOT, snapshot:false) } generated by PluginInvocation{org.apache.maven.plugins:maven-invoker-plugin:3.0.1@integration-test  integration-test}: m/maven-archetype-plugin/target/test-classes/projects/it-basic/project/basic-plugin/target/invoker-reports/*.xml
[linux-jdk8] performing MavenInvokerRecorder, reportsFilenamePattern:'**/m/maven-archetype-plugin/target/test-classes/projects/it-basic/project/basic-plugin/target/invoker-reports/BUILD*.xml', invokerBuildDir:'**/m/maven-archetype-plugin/target/test-classes/projects/it-basic/project/basic-plugin/target/it'
[linux-jdk8] Found reports:[/home/jenkins/jenkins-slave/workspace/box_maven-archetypes_master-CWQIX33IMRENQAEK6YQUG4YRNL2FP25GOPO4YFHLPIHFEWUYVBDQ/m/maven-archetype-plugin/target/test-classes/projects/it-basic/project/basic-plugin/target/invoker-reports/BUILD-simple-it.xml]
[linux-jdk8] Found logs:[/home/jenkins/jenkins-slave/workspace/box_maven-archetypes_master-CWQIX33IMRENQAEK6YQUG4YRNL2FP25GOPO4YFHLPIHFEWUYVBDQ/m/maven-archetype-plugin/target/test-classes/projects/it-basic/project/basic-plugin/target/it/simple-it/build.log]
[linux-jdk8] Finished parsing Maven Invoker results (found 1)
[linux-jdk8] [withMaven] junitPublisher - Archive test results for Maven artifact archetype.it:basic-plugin:0.1-SNAPSHOT generated by maven-surefire-plugin:test (default-test): m/maven-archetype-plugin/target/test-classes/projects/it-basic/project/basic-plugin/target/surefire-reports/*.xml
[linux-jdk8] Recording test results
[linux-jdk8] [withMaven] junitPublisher - Archive test results for Maven artifact archetype.it:basic-portlet:0.1-SNAPSHOT generated by maven-surefire-plugin:test (default-test): m/maven-archetype-portlet/target/test-classes/projects/it-basic/project/basic-portlet/target/surefire-reports/*.xml
[linux-jdk8] Recording test results
[linux-jdk8] None of the test reports contained any result
[linux-jdk8] [withMaven] junitPublisher - Archive test results for Maven artifact archetype.it:basic-quickstart:0.1-SNAPSHOT generated by maven-surefire-plugin:test (default-test): m/maven-archetype-quickstart/target/test-classes/projects/it-basic/project/basic-quickstart/target/surefire-reports/*.xml
[linux-jdk8] Recording test results
[linux-jdk8] [withMaven] junitPublisher - Archive test results for Maven artifact archetype.it:basic-simple:0.1-SNAPSHOT generated by maven-surefire-plugin:test (default-test): m/maven-archetype-simple/target/test-classes/projects/it-basic/project/basic-simple/target/surefire-reports/*.xml
[linux-jdk8] Recording test results
[linux-jdk8] [withMaven] invokerPublisher - Archive invoker results for Maven artifact MavenArtifact{archetype.it:basic-skin::0.1-SNAPSHOT(version: 0.1-SNAPSHOT, snapshot:false) } generated by PluginInvocation{org.apache.maven.plugins:maven-invoker-plugin:3.0.1@integration-test  integration-test}: m/maven-archetype-site-skin/target/test-classes/projects/it-basic/project/basic-skin/target/invoker-reports/*.xml
[linux-jdk8] performing MavenInvokerRecorder, reportsFilenamePattern:'**/m/maven-archetype-site-skin/target/test-classes/projects/it-basic/project/basic-skin/target/invoker-reports/BUILD*.xml', invokerBuildDir:'**/m/maven-archetype-site-skin/target/test-classes/projects/it-basic/project/basic-skin/target/it'
[linux-jdk8] Found reports:[/home/jenkins/jenkins-slave/workspace/box_maven-archetypes_master-CWQIX33IMRENQAEK6YQUG4YRNL2FP25GOPO4YFHLPIHFEWUYVBDQ/m/maven-archetype-site-skin/target/test-classes/projects/it-basic/project/basic-skin/target/invoker-reports/BUILD-sample.xml]
[linux-jdk8] Found logs:[/home/jenkins/jenkins-slave/workspace/box_maven-archetypes_master-CWQIX33IMRENQAEK6YQUG4YRNL2FP25GOPO4YFHLPIHFEWUYVBDQ/m/maven-archetype-site-skin/target/test-classes/projects/it-basic/project/basic-skin/target/it/sample/build.log]
[linux-jdk8] Finished parsing Maven Invoker results (found 1)
[linux-jdk8] [withMaven] junitPublisher - Archive test results for Maven artifact archetype.it:basic-skin:0.1-SNAPSHOT generated by maven-surefire-plugin:test (default-test): m/maven-archetype-site-skin/target/test-classes/projects/it-basic/project/basic-skin/target/surefire-reports/*.xml
[linux-jdk8] Recording test results
[linux-jdk8] None of the test reports contained any result
[linux-jdk8] [withMaven] junitPublisher - Archive test results for Maven artifact archetype.it:basic-webapp:0.1-SNAPSHOT generated by maven-surefire-plugin:test (default-test): m/maven-archetype-webapp/target/test-classes/projects/it-basic/project/basic-webapp/target/surefire-reports/*.xml
[linux-jdk8] Recording test results
[linux-jdk8] None of the test reports contained any result
[Pipeline] [linux-jdk8] // withMaven
[Pipeline] [linux-jdk9] }
[Pipeline] [linux-jdk8] cleanWs
[Pipeline] [linux-jdk9] // dir
[linux-jdk8] [WS-CLEANUP] Deleting project workspace...[WS-CLEANUP] done
[Pipeline] [linux-jdk9] }
[linux-jdk9] [withMaven] junitPublisher - Archive test results for Maven artifact archetype.it:basic-project:0.1-SNAPSHOT generated by maven-surefire-plugin:test (default-test): m/maven-archetype-archetype/target/test-classes/projects/it-basic/project/basic-archetype/target/test-classes/projects/it-basic/project/basic-project/target/surefire-reports/*.xml
[linux-jdk9] Recording test results
[linux-jdk9] [withMaven] junitPublisher - Archive test results for Maven artifact archetype.it:logging:0.1-SNAPSHOT generated by maven-surefire-plugin:test (default-test): m/maven-archetype-j2ee-simple/target/test-classes/projects/it-basic/project/basic-j2ee-simple/projects/logging/target/surefire-reports/*.xml
[linux-jdk9] Recording test results
[linux-jdk9] None of the test reports contained any result
[linux-jdk9] [withMaven] junitPublisher - Archive test results for Maven artifact archetype.it:primary-source:0.1-SNAPSHOT generated by maven-surefire-plugin:test (default-test): m/maven-archetype-j2ee-simple/target/test-classes/projects/it-basic/project/basic-j2ee-simple/primary-source/target/surefire-reports/*.xml
[linux-jdk9] Recording test results
[linux-jdk9] None of the test reports contained any result
[linux-jdk9] [withMaven] junitPublisher - Archive test results for Maven artifact archetype.it:servlet:0.1-SNAPSHOT generated by maven-surefire-plugin:test (default-test): m/maven-archetype-j2ee-simple/target/test-classes/projects/it-basic/project/basic-j2ee-simple/servlets/servlet/target/surefire-reports/*.xml
[linux-jdk9] Recording test results
[linux-jdk9] None of the test reports contained any result
[linux-jdk9] [withMaven] junitPublisher - Archive test results for Maven artifact archetype.it:ejbs:0.1-SNAPSHOT generated by maven-surefire-plugin:test (default-test): m/maven-archetype-j2ee-simple/target/test-classes/projects/it-basic/project/basic-j2ee-simple/ejbs/target/surefire-reports/*.xml
[linux-jdk9] Recording test results
[linux-jdk9] None of the test reports contained any result
[linux-jdk9] [withMaven] invokerPublisher - Archive invoker results for Maven artifact MavenArtifact{archetype.it:basic-plugin::0.1-SNAPSHOT(version: 0.1-SNAPSHOT, snapshot:false) } generated by PluginInvocation{org.apache.maven.plugins:maven-invoker-plugin:3.0.1@integration-test  integration-test}: m/maven-archetype-plugin/target/test-classes/projects/it-basic/project/basic-plugin/target/invoker-reports/*.xml
[linux-jdk9] performing MavenInvokerRecorder, reportsFilenamePattern:'**/m/maven-archetype-plugin/target/test-classes/projects/it-basic/project/basic-plugin/target/invoker-reports/BUILD*.xml', invokerBuildDir:'**/m/maven-archetype-plugin/target/test-classes/projects/it-basic/project/basic-plugin/target/it'
[linux-jdk9] Found reports:[/home/jenkins/jenkins-slave/workspace/box_maven-archetypes_master-CWQIX33IMRENQAEK6YQUG4YRNL2FP25GOPO4YFHLPIHFEWUYVBDQ@2/m/maven-archetype-plugin/target/test-classes/projects/it-basic/project/basic-plugin/target/invoker-reports/BUILD-simple-it.xml]
[linux-jdk9] Found logs:[/home/jenkins/jenkins-slave/workspace/box_maven-archetypes_master-CWQIX33IMRENQAEK6YQUG4YRNL2FP25GOPO4YFHLPIHFEWUYVBDQ@2/m/maven-archetype-plugin/target/test-classes/projects/it-basic/project/basic-plugin/target/it/simple-it/build.log]
[linux-jdk9] Finished parsing Maven Invoker results (found 1)
[linux-jdk9] [withMaven] junitPublisher - Archive test results for Maven artifact archetype.it:basic-plugin:0.1-SNAPSHOT generated by maven-surefire-plugin:test (default-test): m/maven-archetype-plugin/target/test-classes/projects/it-basic/project/basic-plugin/target/surefire-reports/*.xml
[linux-jdk9] Recording test results
[linux-jdk9] [withMaven] junitPublisher - Archive test results for Maven artifact archetype.it:basic-portlet:0.1-SNAPSHOT generated by maven-surefire-plugin:test (default-test): m/maven-archetype-portlet/target/test-classes/projects/it-basic/project/basic-portlet/target/surefire-reports/*.xml
[linux-jdk9] Recording test results
[linux-jdk9] None of the test reports contained any result
[linux-jdk9] [withMaven] junitPublisher - Archive test results for Maven artifact archetype.it:basic-quickstart:0.1-SNAPSHOT generated by maven-surefire-plugin:test (default-test): m/maven-archetype-quickstart/target/test-classes/projects/it-basic/project/basic-quickstart/target/surefire-reports/*.xml
[linux-jdk9] Recording test results
[linux-jdk9] [withMaven] junitPublisher - Archive test results for Maven artifact archetype.it:basic-simple:0.1-SNAPSHOT generated by maven-surefire-plugin:test (default-test): m/maven-archetype-simple/target/test-classes/projects/it-basic/project/basic-simple/target/surefire-reports/*.xml
[linux-jdk9] Recording test results
[linux-jdk9] [withMaven] invokerPublisher - Archive invoker results for Maven artifact MavenArtifact{archetype.it:basic-skin::0.1-SNAPSHOT(version: 0.1-SNAPSHOT, snapshot:false) } generated by PluginInvocation{org.apache.maven.plugins:maven-invoker-plugin:3.0.1@integration-test  integration-test}: m/maven-archetype-site-skin/target/test-classes/projects/it-basic/project/basic-skin/target/invoker-reports/*.xml
[linux-jdk9] performing MavenInvokerRecorder, reportsFilenamePattern:'**/m/maven-archetype-site-skin/target/test-classes/projects/it-basic/project/basic-skin/target/invoker-reports/BUILD*.xml', invokerBuildDir:'**/m/maven-archetype-site-skin/target/test-classes/projects/it-basic/project/basic-skin/target/it'
[linux-jdk9] Found reports:[/home/jenkins/jenkins-slave/workspace/box_maven-archetypes_master-CWQIX33IMRENQAEK6YQUG4YRNL2FP25GOPO4YFHLPIHFEWUYVBDQ@2/m/maven-archetype-site-skin/target/test-classes/projects/it-basic/project/basic-skin/target/invoker-reports/BUILD-sample.xml]
[linux-jdk9] Found logs:[/home/jenkins/jenkins-slave/workspace/box_maven-archetypes_master-CWQIX33IMRENQAEK6YQUG4YRNL2FP25GOPO4YFHLPIHFEWUYVBDQ@2/m/maven-archetype-site-skin/target/test-classes/projects/it-basic/project/basic-skin/target/it/sample/build.log]
[linux-jdk9] Finished parsing Maven Invoker results (found 1)
[linux-jdk9] [withMaven] junitPublisher - Archive test results for Maven artifact archetype.it:basic-skin:0.1-SNAPSHOT generated by maven-surefire-plugin:test (default-test): m/maven-archetype-site-skin/target/test-classes/projects/it-basic/project/basic-skin/target/surefire-reports/*.xml
[linux-jdk9] Recording test results
[linux-jdk9] None of the test reports contained any result
[linux-jdk9] [withMaven] junitPublisher - Archive test results for Maven artifact archetype.it:basic-webapp:0.1-SNAPSHOT generated by maven-surefire-plugin:test (default-test): m/maven-archetype-webapp/target/test-classes/projects/it-basic/project/basic-webapp/target/surefire-reports/*.xml
[linux-jdk9] Recording test results
[linux-jdk9] None of the test reports contained any result
[Pipeline] [linux-jdk9] // withMaven
[Pipeline] [linux-jdk9] cleanWs
[Pipeline] [linux-jdk8] }
[Pipeline] [linux-jdk8] // stage
[Pipeline] [linux-jdk8] }
[Pipeline] [linux-jdk8] // node
[Pipeline] [linux-jdk8] }
[linux-jdk9] [WS-CLEANUP] Deleting project workspace...[WS-CLEANUP] done
[Pipeline] [linux-jdk9] }
[Pipeline] [linux-jdk9] // stage
[Pipeline] [linux-jdk9] }
[Pipeline] [linux-jdk9] // node
[Pipeline] [linux-jdk9] }
[Pipeline] // parallel
[Pipeline] stage
[Pipeline] { (Notifications)
[Pipeline] echo
Build result: FAILURE
[Pipeline] jiraIssueSelector
[Pipeline] emailext