Build failed in Jenkins: Maven TLP » maven-archetype » buildfix #23

classic Classic list List threaded Threaded
4 messages Options
Reply | Threaded
Open this post in threaded view
|

Build failed in Jenkins: Maven TLP » maven-archetype » buildfix #23

Apache Jenkins Server-2
See https://builds.apache.org/job/maven-box/job/maven-archetype/job/buildfix/23/

Changes:

* deleted unnecessary calls ".flush()"
* deleted unnecessary calls ".flush()"
* deleted unnecessary calls ".flush()"
* deleted unnecessary calls ".flush()"
* deleted unnecessary calls ".flush()"
* deleted unnecessary calls ".flush()"
* deleted unnecessary calls ".flush()"

All tests passed

Build log:
[...truncated 10613 lines...]
[Pipeline] }
[Pipeline] // ws
[Pipeline] }
[Pipeline] // node
[Pipeline] }
[INFO] run post-build script verify.bsh
[INFO]           create-from-project/pom.xml ...................... SUCCESS (7.8 s)
[INFO] Building: exclude-patterns/pom.xml
[INFO] snapshot com.company.proficio:proficio-archetype:1.0-SNAPSHOT: checking for updates from Nexus
[INFO] artifact com.company.proficio.proficio-archetype:1.0-SNAPSHOT: checking for updates from central
[INFO] run post-build script verify.groovy
[INFO]           roundtrip-multi/pom.xml .......................... SUCCESS (24.6 s)
[INFO] Building: ARCHETYPE-536_groovy-grape/pom.xml
[withMaven] Publishers: Generated Artifacts Publisher: 414 ms, Junit Publisher: 461 ms, Open Task Scanner Publisher: 359 ms, Dependencies Fingerprint Publisher: 69 ms, Invoker Publisher: 17555 ms, Pipeline Graph Publisher: 2 ms
[Pipeline] // withMaven
[Pipeline] cleanWs
[WS-CLEANUP] Deleting project workspace...
[WS-CLEANUP] Deferred wipeout is used...
[WS-CLEANUP] done
[Pipeline] }
[Pipeline] // stage
[Pipeline] }
[Pipeline] // ws
[Pipeline] }
[Pipeline] // node
[Pipeline] }
[withMaven] Publishers: Generated Artifacts Publisher: 6011 ms, Junit Publisher: 8204 ms, Open Task Scanner Publisher: 3594 ms, Dependencies Fingerprint Publisher: 1574 ms, Invoker Publisher: 24824 ms, Pipeline Graph Publisher: 4 ms
[Pipeline] // withMaven
[Pipeline] cleanWs
[WS-CLEANUP] Deleting project workspace...
[WS-CLEANUP] Deferred wipeout is used...
[WS-CLEANUP] done
[Pipeline] }
[Pipeline] // stage
[Pipeline] }
[Pipeline] // ws
[Pipeline] }
[Pipeline] // node
[Pipeline] }
[INFO] run post-build script verify.groovy
[INFO]           exclude-patterns/pom.xml ......................... SUCCESS (7.8 s)
[INFO] Building: ARCHETYPE-521_archetype-repo
[INFO] run post-build script verify.groovy
[INFO]           ARCHETYPE-521_archetype-repo ..................... SUCCESS (4.2 s)
[INFO] Building: build-archetype/pom.xml
[INFO] run pre-build script setup.bsh
[INFO] snapshot org.apache.maven.plugins.archetype.its:archetype536-archetype:1.0-SNAPSHOT: checking for updates from Nexus
[INFO] artifact org.apache.maven.plugins.archetype.its.archetype536-archetype:1.0-SNAPSHOT: checking for updates from central
[INFO] run post-build script verify.groovy
[INFO]           ARCHETYPE-536_groovy-grape/pom.xml ............... SUCCESS (13.7 s)
[INFO] Building: build-archetype/pom.xml
[INFO] run pre-build script setup.bsh
[INFO] run post-build script verify.bsh
[INFO]           build-archetype/pom.xml .......................... SUCCESS (15.7 s)
[INFO] Building: roundtrip-multi/pom.xml
[INFO] run post-build script verify.bsh
[INFO]           build-archetype/pom.xml .......................... SUCCESS (16.9 s)
[INFO] Building: exclude-patterns-2/pom.xml
[INFO] run post-build script verify.groovy
[INFO]           exclude-patterns-2/pom.xml ....................... SUCCESS (11.1 s)
[INFO] -------------------------------------------------
[INFO] Build Summary:
[INFO]   Passed: 25, Failed: 0, Errors: 0, Skipped: 0
[INFO] -------------------------------------------------
[INFO]
[INFO] --- mrm-maven-plugin:1.1.0:stop (mirror) @ maven-archetype-plugin ---
[INFO] Stopping Mock Repository Manager on http://localhost:38798
[INFO] Stopped SocketConnector@0.0.0.0:38798
[INFO] Mock Repository Manager http://localhost:38798 is stopped.
[INFO]
[INFO] --- mrm-maven-plugin:1.1.0:stop (archetype-repository) @ maven-archetype-plugin ---
[INFO] Stopping Mock Repository Manager on http://localhost:34848
[INFO] Stopped SocketConnector@0.0.0.0:34848
[INFO] Mock Repository Manager http://localhost:34848 is stopped.
[INFO]
[INFO] --- maven-checkstyle-plugin:3.0.0:check (checkstyle-check) @ maven-archetype-plugin ---
[INFO] There are 46 errors reported by Checkstyle 6.18 with config/maven_checks.xml ruleset.
[INFO] Ignored 46 errors, 0 violation remaining.
[INFO] ------------------------------------------------------------------------
[INFO] Reactor Summary:
[INFO]
[INFO] Maven Archetype 3.1.2-SNAPSHOT ..................... SUCCESS [  6.700 s]
[INFO] Maven Archetype Models ............................. SUCCESS [  0.894 s]
[INFO] Maven Archetype Catalog Model ...................... SUCCESS [  3.861 s]
[INFO] Maven Archetype Descriptor Model ................... SUCCESS [  1.460 s]
[INFO] Maven Archetype Common ............................. SUCCESS [ 24.061 s]
[INFO] Maven Archetype Packaging .......................... SUCCESS [  0.695 s]
[INFO] Maven Archetype Plugin 3.1.2-SNAPSHOT .............. SUCCESS [06:00 min]
[INFO] ------------------------------------------------------------------------
[INFO] BUILD SUCCESS
[INFO] ------------------------------------------------------------------------
[INFO] Total time: 06:38 min
[INFO] Finished at: 2019-07-29T07:56:25Z
[INFO] ------------------------------------------------------------------------
[INFO] [jenkins-event-spy] Generated /home/jenkins/jenkins-slave/workspace/ven-box_maven-archetype_buildfix@2@tmp/withMaven883e06ef/maven-spy-20190729-074946-386338190780849246998.log
[Pipeline] }
[Pipeline] // dir
[Pipeline] }
[INFO] snapshot com.company.proficio:proficio-archetype:1.0-SNAPSHOT: checking for updates from Nexus
[INFO] artifact com.company.proficio.proficio-archetype:1.0-SNAPSHOT: checking for updates from central
[INFO] run post-build script verify.groovy
[INFO]           roundtrip-multi/pom.xml .......................... SUCCESS (17.1 s)
[INFO] Building: create-from-project-exclude-patterns/pom.xml
[withMaven] artifactsPublisher - Archive artifact linux-jdk7-m3.5.x_build/pom.xml under org/apache/maven/archetype/maven-archetype/3.1.2-SNAPSHOT/maven-archetype-3.1.2-SNAPSHOT.pom
[withMaven] artifactsPublisher - Archive artifact linux-jdk7-m3.5.x_build/target/maven-archetype-3.1.2-SNAPSHOT-site.xml under org/apache/maven/archetype/maven-archetype/3.1.2-SNAPSHOT/maven-archetype-3.1.2-SNAPSHOT-site.xml
[withMaven] artifactsPublisher - Archive artifact linux-jdk7-m3.5.x_build/archetype-models/pom.xml under org/apache/maven/archetype/archetype-models/3.1.2-SNAPSHOT/archetype-models-3.1.2-SNAPSHOT.pom
[withMaven] artifactsPublisher - Archive artifact linux-jdk7-m3.5.x_build/archetype-models/target/archetype-models-3.1.2-SNAPSHOT-site.xml under org/apache/maven/archetype/archetype-models/3.1.2-SNAPSHOT/archetype-models-3.1.2-SNAPSHOT-site.xml
[withMaven] artifactsPublisher - Archive artifact linux-jdk7-m3.5.x_build/archetype-models/archetype-catalog/pom.xml under org/apache/maven/archetype/archetype-catalog/3.1.2-SNAPSHOT/archetype-catalog-3.1.2-SNAPSHOT.pom
[withMaven] artifactsPublisher - Archive artifact linux-jdk7-m3.5.x_build/archetype-models/archetype-catalog/target/archetype-catalog-3.1.2-SNAPSHOT.jar under org/apache/maven/archetype/archetype-catalog/3.1.2-SNAPSHOT/archetype-catalog-3.1.2-SNAPSHOT.jar
[withMaven] artifactsPublisher - Archive artifact linux-jdk7-m3.5.x_build/archetype-models/archetype-descriptor/pom.xml under org/apache/maven/archetype/archetype-descriptor/3.1.2-SNAPSHOT/archetype-descriptor-3.1.2-SNAPSHOT.pom
[withMaven] artifactsPublisher - Archive artifact linux-jdk7-m3.5.x_build/archetype-models/archetype-descriptor/target/archetype-descriptor-3.1.2-SNAPSHOT.jar under org/apache/maven/archetype/archetype-descriptor/3.1.2-SNAPSHOT/archetype-descriptor-3.1.2-SNAPSHOT.jar
[withMaven] artifactsPublisher - Archive artifact linux-jdk7-m3.5.x_build/archetype-common/pom.xml under org/apache/maven/archetype/archetype-common/3.1.2-SNAPSHOT/archetype-common-3.1.2-SNAPSHOT.pom
[withMaven] artifactsPublisher - Archive artifact linux-jdk7-m3.5.x_build/archetype-common/target/archetype-common-3.1.2-SNAPSHOT.jar under org/apache/maven/archetype/archetype-common/3.1.2-SNAPSHOT/archetype-common-3.1.2-SNAPSHOT.jar
[withMaven] artifactsPublisher - Archive artifact linux-jdk7-m3.5.x_build/archetype-packaging/pom.xml under org/apache/maven/archetype/archetype-packaging/3.1.2-SNAPSHOT/archetype-packaging-3.1.2-SNAPSHOT.pom
[withMaven] artifactsPublisher - Archive artifact linux-jdk7-m3.5.x_build/archetype-packaging/target/archetype-packaging-3.1.2-SNAPSHOT.jar under org/apache/maven/archetype/archetype-packaging/3.1.2-SNAPSHOT/archetype-packaging-3.1.2-SNAPSHOT.jar
[withMaven] artifactsPublisher - Archive artifact linux-jdk7-m3.5.x_build/maven-archetype-plugin/pom.xml under org/apache/maven/plugins/maven-archetype-plugin/3.1.2-SNAPSHOT/maven-archetype-plugin-3.1.2-SNAPSHOT.pom
[withMaven] artifactsPublisher - Archive artifact linux-jdk7-m3.5.x_build/maven-archetype-plugin/target/maven-archetype-plugin-3.1.2-SNAPSHOT.jar under org/apache/maven/plugins/maven-archetype-plugin/3.1.2-SNAPSHOT/maven-archetype-plugin-3.1.2-SNAPSHOT.jar
[withMaven] junitPublisher - Archive test results for Maven artifact org.apache.maven.archetype:archetype-catalog:jar:3.1.2-SNAPSHOT generated by maven-surefire-plugin:test (default-test): linux-jdk7-m3.5.x_build/archetype-models/archetype-catalog/target/surefire-reports/*.xml
[withMaven] junitPublisher - Archive test results for Maven artifact org.apache.maven.archetype:archetype-descriptor:jar:3.1.2-SNAPSHOT generated by maven-surefire-plugin:test (default-test): linux-jdk7-m3.5.x_build/archetype-models/archetype-descriptor/target/surefire-reports/*.xml
[withMaven] junitPublisher - Archive test results for Maven artifact org.apache.maven.archetype:archetype-common:jar:3.1.2-SNAPSHOT generated by maven-surefire-plugin:test (default-test): linux-jdk7-m3.5.x_build/archetype-common/target/surefire-reports/*.xml
[withMaven] junitPublisher - Archive test results for Maven artifact org.apache.maven.archetype:archetype-packaging:jar:3.1.2-SNAPSHOT generated by maven-surefire-plugin:test (default-test): linux-jdk7-m3.5.x_build/archetype-packaging/target/surefire-reports/*.xml
[withMaven] junitPublisher - Archive test results for Maven artifact org.apache.maven.plugins:maven-archetype-plugin:maven-plugin:3.1.2-SNAPSHOT generated by maven-surefire-plugin:test (default-test): linux-jdk7-m3.5.x_build/maven-archetype-plugin/target/surefire-reports/*.xml
Recording test results
[INFO] run post-build script verify.bsh
[INFO]           create-from-project-exclude-patterns/pom.xml ..... SUCCESS (7.8 s)
[INFO] Building: include-file-with-no-extension/pom.xml
[INFO] run post-build script verify.groovy
[INFO]           include-file-with-no-extension/pom.xml ........... SUCCESS (7.8 s)
[INFO] Building: included-system-properties/pom.xml
[withMaven] openTasksPublisher - Scan Tasks for Maven artifact org.apache.maven.archetype:archetype-common:jar:3.1.2-SNAPSHOT in source directory linux-jdk7-m3.5.x_build/archetype-common/src/main/java
[withMaven] openTasksPublisher - Scan Tasks for Maven artifact org.apache.maven.plugins:maven-archetype-plugin:maven-plugin:3.1.2-SNAPSHOT in source directory linux-jdk7-m3.5.x_build/maven-archetype-plugin/src/main/java
[TASKS] Scanning folder '/home/jenkins/jenkins-slave/workspace/ven-box_maven-archetype_buildfix@2' for files matching the pattern 'linux-jdk7-m3.5.x_build/archetype-common/src/main/java/**/*,linux-jdk7-m3.5.x_build/maven-archetype-plugin/src/main/java/**/*' - excludes: null
[TASKS] Found 89 files to scan for tasks
[TASKS] Found 26 open tasks.
Skipping warnings blame since pipelines do not have an SCM link.%n
[TASKS] Computing warning deltas based on reference build #22
[withMaven] invokerPublisher - Archive invoker results for Maven artifact MavenArtifact{org.apache.maven.plugins:maven-archetype-plugin:maven-plugin:3.1.2-SNAPSHOT(version: 3.1.2-SNAPSHOT, snapshot:false) } generated by PluginInvocation{org.apache.maven.plugins:maven-invoker-plugin:3.2.0@run  integration-test}: linux-jdk7-m3.5.x_build/maven-archetype-plugin/target/invoker-reports/*.xml
[INFO] run post-build script verify.groovy
[INFO]           included-system-properties/pom.xml ............... SUCCESS (7.7 s)
[INFO] Building: generate-basic
[INFO] run post-build script verify.bsh
[INFO]           generate-basic ................................... SUCCESS (3.8 s)
[INFO] Building: create-3/pom.xml
[INFO] run post-build script verify.groovy
[INFO]           create-3/pom.xml ................................. SUCCESS (8.5 s)
[INFO] Building: build-ignore-eol/pom.xml
[INFO] run pre-build script setup.bsh
[withMaven] Publishers: Generated Artifacts Publisher: 5930 ms, Junit Publisher: 8108 ms, Open Task Scanner Publisher: 3610 ms, Dependencies Fingerprint Publisher: 1569 ms, Invoker Publisher: 26000 ms, Pipeline Graph Publisher: 5 ms
[Pipeline] // withMaven
[Pipeline] cleanWs
[WS-CLEANUP] Deleting project workspace...
[WS-CLEANUP] Deferred wipeout is used...
[WS-CLEANUP] done
[Pipeline] }
[Pipeline] // stage
[Pipeline] }
[Pipeline] // ws
[Pipeline] }
[Pipeline] // node
[Pipeline] }
[INFO] run post-build script verify.bsh
[INFO]           build-ignore-eol/pom.xml ......................... SUCCESS (15.6 s)
[INFO] -------------------------------------------------
[INFO] Build Summary:
[INFO]   Passed: 25, Failed: 0, Errors: 0, Skipped: 0
[INFO] -------------------------------------------------
[INFO]
[INFO] --- mrm-maven-plugin:1.1.0:stop (mirror) @ maven-archetype-plugin ---
[INFO] Stopping Mock Repository Manager on http://localhost:41697
[INFO] Stopped SocketConnector@0.0.0.0:41697
[INFO] Mock Repository Manager http://localhost:41697 is stopped.
[INFO]
[INFO] --- mrm-maven-plugin:1.1.0:stop (archetype-repository) @ maven-archetype-plugin ---
[INFO] Stopping Mock Repository Manager on http://localhost:32836
[INFO] Stopped SocketConnector@0.0.0.0:32836
[INFO] Mock Repository Manager http://localhost:32836 is stopped.
[INFO]
[INFO] --- maven-checkstyle-plugin:3.0.0:check (checkstyle-check) @ maven-archetype-plugin ---
[INFO] There are 46 errors reported by Checkstyle 6.18 with config/maven_checks.xml ruleset.
[INFO] Ignored 46 errors, 0 violation remaining.
[INFO] ------------------------------------------------------------------------
[INFO] Reactor Summary:
[INFO]
[INFO] Maven Archetype .................................... SUCCESS [ 26.042 s]
[INFO] Maven Archetype Models ............................. SUCCESS [  1.848 s]
[INFO] Maven Archetype Catalog Model ...................... SUCCESS [ 10.170 s]
[INFO] Maven Archetype Descriptor Model ................... SUCCESS [  1.960 s]
[INFO] Maven Archetype Common ............................. SUCCESS [ 42.625 s]
[INFO] Maven Archetype Packaging .......................... SUCCESS [  1.196 s]
[INFO] Maven Archetype Plugin ............................. SUCCESS [05:56 min]
[INFO] ------------------------------------------------------------------------
[INFO] BUILD SUCCESS
[INFO] ------------------------------------------------------------------------
[INFO] Total time: 07:22 min
[INFO] Finished at: 2019-07-29T07:57:18+00:00
[INFO] Final Memory: 55M/922M
[INFO] ------------------------------------------------------------------------
[INFO] [jenkins-event-spy] Generated /home/jenkins/jenkins-slave/workspace/ven-box_maven-archetype_buildfix@2@tmp/withMavenfe54704c/maven-spy-20190729-074955-1066047795650312503371.log
[Pipeline] }
[Pipeline] // dir
[Pipeline] }
[withMaven] artifactsPublisher - Archive artifact linux-jdk7-m3.3.x_build/pom.xml under org/apache/maven/archetype/maven-archetype/3.1.2-SNAPSHOT/maven-archetype-3.1.2-SNAPSHOT.pom
[withMaven] artifactsPublisher - Archive artifact linux-jdk7-m3.3.x_build/target/maven-archetype-3.1.2-SNAPSHOT-site.xml under org/apache/maven/archetype/maven-archetype/3.1.2-SNAPSHOT/maven-archetype-3.1.2-SNAPSHOT-site.xml
[withMaven] artifactsPublisher - Archive artifact linux-jdk7-m3.3.x_build/archetype-models/pom.xml under org/apache/maven/archetype/archetype-models/3.1.2-SNAPSHOT/archetype-models-3.1.2-SNAPSHOT.pom
[withMaven] artifactsPublisher - Archive artifact linux-jdk7-m3.3.x_build/archetype-models/target/archetype-models-3.1.2-SNAPSHOT-site.xml under org/apache/maven/archetype/archetype-models/3.1.2-SNAPSHOT/archetype-models-3.1.2-SNAPSHOT-site.xml
[withMaven] artifactsPublisher - Archive artifact linux-jdk7-m3.3.x_build/archetype-models/archetype-catalog/pom.xml under org/apache/maven/archetype/archetype-catalog/3.1.2-SNAPSHOT/archetype-catalog-3.1.2-SNAPSHOT.pom
[withMaven] artifactsPublisher - Archive artifact linux-jdk7-m3.3.x_build/archetype-models/archetype-catalog/target/archetype-catalog-3.1.2-SNAPSHOT.jar under org/apache/maven/archetype/archetype-catalog/3.1.2-SNAPSHOT/archetype-catalog-3.1.2-SNAPSHOT.jar
[withMaven] artifactsPublisher - Archive artifact linux-jdk7-m3.3.x_build/archetype-models/archetype-descriptor/pom.xml under org/apache/maven/archetype/archetype-descriptor/3.1.2-SNAPSHOT/archetype-descriptor-3.1.2-SNAPSHOT.pom
[withMaven] artifactsPublisher - Archive artifact linux-jdk7-m3.3.x_build/archetype-models/archetype-descriptor/target/archetype-descriptor-3.1.2-SNAPSHOT.jar under org/apache/maven/archetype/archetype-descriptor/3.1.2-SNAPSHOT/archetype-descriptor-3.1.2-SNAPSHOT.jar
[withMaven] artifactsPublisher - Archive artifact linux-jdk7-m3.3.x_build/archetype-common/pom.xml under org/apache/maven/archetype/archetype-common/3.1.2-SNAPSHOT/archetype-common-3.1.2-SNAPSHOT.pom
[withMaven] artifactsPublisher - Archive artifact linux-jdk7-m3.3.x_build/archetype-common/target/archetype-common-3.1.2-SNAPSHOT.jar under org/apache/maven/archetype/archetype-common/3.1.2-SNAPSHOT/archetype-common-3.1.2-SNAPSHOT.jar
[withMaven] artifactsPublisher - Archive artifact linux-jdk7-m3.3.x_build/archetype-packaging/pom.xml under org/apache/maven/archetype/archetype-packaging/3.1.2-SNAPSHOT/archetype-packaging-3.1.2-SNAPSHOT.pom
[withMaven] artifactsPublisher - Archive artifact linux-jdk7-m3.3.x_build/archetype-packaging/target/archetype-packaging-3.1.2-SNAPSHOT.jar under org/apache/maven/archetype/archetype-packaging/3.1.2-SNAPSHOT/archetype-packaging-3.1.2-SNAPSHOT.jar
[withMaven] artifactsPublisher - Archive artifact linux-jdk7-m3.3.x_build/maven-archetype-plugin/pom.xml under org/apache/maven/plugins/maven-archetype-plugin/3.1.2-SNAPSHOT/maven-archetype-plugin-3.1.2-SNAPSHOT.pom
[withMaven] artifactsPublisher - Archive artifact linux-jdk7-m3.3.x_build/maven-archetype-plugin/target/maven-archetype-plugin-3.1.2-SNAPSHOT.jar under org/apache/maven/plugins/maven-archetype-plugin/3.1.2-SNAPSHOT/maven-archetype-plugin-3.1.2-SNAPSHOT.jar
[withMaven] junitPublisher - Archive test results for Maven artifact org.apache.maven.archetype:archetype-catalog:jar:3.1.2-SNAPSHOT generated by maven-surefire-plugin:test (default-test): linux-jdk7-m3.3.x_build/archetype-models/archetype-catalog/target/surefire-reports/*.xml
[withMaven] junitPublisher - Archive test results for Maven artifact org.apache.maven.archetype:archetype-descriptor:jar:3.1.2-SNAPSHOT generated by maven-surefire-plugin:test (default-test): linux-jdk7-m3.3.x_build/archetype-models/archetype-descriptor/target/surefire-reports/*.xml
[withMaven] junitPublisher - Archive test results for Maven artifact org.apache.maven.archetype:archetype-common:jar:3.1.2-SNAPSHOT generated by maven-surefire-plugin:test (default-test): linux-jdk7-m3.3.x_build/archetype-common/target/surefire-reports/*.xml
[withMaven] junitPublisher - Archive test results for Maven artifact org.apache.maven.archetype:archetype-packaging:jar:3.1.2-SNAPSHOT generated by maven-surefire-plugin:test (default-test): linux-jdk7-m3.3.x_build/archetype-packaging/target/surefire-reports/*.xml
[withMaven] junitPublisher - Archive test results for Maven artifact org.apache.maven.plugins:maven-archetype-plugin:maven-plugin:3.1.2-SNAPSHOT generated by maven-surefire-plugin:test (default-test): linux-jdk7-m3.3.x_build/maven-archetype-plugin/target/surefire-reports/*.xml
Recording test results
[withMaven] openTasksPublisher - Scan Tasks for Maven artifact org.apache.maven.archetype:archetype-common:jar:3.1.2-SNAPSHOT in source directory linux-jdk7-m3.3.x_build/archetype-common/src/main/java
[withMaven] openTasksPublisher - Scan Tasks for Maven artifact org.apache.maven.plugins:maven-archetype-plugin:maven-plugin:3.1.2-SNAPSHOT in source directory linux-jdk7-m3.3.x_build/maven-archetype-plugin/src/main/java
[TASKS] Scanning folder '/home/jenkins/jenkins-slave/workspace/ven-box_maven-archetype_buildfix@2' for files matching the pattern 'linux-jdk7-m3.3.x_build/archetype-common/src/main/java/**/*,linux-jdk7-m3.3.x_build/maven-archetype-plugin/src/main/java/**/*' - excludes: null
[TASKS] Found 89 files to scan for tasks
[TASKS] Found 26 open tasks.
Skipping warnings blame since pipelines do not have an SCM link.%n
[TASKS] Computing warning deltas based on reference build #22
[withMaven] invokerPublisher - Archive invoker results for Maven artifact MavenArtifact{org.apache.maven.plugins:maven-archetype-plugin:maven-plugin:3.1.2-SNAPSHOT(version: 3.1.2-SNAPSHOT, snapshot:false) } generated by PluginInvocation{org.apache.maven.plugins:maven-invoker-plugin:3.2.0@run  integration-test}: linux-jdk7-m3.3.x_build/maven-archetype-plugin/target/invoker-reports/*.xml
[withMaven] Publishers: Generated Artifacts Publisher: 5910 ms, Junit Publisher: 8156 ms, Open Task Scanner Publisher: 3606 ms, Dependencies Fingerprint Publisher: 1554 ms, Invoker Publisher: 24005 ms, Pipeline Graph Publisher: 6 ms
[Pipeline] // withMaven
[Pipeline] cleanWs
[WS-CLEANUP] Deleting project workspace...
[WS-CLEANUP] Deferred wipeout is used...
[WS-CLEANUP] done
[Pipeline] }
[Pipeline] // stage
[Pipeline] }
[Pipeline] // ws
[Pipeline] }
[Pipeline] // node
[Pipeline] }
[Pipeline] // parallel
[Pipeline] stage
[Pipeline] { (Notifications)
[Pipeline] echo
Build result: FAILURE
[Pipeline] jiraIssueSelector
[Pipeline] emailext
Reply | Threaded
Open this post in threaded view
|

Build failed in Jenkins: Maven TLP » maven-archetype » buildfix #24

Apache Jenkins Server-2
See https://builds.apache.org/job/maven-box/job/maven-archetype/job/buildfix/24/

Changes:

* Revert "deleted unnecessary calls ".flush()""
* Revert "deleted unnecessary calls ".flush()""
* Revert "deleted unnecessary calls ".flush()""
* Revert "deleted unnecessary calls ".flush()""
* Revert "deleted unnecessary calls ".flush()""
* Revert "deleted unnecessary calls ".flush()""
* Revert "deleted unnecessary calls ".flush()""
* Revert "deleted unnecessary calls ".flush()""

All tests passed

Build log:
[...truncated 10441 lines...]
[withMaven] openTasksPublisher - Scan Tasks for Maven artifact org.apache.maven.plugins:maven-archetype-plugin:maven-plugin:3.1.2-SNAPSHOT in source directory j7m3.5.xb\maven-archetype-plugin\src\main\java
[TASKS] Scanning folder 'F:\short\jenkins-maven-box-maven-archetype-buildfix-24' for files matching the pattern 'j7m3.5.xb\archetype-common\src\main\java\**\*,j7m3.5.xb\maven-archetype-plugin\src\main\java\**\*' - excludes: null
[TASKS] Found 89 files to scan for tasks
[TASKS] Found 26 open tasks.
Skipping warnings blame since pipelines do not have an SCM link.%n
[TASKS] Computing warning deltas based on reference build #22
[withMaven] invokerPublisher - Archive invoker results for Maven artifact MavenArtifact{org.apache.maven.plugins:maven-archetype-plugin:maven-plugin:3.1.2-SNAPSHOT(version: 3.1.2-SNAPSHOT, snapshot:false) } generated by PluginInvocation{org.apache.maven.plugins:maven-invoker-plugin:3.2.0@run  integration-test}: j7m3.5.xb\maven-archetype-plugin\target\invoker-reports\*.xml
[withMaven] Publishers: Generated Artifacts Publisher: 5966 ms, Junit Publisher: 8205 ms, Open Task Scanner Publisher: 3635 ms, Dependencies Fingerprint Publisher: 1600 ms, Invoker Publisher: 25783 ms, Pipeline Graph Publisher: 4 ms
[Pipeline] // withMaven
[Pipeline] cleanWs
[WS-CLEANUP] Deleting project workspace...
[WS-CLEANUP] Deferred wipeout is used...
[WS-CLEANUP] done
[Pipeline] }
[Pipeline] // stage
[Pipeline] }
[Pipeline] // ws
[Pipeline] }
[Pipeline] // node
[Pipeline] }
[INFO] run post-build script verify.bsh
[INFO]           build-ignore-eol/pom.xml ......................... SUCCESS (28.8 s)
[INFO] -------------------------------------------------
[INFO] Build Summary:
[INFO]   Passed: 25, Failed: 0, Errors: 0, Skipped: 0
[INFO] -------------------------------------------------
[INFO]
[INFO] --- mrm-maven-plugin:1.1.0:stop (mirror) @ maven-archetype-plugin ---
[INFO] Stopping Mock Repository Manager on http://localhost:40919
[INFO] Stopped SocketConnector@0.0.0.0:40919
[INFO] Mock Repository Manager http://localhost:40919 is stopped.
[INFO]
[INFO] --- mrm-maven-plugin:1.1.0:stop (archetype-repository) @ maven-archetype-plugin ---
[INFO] Stopping Mock Repository Manager on http://localhost:44578
[INFO] Stopped SocketConnector@0.0.0.0:44578
[INFO] Mock Repository Manager http://localhost:44578 is stopped.
[INFO]
[INFO] --- maven-checkstyle-plugin:3.0.0:check (checkstyle-check) @ maven-archetype-plugin ---
[INFO] There are 46 errors reported by Checkstyle 6.18 with config/maven_checks.xml ruleset.
[INFO] Ignored 46 errors, 0 violation remaining.
[INFO] ------------------------------------------------------------------------
[INFO] Reactor Summary for Maven Archetype 3.1.2-SNAPSHOT:
[INFO]
[INFO] Maven Archetype .................................... SUCCESS [  6.618 s]
[INFO] Maven Archetype Models ............................. SUCCESS [  0.598 s]
[INFO] Maven Archetype Catalog Model ...................... SUCCESS [  2.816 s]
[INFO] Maven Archetype Descriptor Model ................... SUCCESS [  1.008 s]
[INFO] Maven Archetype Common ............................. SUCCESS [ 18.158 s]
[INFO] Maven Archetype Packaging .......................... SUCCESS [  0.529 s]
[INFO] Maven Archetype Plugin ............................. SUCCESS [05:06 min]
[INFO] ------------------------------------------------------------------------
[INFO] BUILD SUCCESS
[INFO] ------------------------------------------------------------------------
[INFO] Total time:  05:37 min
[INFO] Finished at: 2019-07-29T08:15:13Z
[INFO] ------------------------------------------------------------------------
[INFO] [jenkins-event-spy] Generated /home/jenkins/jenkins-slave/workspace/ven-box_maven-archetype_buildfix@2@tmp/withMaven8a6ad454/maven-spy-20190729-080936-2878660492558543696102.log
[Pipeline] }
[Pipeline] // dir
[Pipeline] }
[withMaven] artifactsPublisher - Archive artifact linux-jdk7-m3.6.x_build/pom.xml under org/apache/maven/archetype/maven-archetype/3.1.2-SNAPSHOT/maven-archetype-3.1.2-SNAPSHOT.pom
[withMaven] artifactsPublisher - Archive artifact linux-jdk7-m3.6.x_build/target/maven-archetype-3.1.2-SNAPSHOT-site.xml under org/apache/maven/archetype/maven-archetype/3.1.2-SNAPSHOT/maven-archetype-3.1.2-SNAPSHOT-site.xml
[withMaven] artifactsPublisher - Archive artifact linux-jdk7-m3.6.x_build/archetype-models/pom.xml under org/apache/maven/archetype/archetype-models/3.1.2-SNAPSHOT/archetype-models-3.1.2-SNAPSHOT.pom
[withMaven] artifactsPublisher - Archive artifact linux-jdk7-m3.6.x_build/archetype-models/target/archetype-models-3.1.2-SNAPSHOT-site.xml under org/apache/maven/archetype/archetype-models/3.1.2-SNAPSHOT/archetype-models-3.1.2-SNAPSHOT-site.xml
[withMaven] artifactsPublisher - Archive artifact linux-jdk7-m3.6.x_build/archetype-models/archetype-catalog/pom.xml under org/apache/maven/archetype/archetype-catalog/3.1.2-SNAPSHOT/archetype-catalog-3.1.2-SNAPSHOT.pom
[withMaven] artifactsPublisher - Archive artifact linux-jdk7-m3.6.x_build/archetype-models/archetype-catalog/target/archetype-catalog-3.1.2-SNAPSHOT.jar under org/apache/maven/archetype/archetype-catalog/3.1.2-SNAPSHOT/archetype-catalog-3.1.2-SNAPSHOT.jar
[withMaven] artifactsPublisher - Archive artifact linux-jdk7-m3.6.x_build/archetype-models/archetype-descriptor/pom.xml under org/apache/maven/archetype/archetype-descriptor/3.1.2-SNAPSHOT/archetype-descriptor-3.1.2-SNAPSHOT.pom
[withMaven] artifactsPublisher - Archive artifact linux-jdk7-m3.6.x_build/archetype-models/archetype-descriptor/target/archetype-descriptor-3.1.2-SNAPSHOT.jar under org/apache/maven/archetype/archetype-descriptor/3.1.2-SNAPSHOT/archetype-descriptor-3.1.2-SNAPSHOT.jar
[INFO] run post-build script verify.groovy
[INFO]           include-file-with-no-extension/pom.xml ........... SUCCESS (11.1 s)
[INFO] Building: ARCHETYPE-241_filter-directory/pom.xml
[withMaven] artifactsPublisher - Archive artifact linux-jdk7-m3.6.x_build/archetype-common/pom.xml under org/apache/maven/archetype/archetype-common/3.1.2-SNAPSHOT/archetype-common-3.1.2-SNAPSHOT.pom
[withMaven] artifactsPublisher - Archive artifact linux-jdk7-m3.6.x_build/archetype-common/target/archetype-common-3.1.2-SNAPSHOT.jar under org/apache/maven/archetype/archetype-common/3.1.2-SNAPSHOT/archetype-common-3.1.2-SNAPSHOT.jar
[withMaven] artifactsPublisher - Archive artifact linux-jdk7-m3.6.x_build/archetype-packaging/pom.xml under org/apache/maven/archetype/archetype-packaging/3.1.2-SNAPSHOT/archetype-packaging-3.1.2-SNAPSHOT.pom
[withMaven] Publishers: Generated Artifacts Publisher: 374 ms, Junit Publisher: 343 ms, Open Task Scanner Publisher: 305 ms, Dependencies Fingerprint Publisher: 63 ms, Invoker Publisher: 17580 ms, Pipeline Graph Publisher: 4 ms
[Pipeline] // withMaven
[Pipeline] cleanWs
[WS-CLEANUP] Deleting project workspace...
[WS-CLEANUP] Deferred wipeout is used...
[withMaven] artifactsPublisher - Archive artifact linux-jdk7-m3.6.x_build/archetype-packaging/target/archetype-packaging-3.1.2-SNAPSHOT.jar under org/apache/maven/archetype/archetype-packaging/3.1.2-SNAPSHOT/archetype-packaging-3.1.2-SNAPSHOT.jar
[WS-CLEANUP] done
[Pipeline] }
[Pipeline] // stage
[Pipeline] }
[Pipeline] // ws
[Pipeline] }
[Pipeline] // node
[Pipeline] }
[withMaven] artifactsPublisher - Archive artifact linux-jdk7-m3.6.x_build/maven-archetype-plugin/pom.xml under org/apache/maven/plugins/maven-archetype-plugin/3.1.2-SNAPSHOT/maven-archetype-plugin-3.1.2-SNAPSHOT.pom
[withMaven] artifactsPublisher - Archive artifact linux-jdk7-m3.6.x_build/maven-archetype-plugin/target/maven-archetype-plugin-3.1.2-SNAPSHOT.jar under org/apache/maven/plugins/maven-archetype-plugin/3.1.2-SNAPSHOT/maven-archetype-plugin-3.1.2-SNAPSHOT.jar
[withMaven] junitPublisher - Archive test results for Maven artifact org.apache.maven.archetype:archetype-catalog:jar:3.1.2-SNAPSHOT generated by maven-surefire-plugin:test (default-test): linux-jdk7-m3.6.x_build/archetype-models/archetype-catalog/target/surefire-reports/*.xml
[withMaven] junitPublisher - Archive test results for Maven artifact org.apache.maven.archetype:archetype-descriptor:jar:3.1.2-SNAPSHOT generated by maven-surefire-plugin:test (default-test): linux-jdk7-m3.6.x_build/archetype-models/archetype-descriptor/target/surefire-reports/*.xml
[withMaven] junitPublisher - Archive test results for Maven artifact org.apache.maven.archetype:archetype-common:jar:3.1.2-SNAPSHOT generated by maven-surefire-plugin:test (default-test): linux-jdk7-m3.6.x_build/archetype-common/target/surefire-reports/*.xml
[withMaven] junitPublisher - Archive test results for Maven artifact org.apache.maven.archetype:archetype-packaging:jar:3.1.2-SNAPSHOT generated by maven-surefire-plugin:test (default-test): linux-jdk7-m3.6.x_build/archetype-packaging/target/surefire-reports/*.xml
[withMaven] junitPublisher - Archive test results for Maven artifact org.apache.maven.plugins:maven-archetype-plugin:maven-plugin:3.1.2-SNAPSHOT generated by maven-surefire-plugin:test (default-test): linux-jdk7-m3.6.x_build/maven-archetype-plugin/target/surefire-reports/*.xml
Recording test results
[withMaven] Publishers: Generated Artifacts Publisher: 373 ms, Junit Publisher: 366 ms, Open Task Scanner Publisher: 375 ms, Dependencies Fingerprint Publisher: 85 ms, Invoker Publisher: 19249 ms, Pipeline Graph Publisher: 5 ms
[Pipeline] // withMaven
[Pipeline] cleanWs
[WS-CLEANUP] Deleting project workspace...
[WS-CLEANUP] Deferred wipeout is used...
[WS-CLEANUP] done
[Pipeline] }
[Pipeline] // stage
[Pipeline] }
[Pipeline] // ws
[Pipeline] }
[Pipeline] // node
[Pipeline] }
[withMaven] Publishers: Generated Artifacts Publisher: 5950 ms, Junit Publisher: 8227 ms, Open Task Scanner Publisher: 3641 ms, Dependencies Fingerprint Publisher: 1580 ms, Invoker Publisher: 24583 ms, Pipeline Graph Publisher: 4 ms
[Pipeline] // withMaven
[Pipeline] cleanWs
[withMaven] openTasksPublisher - Scan Tasks for Maven artifact org.apache.maven.archetype:archetype-common:jar:3.1.2-SNAPSHOT in source directory linux-jdk7-m3.6.x_build/archetype-common/src/main/java
[WS-CLEANUP] Deleting project workspace...
[WS-CLEANUP] Deferred wipeout is used...
[withMaven] openTasksPublisher - Scan Tasks for Maven artifact org.apache.maven.plugins:maven-archetype-plugin:maven-plugin:3.1.2-SNAPSHOT in source directory linux-jdk7-m3.6.x_build/maven-archetype-plugin/src/main/java
[WS-CLEANUP] done
[Pipeline] }
[Pipeline] // stage
[Pipeline] }
[Pipeline] // ws
[Pipeline] }
[Pipeline] // node
[Pipeline] }
[TASKS] Scanning folder '/home/jenkins/jenkins-slave/workspace/ven-box_maven-archetype_buildfix@2' for files matching the pattern 'linux-jdk7-m3.6.x_build/archetype-common/src/main/java/**/*,linux-jdk7-m3.6.x_build/maven-archetype-plugin/src/main/java/**/*' - excludes: null
[TASKS] Found 89 files to scan for tasks
[TASKS] Found 26 open tasks.
Skipping warnings blame since pipelines do not have an SCM link.%n
[TASKS] Computing warning deltas based on reference build #22
[INFO] snapshot org.apache.maven.plugins.archetype.its:archetype241-archetype:1.0-SNAPSHOT: checking for updates from Nexus
[INFO] artifact org.apache.maven.plugins.archetype.its.archetype241-archetype:1.0-SNAPSHOT: checking for updates from central
[INFO] run post-build script verify.groovy
[INFO]           ARCHETYPE-241_filter-directory/pom.xml ........... SUCCESS (12.6 s)
[INFO] Building: generate-basic
[withMaven] invokerPublisher - Archive invoker results for Maven artifact MavenArtifact{org.apache.maven.plugins:maven-archetype-plugin:maven-plugin:3.1.2-SNAPSHOT(version: 3.1.2-SNAPSHOT, snapshot:false) } generated by PluginInvocation{org.apache.maven.plugins:maven-invoker-plugin:3.2.0@run  integration-test}: linux-jdk7-m3.6.x_build/maven-archetype-plugin/target/invoker-reports/*.xml
[INFO] run post-build script verify.bsh
[INFO]           generate-basic ................................... SUCCESS (5.8 s)
[INFO] Building: included-system-properties/pom.xml
[INFO] run post-build script verify.groovy
[INFO]           included-system-properties/pom.xml ............... SUCCESS (13.1 s)
[INFO] Building: create-from-project-exclude-patterns/pom.xml
[INFO] run post-build script verify.bsh
[INFO]           create-from-project-exclude-patterns/pom.xml ..... SUCCESS (12.1 s)
[INFO] Building: create-from-project/pom.xml
[withMaven] Publishers: Generated Artifacts Publisher: 6000 ms, Junit Publisher: 8144 ms, Open Task Scanner Publisher: 3523 ms, Dependencies Fingerprint Publisher: 1539 ms, Invoker Publisher: 28677 ms, Pipeline Graph Publisher: 4 ms
[Pipeline] // withMaven
[Pipeline] cleanWs
[WS-CLEANUP] Deleting project workspace...
[WS-CLEANUP] Deferred wipeout is used...
[WS-CLEANUP] done
[Pipeline] }
[Pipeline] // stage
[Pipeline] }
[Pipeline] // ws
[Pipeline] }
[Pipeline] // node
[Pipeline] }
[INFO] run post-build script verify.bsh
[INFO]           create-from-project/pom.xml ...................... SUCCESS (11.7 s)
[INFO] Building: change-file-with-property/pom.xml
[INFO] run post-build script verify.groovy
[INFO]           change-file-with-property/pom.xml ................ SUCCESS (11.4 s)
[INFO] -------------------------------------------------
[INFO] Build Summary:
[INFO]   Passed: 25, Failed: 0, Errors: 0, Skipped: 0
[INFO] -------------------------------------------------
[INFO]
[INFO] --- mrm-maven-plugin:1.1.0:stop (mirror) @ maven-archetype-plugin ---
[INFO] Stopping Mock Repository Manager on http://localhost:39031
[INFO] Stopped SocketConnector@0.0.0.0:39031
[INFO] Mock Repository Manager http://localhost:39031 is stopped.
[INFO]
[INFO] --- mrm-maven-plugin:1.1.0:stop (archetype-repository) @ maven-archetype-plugin ---
[INFO] Stopping Mock Repository Manager on http://localhost:36005
[INFO] Stopped SocketConnector@0.0.0.0:36005
[INFO] Mock Repository Manager http://localhost:36005 is stopped.
[INFO]
[INFO] --- maven-checkstyle-plugin:3.0.0:check (checkstyle-check) @ maven-archetype-plugin ---
[INFO] There are 46 errors reported by Checkstyle 6.18 with config/maven_checks.xml ruleset.
[INFO] Ignored 46 errors, 0 violation remaining.
[INFO] ------------------------------------------------------------------------
[INFO] Reactor Summary:
[INFO]
[INFO] Maven Archetype .................................... SUCCESS [  7.013 s]
[INFO] Maven Archetype Models ............................. SUCCESS [  0.932 s]
[INFO] Maven Archetype Catalog Model ...................... SUCCESS [  3.632 s]
[INFO] Maven Archetype Descriptor Model ................... SUCCESS [  1.557 s]
[INFO] Maven Archetype Common ............................. SUCCESS [ 24.137 s]
[INFO] Maven Archetype Packaging .......................... SUCCESS [  0.801 s]
[INFO] Maven Archetype Plugin ............................. SUCCESS [06:16 min]
[INFO] ------------------------------------------------------------------------
[INFO] BUILD SUCCESS
[INFO] ------------------------------------------------------------------------
[INFO] Total time: 06:55 min
[INFO] Finished at: 2019-07-29T08:16:27+00:00
[INFO] Final Memory: 55M/926M
[INFO] ------------------------------------------------------------------------
[INFO] [jenkins-event-spy] Generated /home/jenkins/jenkins-slave/workspace/ven-box_maven-archetype_buildfix@2@tmp/withMavena0e9a6e9/maven-spy-20190729-080931-2323909752822163571713.log
[Pipeline] }
[Pipeline] // dir
[Pipeline] }
[withMaven] artifactsPublisher - Archive artifact linux-jdk7-m3.3.x_build/pom.xml under org/apache/maven/archetype/maven-archetype/3.1.2-SNAPSHOT/maven-archetype-3.1.2-SNAPSHOT.pom
[withMaven] artifactsPublisher - Archive artifact linux-jdk7-m3.3.x_build/target/maven-archetype-3.1.2-SNAPSHOT-site.xml under org/apache/maven/archetype/maven-archetype/3.1.2-SNAPSHOT/maven-archetype-3.1.2-SNAPSHOT-site.xml
[withMaven] artifactsPublisher - Archive artifact linux-jdk7-m3.3.x_build/archetype-models/pom.xml under org/apache/maven/archetype/archetype-models/3.1.2-SNAPSHOT/archetype-models-3.1.2-SNAPSHOT.pom
[withMaven] artifactsPublisher - Archive artifact linux-jdk7-m3.3.x_build/archetype-models/target/archetype-models-3.1.2-SNAPSHOT-site.xml under org/apache/maven/archetype/archetype-models/3.1.2-SNAPSHOT/archetype-models-3.1.2-SNAPSHOT-site.xml
[withMaven] artifactsPublisher - Archive artifact linux-jdk7-m3.3.x_build/archetype-models/archetype-catalog/pom.xml under org/apache/maven/archetype/archetype-catalog/3.1.2-SNAPSHOT/archetype-catalog-3.1.2-SNAPSHOT.pom
[withMaven] artifactsPublisher - Archive artifact linux-jdk7-m3.3.x_build/archetype-models/archetype-catalog/target/archetype-catalog-3.1.2-SNAPSHOT.jar under org/apache/maven/archetype/archetype-catalog/3.1.2-SNAPSHOT/archetype-catalog-3.1.2-SNAPSHOT.jar
[withMaven] artifactsPublisher - Archive artifact linux-jdk7-m3.3.x_build/archetype-models/archetype-descriptor/pom.xml under org/apache/maven/archetype/archetype-descriptor/3.1.2-SNAPSHOT/archetype-descriptor-3.1.2-SNAPSHOT.pom
[withMaven] artifactsPublisher - Archive artifact linux-jdk7-m3.3.x_build/archetype-models/archetype-descriptor/target/archetype-descriptor-3.1.2-SNAPSHOT.jar under org/apache/maven/archetype/archetype-descriptor/3.1.2-SNAPSHOT/archetype-descriptor-3.1.2-SNAPSHOT.jar
[withMaven] artifactsPublisher - Archive artifact linux-jdk7-m3.3.x_build/archetype-common/pom.xml under org/apache/maven/archetype/archetype-common/3.1.2-SNAPSHOT/archetype-common-3.1.2-SNAPSHOT.pom
[withMaven] artifactsPublisher - Archive artifact linux-jdk7-m3.3.x_build/archetype-common/target/archetype-common-3.1.2-SNAPSHOT.jar under org/apache/maven/archetype/archetype-common/3.1.2-SNAPSHOT/archetype-common-3.1.2-SNAPSHOT.jar
[withMaven] artifactsPublisher - Archive artifact linux-jdk7-m3.3.x_build/archetype-packaging/pom.xml under org/apache/maven/archetype/archetype-packaging/3.1.2-SNAPSHOT/archetype-packaging-3.1.2-SNAPSHOT.pom
[withMaven] artifactsPublisher - Archive artifact linux-jdk7-m3.3.x_build/archetype-packaging/target/archetype-packaging-3.1.2-SNAPSHOT.jar under org/apache/maven/archetype/archetype-packaging/3.1.2-SNAPSHOT/archetype-packaging-3.1.2-SNAPSHOT.jar
[withMaven] artifactsPublisher - Archive artifact linux-jdk7-m3.3.x_build/maven-archetype-plugin/pom.xml under org/apache/maven/plugins/maven-archetype-plugin/3.1.2-SNAPSHOT/maven-archetype-plugin-3.1.2-SNAPSHOT.pom
[withMaven] artifactsPublisher - Archive artifact linux-jdk7-m3.3.x_build/maven-archetype-plugin/target/maven-archetype-plugin-3.1.2-SNAPSHOT.jar under org/apache/maven/plugins/maven-archetype-plugin/3.1.2-SNAPSHOT/maven-archetype-plugin-3.1.2-SNAPSHOT.jar
[withMaven] junitPublisher - Archive test results for Maven artifact org.apache.maven.archetype:archetype-catalog:jar:3.1.2-SNAPSHOT generated by maven-surefire-plugin:test (default-test): linux-jdk7-m3.3.x_build/archetype-models/archetype-catalog/target/surefire-reports/*.xml
[withMaven] junitPublisher - Archive test results for Maven artifact org.apache.maven.archetype:archetype-descriptor:jar:3.1.2-SNAPSHOT generated by maven-surefire-plugin:test (default-test): linux-jdk7-m3.3.x_build/archetype-models/archetype-descriptor/target/surefire-reports/*.xml
[withMaven] junitPublisher - Archive test results for Maven artifact org.apache.maven.archetype:archetype-common:jar:3.1.2-SNAPSHOT generated by maven-surefire-plugin:test (default-test): linux-jdk7-m3.3.x_build/archetype-common/target/surefire-reports/*.xml
[withMaven] junitPublisher - Archive test results for Maven artifact org.apache.maven.archetype:archetype-packaging:jar:3.1.2-SNAPSHOT generated by maven-surefire-plugin:test (default-test): linux-jdk7-m3.3.x_build/archetype-packaging/target/surefire-reports/*.xml
[withMaven] junitPublisher - Archive test results for Maven artifact org.apache.maven.plugins:maven-archetype-plugin:maven-plugin:3.1.2-SNAPSHOT generated by maven-surefire-plugin:test (default-test): linux-jdk7-m3.3.x_build/maven-archetype-plugin/target/surefire-reports/*.xml
Recording test results
[withMaven] openTasksPublisher - Scan Tasks for Maven artifact org.apache.maven.archetype:archetype-common:jar:3.1.2-SNAPSHOT in source directory linux-jdk7-m3.3.x_build/archetype-common/src/main/java
[withMaven] openTasksPublisher - Scan Tasks for Maven artifact org.apache.maven.plugins:maven-archetype-plugin:maven-plugin:3.1.2-SNAPSHOT in source directory linux-jdk7-m3.3.x_build/maven-archetype-plugin/src/main/java
[TASKS] Scanning folder '/home/jenkins/jenkins-slave/workspace/ven-box_maven-archetype_buildfix@2' for files matching the pattern 'linux-jdk7-m3.3.x_build/archetype-common/src/main/java/**/*,linux-jdk7-m3.3.x_build/maven-archetype-plugin/src/main/java/**/*' - excludes: null
[TASKS] Found 89 files to scan for tasks
[TASKS] Found 26 open tasks.
Skipping warnings blame since pipelines do not have an SCM link.%n
[TASKS] Computing warning deltas based on reference build #22
[withMaven] invokerPublisher - Archive invoker results for Maven artifact MavenArtifact{org.apache.maven.plugins:maven-archetype-plugin:maven-plugin:3.1.2-SNAPSHOT(version: 3.1.2-SNAPSHOT, snapshot:false) } generated by PluginInvocation{org.apache.maven.plugins:maven-invoker-plugin:3.2.0@run  integration-test}: linux-jdk7-m3.3.x_build/maven-archetype-plugin/target/invoker-reports/*.xml
[withMaven] Publishers: Generated Artifacts Publisher: 5807 ms, Junit Publisher: 7954 ms, Open Task Scanner Publisher: 3550 ms, Dependencies Fingerprint Publisher: 1527 ms, Invoker Publisher: 26844 ms, Pipeline Graph Publisher: 4 ms
[Pipeline] // withMaven
[Pipeline] cleanWs
[WS-CLEANUP] Deleting project workspace...
[WS-CLEANUP] Deferred wipeout is used...
[WS-CLEANUP] done
[Pipeline] }
[Pipeline] // stage
[Pipeline] }
[Pipeline] // ws
[Pipeline] }
[Pipeline] // node
[Pipeline] }
[Pipeline] // parallel
[Pipeline] stage
[Pipeline] { (Notifications)
[Pipeline] echo
Build result: FAILURE
[Pipeline] jiraIssueSelector
[Pipeline] emailext
Reply | Threaded
Open this post in threaded view
|

Build failed in Jenkins: Maven TLP » maven-archetype » buildfix #25

Apache Jenkins Server-2
See https://builds.apache.org/job/maven-box/job/maven-archetype/job/buildfix/25/

No changes.

All tests passed

Build log:
[...truncated 10484 lines...]
[INFO] --- mrm-maven-plugin:1.1.0:stop (mirror) @ maven-archetype-plugin ---
[INFO] Stopping Mock Repository Manager on http://localhost:39832
[INFO] Stopped SocketConnector@0.0.0.0:39832
[INFO] Mock Repository Manager http://localhost:39832 is stopped.
[INFO]
[INFO] --- mrm-maven-plugin:1.1.0:stop (archetype-repository) @ maven-archetype-plugin ---
[INFO] Stopping Mock Repository Manager on http://localhost:42237
[INFO] Stopped SocketConnector@0.0.0.0:42237
[INFO] Mock Repository Manager http://localhost:42237 is stopped.
[INFO]
[INFO] --- maven-checkstyle-plugin:3.0.0:check (checkstyle-check) @ maven-archetype-plugin ---
[INFO] run post-build script verify.groovy
[INFO]           roundtrip-1-project .............................. SUCCESS (24.0 s)
[INFO] Building: ARCHETYPE-521_archetype-repo
[INFO] There are 46 errors reported by Checkstyle 6.18 with config/maven_checks.xml ruleset.
[INFO] Ignored 46 errors, 0 violation remaining.
[INFO] ------------------------------------------------------------------------
[INFO] Reactor Summary:
[INFO]
[INFO] Maven Archetype .................................... SUCCESS [ 20.663 s]
[INFO] Maven Archetype Models ............................. SUCCESS [  0.644 s]
[INFO] Maven Archetype Catalog Model ...................... SUCCESS [  9.290 s]
[INFO] Maven Archetype Descriptor Model ................... SUCCESS [  1.133 s]
[INFO] Maven Archetype Common ............................. SUCCESS [ 25.086 s]
[INFO] Maven Archetype Packaging .......................... SUCCESS [  0.561 s]
[INFO] Maven Archetype Plugin ............................. SUCCESS [04:42 min]
[INFO] ------------------------------------------------------------------------
[INFO] BUILD SUCCESS
[INFO] ------------------------------------------------------------------------
[INFO] Total time: 05:41 min
[INFO] Finished at: 2019-07-29T14:36:34+00:00
[INFO] Final Memory: 54M/925M
[INFO] ------------------------------------------------------------------------
[INFO] [jenkins-event-spy] Generated /home/jenkins/jenkins-slave/workspace/ven-box_maven-archetype_buildfix@2@tmp/withMavenfbac47c8/maven-spy-20190729-143048-8386847460194290479340.log
[Pipeline] }
[Pipeline] // dir
[Pipeline] }
[withMaven] artifactsPublisher - Archive artifact linux-jdk7-m3.3.x_build/pom.xml under org/apache/maven/archetype/maven-archetype/3.1.2-SNAPSHOT/maven-archetype-3.1.2-SNAPSHOT.pom
[withMaven] artifactsPublisher - Archive artifact linux-jdk7-m3.3.x_build/target/maven-archetype-3.1.2-SNAPSHOT-site.xml under org/apache/maven/archetype/maven-archetype/3.1.2-SNAPSHOT/maven-archetype-3.1.2-SNAPSHOT-site.xml
[withMaven] artifactsPublisher - Archive artifact linux-jdk7-m3.3.x_build/archetype-models/pom.xml under org/apache/maven/archetype/archetype-models/3.1.2-SNAPSHOT/archetype-models-3.1.2-SNAPSHOT.pom
[withMaven] artifactsPublisher - Archive artifact linux-jdk7-m3.3.x_build/archetype-models/target/archetype-models-3.1.2-SNAPSHOT-site.xml under org/apache/maven/archetype/archetype-models/3.1.2-SNAPSHOT/archetype-models-3.1.2-SNAPSHOT-site.xml
[withMaven] artifactsPublisher - Archive artifact linux-jdk7-m3.3.x_build/archetype-models/archetype-catalog/pom.xml under org/apache/maven/archetype/archetype-catalog/3.1.2-SNAPSHOT/archetype-catalog-3.1.2-SNAPSHOT.pom
[withMaven] artifactsPublisher - Archive artifact linux-jdk7-m3.3.x_build/archetype-models/archetype-catalog/target/archetype-catalog-3.1.2-SNAPSHOT.jar under org/apache/maven/archetype/archetype-catalog/3.1.2-SNAPSHOT/archetype-catalog-3.1.2-SNAPSHOT.jar
[INFO] run post-build script verify.groovy
[INFO]           ARCHETYPE-521_archetype-repo ..................... SUCCESS (6.2 s)
[INFO] Building: ARCHETYPE-520_mirror
[withMaven] artifactsPublisher - Archive artifact linux-jdk7-m3.3.x_build/archetype-models/archetype-descriptor/pom.xml under org/apache/maven/archetype/archetype-descriptor/3.1.2-SNAPSHOT/archetype-descriptor-3.1.2-SNAPSHOT.pom
[withMaven] artifactsPublisher - Archive artifact linux-jdk7-m3.3.x_build/archetype-models/archetype-descriptor/target/archetype-descriptor-3.1.2-SNAPSHOT.jar under org/apache/maven/archetype/archetype-descriptor/3.1.2-SNAPSHOT/archetype-descriptor-3.1.2-SNAPSHOT.jar
[withMaven] artifactsPublisher - Archive artifact linux-jdk7-m3.3.x_build/archetype-common/pom.xml under org/apache/maven/archetype/archetype-common/3.1.2-SNAPSHOT/archetype-common-3.1.2-SNAPSHOT.pom
[withMaven] artifactsPublisher - Archive artifact linux-jdk7-m3.3.x_build/archetype-common/target/archetype-common-3.1.2-SNAPSHOT.jar under org/apache/maven/archetype/archetype-common/3.1.2-SNAPSHOT/archetype-common-3.1.2-SNAPSHOT.jar
[withMaven] artifactsPublisher - Archive artifact linux-jdk7-m3.3.x_build/archetype-packaging/pom.xml under org/apache/maven/archetype/archetype-packaging/3.1.2-SNAPSHOT/archetype-packaging-3.1.2-SNAPSHOT.pom
[withMaven] artifactsPublisher - Archive artifact linux-jdk7-m3.3.x_build/archetype-packaging/target/archetype-packaging-3.1.2-SNAPSHOT.jar under org/apache/maven/archetype/archetype-packaging/3.1.2-SNAPSHOT/archetype-packaging-3.1.2-SNAPSHOT.jar
[withMaven] artifactsPublisher - Archive artifact linux-jdk7-m3.3.x_build/maven-archetype-plugin/pom.xml under org/apache/maven/plugins/maven-archetype-plugin/3.1.2-SNAPSHOT/maven-archetype-plugin-3.1.2-SNAPSHOT.pom
[withMaven] artifactsPublisher - Archive artifact linux-jdk7-m3.3.x_build/maven-archetype-plugin/target/maven-archetype-plugin-3.1.2-SNAPSHOT.jar under org/apache/maven/plugins/maven-archetype-plugin/3.1.2-SNAPSHOT/maven-archetype-plugin-3.1.2-SNAPSHOT.jar
[withMaven] junitPublisher - Archive test results for Maven artifact org.apache.maven.archetype:archetype-catalog:jar:3.1.2-SNAPSHOT generated by maven-surefire-plugin:test (default-test): linux-jdk7-m3.3.x_build/archetype-models/archetype-catalog/target/surefire-reports/*.xml
[withMaven] junitPublisher - Archive test results for Maven artifact org.apache.maven.archetype:archetype-descriptor:jar:3.1.2-SNAPSHOT generated by maven-surefire-plugin:test (default-test): linux-jdk7-m3.3.x_build/archetype-models/archetype-descriptor/target/surefire-reports/*.xml
[withMaven] junitPublisher - Archive test results for Maven artifact org.apache.maven.archetype:archetype-common:jar:3.1.2-SNAPSHOT generated by maven-surefire-plugin:test (default-test): linux-jdk7-m3.3.x_build/archetype-common/target/surefire-reports/*.xml
[withMaven] junitPublisher - Archive test results for Maven artifact org.apache.maven.archetype:archetype-packaging:jar:3.1.2-SNAPSHOT generated by maven-surefire-plugin:test (default-test): linux-jdk7-m3.3.x_build/archetype-packaging/target/surefire-reports/*.xml
[withMaven] junitPublisher - Archive test results for Maven artifact org.apache.maven.plugins:maven-archetype-plugin:maven-plugin:3.1.2-SNAPSHOT generated by maven-surefire-plugin:test (default-test): linux-jdk7-m3.3.x_build/maven-archetype-plugin/target/surefire-reports/*.xml
Recording test results
[INFO] run post-build script verify.groovy
[INFO]           ARCHETYPE-520_mirror ............................. SUCCESS (5.8 s)
[INFO] Building: create-2/pom.xml
[withMaven] openTasksPublisher - Scan Tasks for Maven artifact org.apache.maven.archetype:archetype-common:jar:3.1.2-SNAPSHOT in source directory linux-jdk7-m3.3.x_build/archetype-common/src/main/java
[withMaven] openTasksPublisher - Scan Tasks for Maven artifact org.apache.maven.plugins:maven-archetype-plugin:maven-plugin:3.1.2-SNAPSHOT in source directory linux-jdk7-m3.3.x_build/maven-archetype-plugin/src/main/java
[TASKS] Scanning folder '/home/jenkins/jenkins-slave/workspace/ven-box_maven-archetype_buildfix@2' for files matching the pattern 'linux-jdk7-m3.3.x_build/archetype-common/src/main/java/**/*,linux-jdk7-m3.3.x_build/maven-archetype-plugin/src/main/java/**/*' - excludes: null
[TASKS] Found 89 files to scan for tasks
[TASKS] Found 26 open tasks.
Skipping warnings blame since pipelines do not have an SCM link.%n
[TASKS] Computing warning deltas based on reference build #22
[withMaven] invokerPublisher - Archive invoker results for Maven artifact MavenArtifact{org.apache.maven.plugins:maven-archetype-plugin:maven-plugin:3.1.2-SNAPSHOT(version: 3.1.2-SNAPSHOT, snapshot:false) } generated by PluginInvocation{org.apache.maven.plugins:maven-invoker-plugin:3.2.0@run  integration-test}: linux-jdk7-m3.3.x_build/maven-archetype-plugin/target/invoker-reports/*.xml
[INFO]           create-2/pom.xml ................................. SUCCESS (11.5 s)
[INFO] Building: ARCHETYPE-517_failing-goals
[INFO] run pre-build script setup.groovy
[withMaven] Publishers: Generated Artifacts Publisher: 6013 ms, Junit Publisher: 8259 ms, Open Task Scanner Publisher: 3662 ms, Dependencies Fingerprint Publisher: 1579 ms, Invoker Publisher: 26429 ms, Pipeline Graph Publisher: 4 ms
[Pipeline] // withMaven
[Pipeline] cleanWs
[WS-CLEANUP] Deleting project workspace...
[WS-CLEANUP] Deferred wipeout is used...
[WS-CLEANUP] done
[Pipeline] }
[Pipeline] // stage
[Pipeline] }
[Pipeline] // ws
[Pipeline] }
[Pipeline] // node
[Pipeline] }
[INFO] run post-build script verify.groovy
[INFO]           ARCHETYPE-517_failing-goals ...................... SUCCESS (8.3 s)
[INFO] Building: roundtrip-multi/pom.xml
[withMaven] Publishers: Generated Artifacts Publisher: 5941 ms, Junit Publisher: 8183 ms, Open Task Scanner Publisher: 3629 ms, Dependencies Fingerprint Publisher: 1573 ms, Invoker Publisher: 25291 ms, Pipeline Graph Publisher: 4 ms
[Pipeline] // withMaven
[Pipeline] cleanWs
[WS-CLEANUP] Deleting project workspace...
[WS-CLEANUP] Deferred wipeout is used...
[WS-CLEANUP] done
[Pipeline] }
[Pipeline] // stage
[Pipeline] }
[Pipeline] // ws
[Pipeline] }
[Pipeline] // node
[Pipeline] }
[INFO] snapshot com.company.proficio:proficio-archetype:1.0-SNAPSHOT: checking for updates from Nexus
[INFO] artifact com.company.proficio.proficio-archetype:1.0-SNAPSHOT: checking for updates from central
[INFO] run post-build script verify.groovy
[INFO]           roundtrip-multi/pom.xml .......................... SUCCESS (24.8 s)
[INFO] Building: change-file-with-property/pom.xml
[INFO] run post-build script verify.groovy
[INFO]           change-file-with-property/pom.xml ................ SUCCESS (11.4 s)
[INFO] Building: ARCHETYPE-241_filter-directory/pom.xml
[INFO] snapshot org.apache.maven.plugins.archetype.its:archetype241-archetype:1.0-SNAPSHOT: checking for updates from Nexus
[INFO] artifact org.apache.maven.plugins.archetype.its.archetype241-archetype:1.0-SNAPSHOT: checking for updates from central
[INFO] run post-build script verify.groovy
[INFO]           ARCHETYPE-241_filter-directory/pom.xml ........... SUCCESS (14.0 s)
[INFO] Building: create-6/pom.xml
[INFO] run post-build script verify.groovy
[INFO]           create-6/pom.xml ................................. SUCCESS (12.3 s)
[INFO] Building: ARCHETYPE-536_groovy-grape/pom.xml
[INFO] snapshot org.apache.maven.plugins.archetype.its:archetype536-archetype:1.0-SNAPSHOT: checking for updates from Nexus
[INFO] artifact org.apache.maven.plugins.archetype.its.archetype536-archetype:1.0-SNAPSHOT: checking for updates from central
[INFO] run post-build script verify.groovy
[INFO]           ARCHETYPE-536_groovy-grape/pom.xml ............... SUCCESS (15.0 s)
[INFO] Building: create-from-project/pom.xml
[INFO] run post-build script verify.bsh
[INFO]           create-from-project/pom.xml ...................... SUCCESS (11.7 s)
[INFO] Building: create-1/pom.xml
[INFO] run post-build script verify.groovy
[INFO]           create-1/pom.xml ................................. SUCCESS (11.3 s)
[INFO] Building: generate-basic
[INFO] run post-build script verify.bsh
[INFO]           generate-basic ................................... SUCCESS (5.5 s)
[INFO] Building: create-from-project-exclude-patterns/pom.xml
[INFO] run post-build script verify.bsh
[INFO]           create-from-project-exclude-patterns/pom.xml ..... SUCCESS (11.2 s)
[INFO] Building: create-3/pom.xml
[INFO] run post-build script verify.groovy
[INFO]           create-3/pom.xml ................................. SUCCESS (11.6 s)
[INFO] Building: exclude-patterns/pom.xml
[INFO] run post-build script verify.groovy
[INFO]           exclude-patterns/pom.xml ......................... SUCCESS (11.2 s)
[INFO] Building: build-ignore-eol/pom.xml
[INFO] run pre-build script setup.bsh
[INFO] run post-build script verify.bsh
[INFO]           build-ignore-eol/pom.xml ......................... SUCCESS (22.6 s)
[INFO] Building: create-4/pom.xml
[INFO] run post-build script verify.groovy
[INFO]           create-4/pom.xml ................................. SUCCESS (11.9 s)
[INFO] Building: build-archetype/pom.xml
[INFO] run pre-build script setup.bsh
[INFO] run post-build script verify.bsh
[INFO]           build-archetype/pom.xml .......................... SUCCESS (18.5 s)
[INFO] Building: included-system-properties/pom.xml
[INFO] run post-build script verify.groovy
[INFO]           included-system-properties/pom.xml ............... SUCCESS (10.9 s)
[INFO] Building: property-setting-cli/pom.xml
[INFO]           property-setting-cli/pom.xml ..................... SUCCESS (6.0 s)
[INFO] Building: create-5/pom.xml
[INFO] run post-build script verify.groovy
[INFO]           create-5/pom.xml ................................. SUCCESS (11.2 s)
[INFO] Building: exclude-patterns-2/pom.xml
[INFO] run post-build script verify.groovy
[INFO]           exclude-patterns-2/pom.xml ....................... SUCCESS (11.2 s)
[INFO] -------------------------------------------------
[INFO] Build Summary:
[INFO]   Passed: 25, Failed: 0, Errors: 0, Skipped: 0
[INFO] -------------------------------------------------
[INFO]
[INFO] --- mrm-maven-plugin:1.1.0:stop (mirror) @ maven-archetype-plugin ---
[INFO] Stopping Mock Repository Manager on http://localhost:46591
[INFO] Stopped SocketConnector@0.0.0.0:46591
[INFO] Mock Repository Manager http://localhost:46591 is stopped.
[INFO]
[INFO] --- mrm-maven-plugin:1.1.0:stop (archetype-repository) @ maven-archetype-plugin ---
[INFO] Stopping Mock Repository Manager on http://localhost:46619
[INFO] Stopped SocketConnector@0.0.0.0:46619
[INFO] Mock Repository Manager http://localhost:46619 is stopped.
[INFO]
[INFO] --- maven-checkstyle-plugin:3.0.0:check (checkstyle-check) @ maven-archetype-plugin ---
[INFO] There are 46 errors reported by Checkstyle 6.18 with config/maven_checks.xml ruleset.
[INFO] Ignored 46 errors, 0 violation remaining.
[INFO] ------------------------------------------------------------------------
[INFO] Reactor Summary for Maven Archetype 3.1.2-SNAPSHOT:
[INFO]
[INFO] Maven Archetype .................................... SUCCESS [ 14.382 s]
[INFO] Maven Archetype Models ............................. SUCCESS [  0.826 s]
[INFO] Maven Archetype Catalog Model ...................... SUCCESS [  6.085 s]
[INFO] Maven Archetype Descriptor Model ................... SUCCESS [  1.564 s]
[INFO] Maven Archetype Common ............................. SUCCESS [ 26.070 s]
[INFO] Maven Archetype Packaging .......................... SUCCESS [  0.659 s]
[INFO] Maven Archetype Plugin ............................. SUCCESS [06:11 min]
[INFO] ------------------------------------------------------------------------
[INFO] BUILD SUCCESS
[INFO] ------------------------------------------------------------------------
[INFO] Total time:  07:02 min
[INFO] Finished at: 2019-07-29T14:40:58Z
[INFO] ------------------------------------------------------------------------
[INFO] [jenkins-event-spy] Generated /home/jenkins/jenkins-slave/workspace/ven-box_maven-archetype_buildfix@2@tmp/withMaven69ab3a38/maven-spy-20190729-143355-3973957206229933689500.log
[Pipeline] }
[Pipeline] // dir
[Pipeline] }
[withMaven] artifactsPublisher - Archive artifact linux-jdk7-m3.6.x_build/pom.xml under org/apache/maven/archetype/maven-archetype/3.1.2-SNAPSHOT/maven-archetype-3.1.2-SNAPSHOT.pom
[withMaven] artifactsPublisher - Archive artifact linux-jdk7-m3.6.x_build/target/maven-archetype-3.1.2-SNAPSHOT-site.xml under org/apache/maven/archetype/maven-archetype/3.1.2-SNAPSHOT/maven-archetype-3.1.2-SNAPSHOT-site.xml
[withMaven] artifactsPublisher - Archive artifact linux-jdk7-m3.6.x_build/archetype-models/pom.xml under org/apache/maven/archetype/archetype-models/3.1.2-SNAPSHOT/archetype-models-3.1.2-SNAPSHOT.pom
[withMaven] artifactsPublisher - Archive artifact linux-jdk7-m3.6.x_build/archetype-models/target/archetype-models-3.1.2-SNAPSHOT-site.xml under org/apache/maven/archetype/archetype-models/3.1.2-SNAPSHOT/archetype-models-3.1.2-SNAPSHOT-site.xml
[withMaven] artifactsPublisher - Archive artifact linux-jdk7-m3.6.x_build/archetype-models/archetype-catalog/pom.xml under org/apache/maven/archetype/archetype-catalog/3.1.2-SNAPSHOT/archetype-catalog-3.1.2-SNAPSHOT.pom
[withMaven] artifactsPublisher - Archive artifact linux-jdk7-m3.6.x_build/archetype-models/archetype-catalog/target/archetype-catalog-3.1.2-SNAPSHOT.jar under org/apache/maven/archetype/archetype-catalog/3.1.2-SNAPSHOT/archetype-catalog-3.1.2-SNAPSHOT.jar
[withMaven] artifactsPublisher - Archive artifact linux-jdk7-m3.6.x_build/archetype-models/archetype-descriptor/pom.xml under org/apache/maven/archetype/archetype-descriptor/3.1.2-SNAPSHOT/archetype-descriptor-3.1.2-SNAPSHOT.pom
[withMaven] artifactsPublisher - Archive artifact linux-jdk7-m3.6.x_build/archetype-models/archetype-descriptor/target/archetype-descriptor-3.1.2-SNAPSHOT.jar under org/apache/maven/archetype/archetype-descriptor/3.1.2-SNAPSHOT/archetype-descriptor-3.1.2-SNAPSHOT.jar
[withMaven] artifactsPublisher - Archive artifact linux-jdk7-m3.6.x_build/archetype-common/pom.xml under org/apache/maven/archetype/archetype-common/3.1.2-SNAPSHOT/archetype-common-3.1.2-SNAPSHOT.pom
[withMaven] artifactsPublisher - Archive artifact linux-jdk7-m3.6.x_build/archetype-common/target/archetype-common-3.1.2-SNAPSHOT.jar under org/apache/maven/archetype/archetype-common/3.1.2-SNAPSHOT/archetype-common-3.1.2-SNAPSHOT.jar
[withMaven] artifactsPublisher - Archive artifact linux-jdk7-m3.6.x_build/archetype-packaging/pom.xml under org/apache/maven/archetype/archetype-packaging/3.1.2-SNAPSHOT/archetype-packaging-3.1.2-SNAPSHOT.pom
[withMaven] artifactsPublisher - Archive artifact linux-jdk7-m3.6.x_build/archetype-packaging/target/archetype-packaging-3.1.2-SNAPSHOT.jar under org/apache/maven/archetype/archetype-packaging/3.1.2-SNAPSHOT/archetype-packaging-3.1.2-SNAPSHOT.jar
[withMaven] artifactsPublisher - Archive artifact linux-jdk7-m3.6.x_build/maven-archetype-plugin/pom.xml under org/apache/maven/plugins/maven-archetype-plugin/3.1.2-SNAPSHOT/maven-archetype-plugin-3.1.2-SNAPSHOT.pom
[withMaven] artifactsPublisher - Archive artifact linux-jdk7-m3.6.x_build/maven-archetype-plugin/target/maven-archetype-plugin-3.1.2-SNAPSHOT.jar under org/apache/maven/plugins/maven-archetype-plugin/3.1.2-SNAPSHOT/maven-archetype-plugin-3.1.2-SNAPSHOT.jar
[withMaven] junitPublisher - Archive test results for Maven artifact org.apache.maven.archetype:archetype-catalog:jar:3.1.2-SNAPSHOT generated by maven-surefire-plugin:test (default-test): linux-jdk7-m3.6.x_build/archetype-models/archetype-catalog/target/surefire-reports/*.xml
[withMaven] junitPublisher - Archive test results for Maven artifact org.apache.maven.archetype:archetype-descriptor:jar:3.1.2-SNAPSHOT generated by maven-surefire-plugin:test (default-test): linux-jdk7-m3.6.x_build/archetype-models/archetype-descriptor/target/surefire-reports/*.xml
[withMaven] junitPublisher - Archive test results for Maven artifact org.apache.maven.archetype:archetype-common:jar:3.1.2-SNAPSHOT generated by maven-surefire-plugin:test (default-test): linux-jdk7-m3.6.x_build/archetype-common/target/surefire-reports/*.xml
[withMaven] junitPublisher - Archive test results for Maven artifact org.apache.maven.archetype:archetype-packaging:jar:3.1.2-SNAPSHOT generated by maven-surefire-plugin:test (default-test): linux-jdk7-m3.6.x_build/archetype-packaging/target/surefire-reports/*.xml
[withMaven] junitPublisher - Archive test results for Maven artifact org.apache.maven.plugins:maven-archetype-plugin:maven-plugin:3.1.2-SNAPSHOT generated by maven-surefire-plugin:test (default-test): linux-jdk7-m3.6.x_build/maven-archetype-plugin/target/surefire-reports/*.xml
Recording test results
[withMaven] openTasksPublisher - Scan Tasks for Maven artifact org.apache.maven.archetype:archetype-common:jar:3.1.2-SNAPSHOT in source directory linux-jdk7-m3.6.x_build/archetype-common/src/main/java
[withMaven] openTasksPublisher - Scan Tasks for Maven artifact org.apache.maven.plugins:maven-archetype-plugin:maven-plugin:3.1.2-SNAPSHOT in source directory linux-jdk7-m3.6.x_build/maven-archetype-plugin/src/main/java
[TASKS] Scanning folder '/home/jenkins/jenkins-slave/workspace/ven-box_maven-archetype_buildfix@2' for files matching the pattern 'linux-jdk7-m3.6.x_build/archetype-common/src/main/java/**/*,linux-jdk7-m3.6.x_build/maven-archetype-plugin/src/main/java/**/*' - excludes: null
[TASKS] Found 89 files to scan for tasks
[TASKS] Found 26 open tasks.
Skipping warnings blame since pipelines do not have an SCM link.%n
[TASKS] Computing warning deltas based on reference build #22
[withMaven] invokerPublisher - Archive invoker results for Maven artifact MavenArtifact{org.apache.maven.plugins:maven-archetype-plugin:maven-plugin:3.1.2-SNAPSHOT(version: 3.1.2-SNAPSHOT, snapshot:false) } generated by PluginInvocation{org.apache.maven.plugins:maven-invoker-plugin:3.2.0@run  integration-test}: linux-jdk7-m3.6.x_build/maven-archetype-plugin/target/invoker-reports/*.xml
[withMaven] Publishers: Generated Artifacts Publisher: 6698 ms, Junit Publisher: 8153 ms, Open Task Scanner Publisher: 3634 ms, Dependencies Fingerprint Publisher: 1563 ms, Invoker Publisher: 25272 ms, Pipeline Graph Publisher: 5 ms
[Pipeline] // withMaven
[Pipeline] cleanWs
[WS-CLEANUP] Deleting project workspace...
[WS-CLEANUP] Deferred wipeout is used...
[WS-CLEANUP] done
[Pipeline] }
[Pipeline] // stage
[Pipeline] }
[Pipeline] // ws
[Pipeline] }
[Pipeline] // node
[Pipeline] }
[Pipeline] // parallel
[Pipeline] stage
[Pipeline] { (Notifications)
[Pipeline] echo
Build result: FAILURE
[Pipeline] jiraIssueSelector
[Pipeline] emailext
Reply | Threaded
Open this post in threaded view
|

Build succeeded in Jenkins: Maven TLP » maven-archetype » buildfix #26

Apache Jenkins Server-2
See https://builds.apache.org/job/maven-box/job/maven-archetype/job/buildfix/26/

Changes:

* mrm-maven-plugin:1.2.0 and split invoker:run to two goals
* mrm-maven-plugin:1.2.0 and split invoker:run to two goals
* mrm-maven-plugin:1.2.0 and split invoker:run to two goals
* mrm-maven-plugin:1.2.0 and split invoker:run to two goals
* mrm-maven-plugin:1.2.0 and split invoker:run to two goals
* mrm-maven-plugin:1.2.0 and split invoker:run to two goals
* mrm-maven-plugin:1.2.0 and split invoker:run to two goals
* mrm-maven-plugin:1.2.0 and split invoker:run to two goals

All tests passed