Build failed in Jenkins: Maven TLP » maven-archetype » buildfix #18

classic Classic list List threaded Threaded
2 messages Options
Reply | Threaded
Open this post in threaded view
|

Build failed in Jenkins: Maven TLP » maven-archetype » buildfix #18

Apache Jenkins Server-2
See https://builds.apache.org/job/maven-box/job/maven-archetype/job/buildfix/18/

Changes:

* Archetype ITs should exclude copying unnecessary file build.log (open
* Archetype ITs should exclude copying unnecessary file build.log (open
* Archetype ITs should exclude copying unnecessary file build.log (open
* Archetype ITs should exclude copying unnecessary file build.log (open
* Archetype ITs should exclude copying unnecessary file build.log (open
* Archetype ITs should exclude copying unnecessary file build.log (open
* Archetype ITs should exclude copying unnecessary file build.log (open

All tests passed

Build log:
[...truncated 10862 lines...]
[INFO] Maven Archetype Catalog Model ...................... SUCCESS [ 12.328 s]
[INFO] Maven Archetype Descriptor Model ................... SUCCESS [  1.458 s]
[INFO] Maven Archetype Common ............................. SUCCESS [ 31.228 s]
[INFO] Maven Archetype Packaging .......................... SUCCESS [  0.570 s]
[INFO] Maven Archetype Plugin ............................. FAILURE [04:55 min]
[INFO] ------------------------------------------------------------------------
[INFO] BUILD FAILURE
[INFO] ------------------------------------------------------------------------
[INFO] Total time: 06:15 min
[INFO] Finished at: 2019-07-28T13:44:08-07:00
[INFO] Final Memory: 54M/627M
[INFO] ------------------------------------------------------------------------
[INFO] [jenkins-event-spy] Generated F:\short\jenkins-maven-box-maven-archetype-buildfix-18@tmp\withMaven8b2d12e7\maven-spy-20190728-133752-1748817614422542687460.log
[ERROR] Failed to execute goal org.apache.maven.plugins:maven-invoker-plugin:3.1.0:run (integration-test) on project maven-archetype-plugin: 1 build failed. See console output above for details. -> [Help 1]
org.apache.maven.lifecycle.LifecycleExecutionException: Failed to execute goal org.apache.maven.plugins:maven-invoker-plugin:3.1.0:run (integration-test) on project maven-archetype-plugin: 1 build failed. See console output above for details.
        at org.apache.maven.lifecycle.internal.MojoExecutor.execute(MojoExecutor.java:212)
        at org.apache.maven.lifecycle.internal.MojoExecutor.execute(MojoExecutor.java:153)
        at org.apache.maven.lifecycle.internal.MojoExecutor.execute(MojoExecutor.java:145)
        at org.apache.maven.lifecycle.internal.LifecycleModuleBuilder.buildProject(LifecycleModuleBuilder.java:116)
        at org.apache.maven.lifecycle.internal.LifecycleModuleBuilder.buildProject(LifecycleModuleBuilder.java:80)
        at org.apache.maven.lifecycle.internal.builder.singlethreaded.SingleThreadedBuilder.build(SingleThreadedBuilder.java:51)
        at org.apache.maven.lifecycle.internal.LifecycleStarter.execute(LifecycleStarter.java:120)
        at org.apache.maven.DefaultMaven.doExecute(DefaultMaven.java:355)
        at org.apache.maven.DefaultMaven.execute(DefaultMaven.java:155)
        at org.apache.maven.cli.MavenCli.execute(MavenCli.java:584)
        at org.apache.maven.cli.MavenCli.doMain(MavenCli.java:216)
        at org.apache.maven.cli.MavenCli.main(MavenCli.java:160)
        at sun.reflect.NativeMethodAccessorImpl.invoke0(Native Method)
        at sun.reflect.NativeMethodAccessorImpl.invoke(NativeMethodAccessorImpl.java:57)
        at sun.reflect.DelegatingMethodAccessorImpl.invoke(DelegatingMethodAccessorImpl.java:43)
        at java.lang.reflect.Method.invoke(Method.java:606)
        at org.codehaus.plexus.classworlds.launcher.Launcher.launchEnhanced(Launcher.java:289)
        at org.codehaus.plexus.classworlds.launcher.Launcher.launch(Launcher.java:229)
        at org.codehaus.plexus.classworlds.launcher.Launcher.mainWithExitCode(Launcher.java:415)
        at org.codehaus.plexus.classworlds.launcher.Launcher.main(Launcher.java:356)
Caused by: org.apache.maven.plugin.MojoFailureException: 1 build failed. See console output above for details.
        at org.apache.maven.plugins.invoker.InvokerSession.handleFailures(InvokerSession.java:260)
        at org.apache.maven.plugins.invoker.InvokerMojo.processResults(InvokerMojo.java:68)
        at org.apache.maven.plugins.invoker.AbstractInvokerMojo.execute(AbstractInvokerMojo.java:738)
        at org.apache.maven.plugin.DefaultBuildPluginManager.executeMojo(DefaultBuildPluginManager.java:132)
        at org.apache.maven.lifecycle.internal.MojoExecutor.execute(MojoExecutor.java:208)
        ... 19 more
[ERROR]
[ERROR] Re-run Maven using the -X switch to enable full debug logging.
[ERROR]
[ERROR] For more information about the errors and possible solutions, please read the following articles:
[ERROR] [Help 1] http://cwiki.apache.org/confluence/display/MAVEN/MojoFailureException
[ERROR]
[ERROR] After correcting the problems, you can resume the build with the command
[ERROR]   mvn <goals> -rf :maven-archetype-plugin
Picked up JAVA_TOOL_OPTIONS: -Dmaven.ext.class.path="F:\short\jenkins-maven-box-maven-archetype-buildfix-18@tmp\withMaven8b2d12e7\pipeline-maven-spy.jar" -Dorg.jenkinsci.plugins.pipeline.maven.reportsFolder="F:\short\jenkins-maven-box-maven-archetype-buildfix-18@tmp\withMaven8b2d12e7"
[Pipeline] // stage
[Pipeline] }
[Pipeline] }
[Pipeline] zip
Writing zip file of F:\short\jenkins-maven-box-maven-archetype-buildfix-18\j7m3.3.xb\maven-archetype-plugin\target\local-repo to F:\short\jenkins-maven-box-maven-archetype-buildfix-18\j7m3.3.xb\local-repo-j7m3.3.xb.zip
[Pipeline] // ws
[Pipeline] // dir
[Pipeline] }
[Pipeline] }
[Pipeline] // node
[Pipeline] }
Failed in branch linux-jdk7-m3.6.x_build
[withMaven] artifactsPublisher - Archive artifact j7m3.2.xb\pom.xml under org\apache\maven\archetype\maven-archetype\3.1.2-SNAPSHOT\maven-archetype-3.1.2-SNAPSHOT.pom
[withMaven] artifactsPublisher - Archive artifact j7m3.2.xb\target\maven-archetype-3.1.2-SNAPSHOT-site.xml under org\apache\maven\archetype\maven-archetype\3.1.2-SNAPSHOT\maven-archetype-3.1.2-SNAPSHOT-site.xml
[withMaven] artifactsPublisher - Archive artifact j7m3.2.xb\archetype-models\pom.xml under org\apache\maven\archetype\archetype-models\3.1.2-SNAPSHOT\archetype-models-3.1.2-SNAPSHOT.pom
[withMaven] artifactsPublisher - Archive artifact j7m3.2.xb\archetype-models\target\archetype-models-3.1.2-SNAPSHOT-site.xml under org\apache\maven\archetype\archetype-models\3.1.2-SNAPSHOT\archetype-models-3.1.2-SNAPSHOT-site.xml
[withMaven] artifactsPublisher - Archive artifact j7m3.2.xb\archetype-models\archetype-catalog\pom.xml under org\apache\maven\archetype\archetype-catalog\3.1.2-SNAPSHOT\archetype-catalog-3.1.2-SNAPSHOT.pom
[withMaven] artifactsPublisher - Archive artifact j7m3.2.xb\archetype-models\archetype-catalog\target\archetype-catalog-3.1.2-SNAPSHOT.jar under org\apache\maven\archetype\archetype-catalog\3.1.2-SNAPSHOT\archetype-catalog-3.1.2-SNAPSHOT.jar
[withMaven] artifactsPublisher - Archive artifact j7m3.2.xb\archetype-models\archetype-descriptor\pom.xml under org\apache\maven\archetype\archetype-descriptor\3.1.2-SNAPSHOT\archetype-descriptor-3.1.2-SNAPSHOT.pom
[withMaven] artifactsPublisher - Archive artifact j7m3.2.xb\archetype-models\archetype-descriptor\target\archetype-descriptor-3.1.2-SNAPSHOT.jar under org\apache\maven\archetype\archetype-descriptor\3.1.2-SNAPSHOT\archetype-descriptor-3.1.2-SNAPSHOT.jar
[withMaven] artifactsPublisher - Archive artifact j7m3.2.xb\archetype-common\pom.xml under org\apache\maven\archetype\archetype-common\3.1.2-SNAPSHOT\archetype-common-3.1.2-SNAPSHOT.pom
[withMaven] artifactsPublisher - Archive artifact j7m3.2.xb\archetype-common\target\archetype-common-3.1.2-SNAPSHOT.jar under org\apache\maven\archetype\archetype-common\3.1.2-SNAPSHOT\archetype-common-3.1.2-SNAPSHOT.jar
[withMaven] artifactsPublisher - Archive artifact j7m3.2.xb\archetype-packaging\pom.xml under org\apache\maven\archetype\archetype-packaging\3.1.2-SNAPSHOT\archetype-packaging-3.1.2-SNAPSHOT.pom
[withMaven] artifactsPublisher - Archive artifact j7m3.2.xb\archetype-packaging\target\archetype-packaging-3.1.2-SNAPSHOT.jar under org\apache\maven\archetype\archetype-packaging\3.1.2-SNAPSHOT\archetype-packaging-3.1.2-SNAPSHOT.jar
[withMaven] junitPublisher - Archive test results for Maven artifact org.apache.maven.archetype:archetype-catalog:jar:3.1.2-SNAPSHOT generated by maven-surefire-plugin:test (default-test): j7m3.2.xb\archetype-models\archetype-catalog\target\surefire-reports\*.xml
[withMaven] junitPublisher - Archive test results for Maven artifact org.apache.maven.archetype:archetype-descriptor:jar:3.1.2-SNAPSHOT generated by maven-surefire-plugin:test (default-test): j7m3.2.xb\archetype-models\archetype-descriptor\target\surefire-reports\*.xml
[withMaven] junitPublisher - Archive test results for Maven artifact org.apache.maven.archetype:archetype-common:jar:3.1.2-SNAPSHOT generated by maven-surefire-plugin:test (default-test): j7m3.2.xb\archetype-common\target\surefire-reports\*.xml
[withMaven] junitPublisher - Archive test results for Maven artifact org.apache.maven.archetype:archetype-packaging:jar:3.1.2-SNAPSHOT generated by maven-surefire-plugin:test (default-test): j7m3.2.xb\archetype-packaging\target\surefire-reports\*.xml
[withMaven] junitPublisher - Archive test results for Maven artifact org.apache.maven.plugins:maven-archetype-plugin:maven-plugin:3.1.2-SNAPSHOT generated by maven-surefire-plugin:test (default-test): j7m3.2.xb\maven-archetype-plugin\target\surefire-reports\*.xml
Recording test results
[withMaven] openTasksPublisher - Scan Tasks for Maven artifact org.apache.maven.archetype:archetype-common:jar:3.1.2-SNAPSHOT in source directory j7m3.2.xb\archetype-common\src\main\java
[withMaven] openTasksPublisher - Scan Tasks for Maven artifact org.apache.maven.plugins:maven-archetype-plugin:maven-plugin:3.1.2-SNAPSHOT in source directory j7m3.2.xb\maven-archetype-plugin\src\main\java
[withMaven] openTasksPublisher - Scan Tasks for Maven artifact org.apache.maven.archetype:archetype-common:jar:3.1.2-SNAPSHOT in source directory linux-jdk7-m3.5.x_build/archetype-common/src/main/java
[TASKS] Scanning folder 'F:\short\jenkins-maven-box-maven-archetype-buildfix-18' for files matching the pattern 'j7m3.2.xb\archetype-common\src\main\java\**\*,j7m3.2.xb\maven-archetype-plugin\src\main\java\**\*' - excludes: null
[TASKS] Found 89 files to scan for tasks
[TASKS] Found 26 open tasks.
Skipping warnings blame since pipelines do not have an SCM link.%n
[TASKS] Computing warning deltas based on reference build #17
[withMaven] openTasksPublisher - Scan Tasks for Maven artifact org.apache.maven.plugins:maven-archetype-plugin:maven-plugin:3.1.2-SNAPSHOT in source directory linux-jdk7-m3.5.x_build/maven-archetype-plugin/src/main/java
[withMaven] invokerPublisher - Archive invoker results for Maven artifact MavenArtifact{org.apache.maven.plugins:maven-archetype-plugin:maven-plugin:3.1.2-SNAPSHOT(version: 3.1.2-SNAPSHOT, snapshot:false) } generated by PluginInvocation{org.apache.maven.plugins:maven-invoker-plugin:3.1.0@run  integration-test}: j7m3.2.xb\maven-archetype-plugin\target\invoker-reports\*.xml
[withMaven] Publishers: Generated Artifacts Publisher: 282 ms, Junit Publisher: 369 ms, Open Task Scanner Publisher: 301 ms, Dependencies Fingerprint Publisher: 61 ms, Invoker Publisher: 15952 ms, Pipeline Graph Publisher: 3 ms
[Pipeline] // withMaven
[Pipeline] dir
Running in F:\short\jenkins-maven-box-maven-archetype-buildfix-18@2\j7m3.6.xb
[Pipeline] {
[Pipeline] zip
Writing zip file of F:\short\jenkins-maven-box-maven-archetype-buildfix-18@2\j7m3.6.xb\maven-archetype-plugin\target\it\projects to F:\short\jenkins-maven-box-maven-archetype-buildfix-18@2\j7m3.6.xb\archetype-plugin-its-j7m3.6.xb.zip
Zipped 417 entries.
Archiving F:\short\jenkins-maven-box-maven-archetype-buildfix-18\j7m3.3.xb\local-repo-j7m3.3.xb.zip
[TASKS] Scanning folder '/home/jenkins/jenkins-slave/workspace/ven-box_maven-archetype_buildfix@2' for files matching the pattern 'linux-jdk7-m3.5.x_build/archetype-common/src/main/java/**/*,linux-jdk7-m3.5.x_build/maven-archetype-plugin/src/main/java/**/*' - excludes: null
[TASKS] Found 89 files to scan for tasks
[TASKS] Found 26 open tasks.
Skipping warnings blame since pipelines do not have an SCM link.%n
[TASKS] Computing warning deltas based on reference build #17
Zipped 2566 entries.
Archiving F:\short\jenkins-maven-box-maven-archetype-buildfix-18@2\j7m3.6.xb\archetype-plugin-its-j7m3.6.xb.zip
[Pipeline] zip
Writing zip file of F:\short\jenkins-maven-box-maven-archetype-buildfix-18\j7m3.3.xb\maven-archetype-plugin\target\mock-repo to F:\short\jenkins-maven-box-maven-archetype-buildfix-18\j7m3.3.xb\mock-repo-j7m3.3.xb.zip
Zipped 5 entries.
Archiving F:\short\jenkins-maven-box-maven-archetype-buildfix-18\j7m3.3.xb\mock-repo-j7m3.3.xb.zip
[Pipeline] zip
Writing zip file of F:\short\jenkins-maven-box-maven-archetype-buildfix-18\j7m3.3.xb\maven-archetype-plugin\target\archetype-repo to F:\short\jenkins-maven-box-maven-archetype-buildfix-18\j7m3.3.xb\archetype-repo-j7m3.3.xb.zip
Zipped 5 entries.
Archiving F:\short\jenkins-maven-box-maven-archetype-buildfix-18\j7m3.3.xb\archetype-repo-j7m3.3.xb.zip
[Pipeline] }
[Pipeline] // dir
[Pipeline] cleanWs
[WS-CLEANUP] Deleting project workspace...
[WS-CLEANUP] Deferred wipeout is used...
[WS-CLEANUP] done
[Pipeline] cleanWs
[WS-CLEANUP] Deleting project workspace...
[WS-CLEANUP] Deferred wipeout is used...
[WS-CLEANUP] done
[Pipeline] }
[Pipeline] // stage
[Pipeline] }
[Pipeline] // ws
[Pipeline] }
[Pipeline] // node
[Pipeline] }
Failed in branch windows-jdk7-m3.3.x_build
[withMaven] invokerPublisher - Archive invoker results for Maven artifact MavenArtifact{org.apache.maven.plugins:maven-archetype-plugin:maven-plugin:3.1.2-SNAPSHOT(version: 3.1.2-SNAPSHOT, snapshot:false) } generated by PluginInvocation{org.apache.maven.plugins:maven-invoker-plugin:3.1.0@run  integration-test}: linux-jdk7-m3.5.x_build/maven-archetype-plugin/target/invoker-reports/*.xml
[Pipeline] zip
Writing zip file of F:\short\jenkins-maven-box-maven-archetype-buildfix-18@2\j7m3.6.xb\maven-archetype-plugin\target\local-repo to F:\short\jenkins-maven-box-maven-archetype-buildfix-18@2\j7m3.6.xb\local-repo-j7m3.6.xb.zip
Zipped 417 entries.
Archiving F:\short\jenkins-maven-box-maven-archetype-buildfix-18@2\j7m3.6.xb\local-repo-j7m3.6.xb.zip
[Pipeline] zip
Writing zip file of F:\short\jenkins-maven-box-maven-archetype-buildfix-18@2\j7m3.6.xb\maven-archetype-plugin\target\mock-repo to F:\short\jenkins-maven-box-maven-archetype-buildfix-18@2\j7m3.6.xb\mock-repo-j7m3.6.xb.zip
Zipped 5 entries.
Archiving F:\short\jenkins-maven-box-maven-archetype-buildfix-18@2\j7m3.6.xb\mock-repo-j7m3.6.xb.zip
[Pipeline] zip
Writing zip file of F:\short\jenkins-maven-box-maven-archetype-buildfix-18@2\j7m3.6.xb\maven-archetype-plugin\target\archetype-repo to F:\short\jenkins-maven-box-maven-archetype-buildfix-18@2\j7m3.6.xb\archetype-repo-j7m3.6.xb.zip
Zipped 5 entries.
Archiving F:\short\jenkins-maven-box-maven-archetype-buildfix-18@2\j7m3.6.xb\archetype-repo-j7m3.6.xb.zip
[Pipeline] }
[Pipeline] // dir
[Pipeline] cleanWs
[WS-CLEANUP] Deleting project workspace...
[WS-CLEANUP] Deferred wipeout is used...
[WS-CLEANUP] done
[Pipeline] cleanWs
[WS-CLEANUP] Deleting project workspace...
[WS-CLEANUP] Deferred wipeout is used...
[WS-CLEANUP] done
[Pipeline] }
[Pipeline] // stage
[Pipeline] }
[Pipeline] // ws
[Pipeline] }
[Pipeline] // node
[Pipeline] }
Failed in branch windows-jdk7-m3.6.x_build
[withMaven] Publishers: Generated Artifacts Publisher: 292 ms, Junit Publisher: 453 ms, Open Task Scanner Publisher: 379 ms, Dependencies Fingerprint Publisher: 64 ms, Invoker Publisher: 16784 ms, Pipeline Graph Publisher: 5 ms
[Pipeline] // withMaven
[Pipeline] dir
Running in F:\short\jenkins-maven-box-maven-archetype-buildfix-18\j7m3.2.xb
[Pipeline] {
[Pipeline] zip
Writing zip file of F:\short\jenkins-maven-box-maven-archetype-buildfix-18\j7m3.2.xb\maven-archetype-plugin\target\it\projects to F:\short\jenkins-maven-box-maven-archetype-buildfix-18\j7m3.2.xb\archetype-plugin-its-j7m3.2.xb.zip
Zipped 2386 entries.
Archiving F:\short\jenkins-maven-box-maven-archetype-buildfix-18\j7m3.2.xb\archetype-plugin-its-j7m3.2.xb.zip
[Pipeline] zip
Writing zip file of F:\short\jenkins-maven-box-maven-archetype-buildfix-18\j7m3.2.xb\maven-archetype-plugin\target\local-repo to F:\short\jenkins-maven-box-maven-archetype-buildfix-18\j7m3.2.xb\local-repo-j7m3.2.xb.zip
Zipped 417 entries.
Archiving F:\short\jenkins-maven-box-maven-archetype-buildfix-18\j7m3.2.xb\local-repo-j7m3.2.xb.zip
[Pipeline] zip
Writing zip file of F:\short\jenkins-maven-box-maven-archetype-buildfix-18\j7m3.2.xb\maven-archetype-plugin\target\mock-repo to F:\short\jenkins-maven-box-maven-archetype-buildfix-18\j7m3.2.xb\mock-repo-j7m3.2.xb.zip
Zipped 5 entries.
Archiving F:\short\jenkins-maven-box-maven-archetype-buildfix-18\j7m3.2.xb\mock-repo-j7m3.2.xb.zip
[Pipeline] zip
Writing zip file of F:\short\jenkins-maven-box-maven-archetype-buildfix-18\j7m3.2.xb\maven-archetype-plugin\target\archetype-repo to F:\short\jenkins-maven-box-maven-archetype-buildfix-18\j7m3.2.xb\archetype-repo-j7m3.2.xb.zip
Zipped 5 entries.
Archiving F:\short\jenkins-maven-box-maven-archetype-buildfix-18\j7m3.2.xb\archetype-repo-j7m3.2.xb.zip
[Pipeline] }
[Pipeline] // dir
[Pipeline] cleanWs
[WS-CLEANUP] Deleting project workspace...
[WS-CLEANUP] Deferred wipeout is used...
[WS-CLEANUP] done
[Pipeline] cleanWs
[WS-CLEANUP] Deleting project workspace...
[WS-CLEANUP] Deferred wipeout is used...
[WS-CLEANUP] done
[Pipeline] }
[Pipeline] // stage
[Pipeline] }
[Pipeline] // ws
[Pipeline] }
[Pipeline] // node
[Pipeline] }
Failed in branch windows-jdk7-m3.2.x_build
[withMaven] Publishers: Generated Artifacts Publisher: 5136 ms, Junit Publisher: 8231 ms, Open Task Scanner Publisher: 3620 ms, Dependencies Fingerprint Publisher: 1575 ms, Invoker Publisher: 25224 ms, Pipeline Graph Publisher: 4 ms
[Pipeline] // withMaven
[Pipeline] dir
Running in /home/jenkins/jenkins-slave/workspace/ven-box_maven-archetype_buildfix@2/linux-jdk7-m3.5.x_build
[Pipeline] {
[Pipeline] zip
Writing zip file of /home/jenkins/jenkins-slave/workspace/ven-box_maven-archetype_buildfix@2/linux-jdk7-m3.5.x_build/maven-archetype-plugin/target/it/projects to /home/jenkins/jenkins-slave/workspace/ven-box_maven-archetype_buildfix@2/linux-jdk7-m3.5.x_build/archetype-plugin-its-linux-jdk7-m3.5.x_build.zip
Zipped 2572 entries.
Archiving /home/jenkins/jenkins-slave/workspace/ven-box_maven-archetype_buildfix@2/linux-jdk7-m3.5.x_build/archetype-plugin-its-linux-jdk7-m3.5.x_build.zip
[Pipeline] zip
Writing zip file of /home/jenkins/jenkins-slave/workspace/ven-box_maven-archetype_buildfix@2/linux-jdk7-m3.5.x_build/maven-archetype-plugin/target/local-repo to /home/jenkins/jenkins-slave/workspace/ven-box_maven-archetype_buildfix@2/linux-jdk7-m3.5.x_build/local-repo-linux-jdk7-m3.5.x_build.zip
Zipped 418 entries.
Archiving /home/jenkins/jenkins-slave/workspace/ven-box_maven-archetype_buildfix@2/linux-jdk7-m3.5.x_build/local-repo-linux-jdk7-m3.5.x_build.zip
[Pipeline] zip
Writing zip file of /home/jenkins/jenkins-slave/workspace/ven-box_maven-archetype_buildfix@2/linux-jdk7-m3.5.x_build/maven-archetype-plugin/target/mock-repo to /home/jenkins/jenkins-slave/workspace/ven-box_maven-archetype_buildfix@2/linux-jdk7-m3.5.x_build/mock-repo-linux-jdk7-m3.5.x_build.zip
Zipped 5 entries.
Archiving /home/jenkins/jenkins-slave/workspace/ven-box_maven-archetype_buildfix@2/linux-jdk7-m3.5.x_build/mock-repo-linux-jdk7-m3.5.x_build.zip
[Pipeline] zip
Writing zip file of /home/jenkins/jenkins-slave/workspace/ven-box_maven-archetype_buildfix@2/linux-jdk7-m3.5.x_build/maven-archetype-plugin/target/archetype-repo to /home/jenkins/jenkins-slave/workspace/ven-box_maven-archetype_buildfix@2/linux-jdk7-m3.5.x_build/archetype-repo-linux-jdk7-m3.5.x_build.zip
Zipped 5 entries.
Archiving /home/jenkins/jenkins-slave/workspace/ven-box_maven-archetype_buildfix@2/linux-jdk7-m3.5.x_build/archetype-repo-linux-jdk7-m3.5.x_build.zip
[Pipeline] }
[Pipeline] // dir
[Pipeline] cleanWs
[WS-CLEANUP] Deleting project workspace...
[WS-CLEANUP] Deferred wipeout is used...
[WS-CLEANUP] done
[Pipeline] cleanWs
[WS-CLEANUP] Deleting project workspace...
[WS-CLEANUP] Deferred wipeout is used...
[WS-CLEANUP] done
[Pipeline] }
[Pipeline] // stage
[Pipeline] }
[Pipeline] // ws
[Pipeline] }
[Pipeline] // node
[Pipeline] }
Failed in branch linux-jdk7-m3.5.x_build
[Pipeline] // parallel
[Pipeline] stage
[Pipeline] { (Notifications)
[Pipeline] echo
Build result: FAILURE
[Pipeline] jiraIssueSelector
[Pipeline] emailext
Reply | Threaded
Open this post in threaded view
|

Build succeeded in Jenkins: Maven TLP » maven-archetype » buildfix #19

Apache Jenkins Server-2