Build failed in Jenkins: Maven TLP » maven-archetype » buildfix #1

classic Classic list List threaded Threaded
7 messages Options
Reply | Threaded
Open this post in threaded view
|

Build failed in Jenkins: Maven TLP » maven-archetype » buildfix #1

Apache Jenkins Server-2
See https://builds.apache.org/job/maven-box/job/maven-archetype/job/buildfix/1/

No changes.

All tests passed

Build log:
[...truncated 20480 lines...]
[INFO]           exclude-patterns-2/pom.xml ....................... SUCCESS (6.6 s)
[INFO] Building: create-2/pom.xml
[INFO]           create-2/pom.xml ................................. SUCCESS (6.4 s)
[INFO] Building: create-6/pom.xml
[INFO] run post-build script verify.groovy
[INFO]           roundtrip-multi/pom.xml .......................... SUCCESS (14.9 s)
[INFO] Building: create-4/pom.xml
[INFO] run post-build script verify.groovy
[INFO]           create-6/pom.xml ................................. SUCCESS (6.4 s)
[INFO] Building: create-from-project/pom.xml
[INFO] run post-build script verify.groovy
[INFO]           create-4/pom.xml ................................. SUCCESS (6.9 s)
[INFO] Building: included-system-properties/pom.xml
[withMaven] Publishers: Generated Artifacts Publisher: 5638 ms, Junit Publisher: 7943 ms, Open Task Scanner Publisher: 4277 ms, Dependencies Fingerprint Publisher: 1516 ms, Invoker Publisher: 26703 ms, Pipeline Graph Publisher: 5 ms
[Pipeline] // withMaven
[Pipeline] cleanWs
[WS-CLEANUP] Deleting project workspace...
[WS-CLEANUP] Deferred wipeout is used...
[WS-CLEANUP] done
[Pipeline] }
[Pipeline] // stage
[Pipeline] }
[Pipeline] // ws
[Pipeline] }
[Pipeline] // node
[Pipeline] }
[INFO] run post-build script verify.bsh
[INFO]           create-from-project/pom.xml ...................... SUCCESS (6.2 s)
[INFO] Building: exclude-patterns/pom.xml
[INFO] run post-build script verify.groovy
[INFO]           included-system-properties/pom.xml ............... SUCCESS (7.0 s)
[INFO] Building: create-1/pom.xml
[INFO] run post-build script verify.groovy
[INFO]           exclude-patterns/pom.xml ......................... SUCCESS (6.3 s)
[INFO] Building: ARCHETYPE-521_archetype-repo
[INFO] run post-build script verify.groovy
[INFO]           ARCHETYPE-521_archetype-repo ..................... SUCCESS (3.2 s)
[INFO] Building: build-archetype/pom.xml
[INFO] run pre-build script setup.bsh
[INFO] run post-build script verify.groovy
[INFO]           create-1/pom.xml ................................. SUCCESS (7.0 s)
[INFO] Building: exclude-patterns/pom.xml
[INFO] run post-build script verify.groovy
[INFO]           exclude-patterns/pom.xml ......................... SUCCESS (6.9 s)
[INFO] Building: ARCHETYPE-520_mirror
[INFO] run post-build script verify.groovy
[INFO]           ARCHETYPE-520_mirror ............................. SUCCESS (3.4 s)
[INFO] Building: exclude-patterns-2/pom.xml
[INFO] run post-build script verify.bsh
[INFO]           build-archetype/pom.xml .......................... SUCCESS (10.8 s)
[INFO] Building: roundtrip-multi/pom.xml
[INFO] run post-build script verify.groovy
[INFO]           exclude-patterns-2/pom.xml ....................... SUCCESS (6.9 s)
[INFO] Building: build-ignore-eol/pom.xml
[INFO] run pre-build script setup.bsh
[INFO] run post-build script verify.groovy
[INFO]           roundtrip-multi/pom.xml .......................... SUCCESS (13.7 s)
[INFO] Building: create-from-project-exclude-patterns/pom.xml
[INFO] run post-build script verify.bsh
[INFO]           create-from-project-exclude-patterns/pom.xml ..... SUCCESS (6.6 s)
[INFO] Building: include-file-with-no-extension/pom.xml
[INFO] run post-build script verify.bsh
[INFO]           build-ignore-eol/pom.xml ......................... SUCCESS (14.5 s)
[INFO] Building: build-and-run-its/pom.xml
[INFO] run post-build script verify.groovy
[INFO]           include-file-with-no-extension/pom.xml ........... SUCCESS (6.7 s)
[INFO] Building: included-system-properties/pom.xml
[INFO] run post-build script verify.bsh
[INFO]           build-and-run-its/pom.xml ........................ SUCCESS (10.6 s)
[INFO] Building: change-file-with-property/pom.xml
[INFO] run post-build script verify.groovy
[INFO]           included-system-properties/pom.xml ............... SUCCESS (6.7 s)
[INFO] Building: generate-basic
[INFO] run post-build script verify.bsh
[INFO]           generate-basic ................................... SUCCESS (3.1 s)
[INFO] Building: create-3/pom.xml
[INFO] run post-build script verify.groovy
[INFO]           change-file-with-property/pom.xml ................ SUCCESS (7.2 s)
[INFO] -------------------------------------------------
[INFO] Build Summary:
[INFO]   Passed: 25, Failed: 0, Errors: 0, Skipped: 0
[INFO] -------------------------------------------------
[INFO]
[INFO] --- mrm-maven-plugin:1.1.0:stop (mirror) @ maven-archetype-plugin ---
[INFO] Stopping Mock Repository Manager on http://localhost:40179
[INFO] Stopped SocketConnector@0.0.0.0:40179
[INFO] Mock Repository Manager http://localhost:40179 is stopped.
[INFO]
[INFO] --- mrm-maven-plugin:1.1.0:stop (archetype-repository) @ maven-archetype-plugin ---
[INFO] Stopping Mock Repository Manager on http://localhost:35862
[INFO] Stopped SocketConnector@0.0.0.0:35862
[INFO] Mock Repository Manager http://localhost:35862 is stopped.
[INFO]
[INFO] --- maven-checkstyle-plugin:3.0.0:check (checkstyle-check) @ maven-archetype-plugin ---
[INFO] There are 46 errors reported by Checkstyle 6.18 with config/maven_checks.xml ruleset.
[INFO] Ignored 46 errors, 0 violation remaining.
[INFO] ------------------------------------------------------------------------
[INFO] Reactor Summary for Maven Archetype 3.1.2-SNAPSHOT:
[INFO]
[INFO] Maven Archetype .................................... SUCCESS [  4.569 s]
[INFO] Maven Archetype Models ............................. SUCCESS [  0.466 s]
[INFO] Maven Archetype Catalog Model ...................... SUCCESS [  2.755 s]
[INFO] Maven Archetype Descriptor Model ................... SUCCESS [  0.798 s]
[INFO] Maven Archetype Common ............................. SUCCESS [ 14.689 s]
[INFO] Maven Archetype Packaging .......................... SUCCESS [  0.316 s]
[INFO] Maven Archetype Plugin ............................. SUCCESS [03:50 min]
[INFO] ------------------------------------------------------------------------
[INFO] BUILD SUCCESS
[INFO] ------------------------------------------------------------------------
[INFO] Total time:  04:14 min
[INFO] Finished at: 2019-07-27T15:53:13Z
[INFO] ------------------------------------------------------------------------
[INFO] [jenkins-event-spy] Generated /home/jenkins/jenkins-slave/workspace/ven-box_maven-archetype_buildfix@2@tmp/withMavene0fc1dd0/maven-spy-20190727-154858-8682261492313050197097.log
[Pipeline] }
[Pipeline] // dir
[Pipeline] }
[withMaven] artifactsPublisher - Archive artifact linux-jdk12-m3.6.x_build/pom.xml under org/apache/maven/archetype/maven-archetype/3.1.2-SNAPSHOT/maven-archetype-3.1.2-SNAPSHOT.pom
[withMaven] artifactsPublisher - Archive artifact linux-jdk12-m3.6.x_build/target/maven-archetype-3.1.2-SNAPSHOT-site.xml under org/apache/maven/archetype/maven-archetype/3.1.2-SNAPSHOT/maven-archetype-3.1.2-SNAPSHOT-site.xml
[withMaven] artifactsPublisher - Archive artifact linux-jdk12-m3.6.x_build/archetype-models/pom.xml under org/apache/maven/archetype/archetype-models/3.1.2-SNAPSHOT/archetype-models-3.1.2-SNAPSHOT.pom
[withMaven] artifactsPublisher - Archive artifact linux-jdk12-m3.6.x_build/archetype-models/target/archetype-models-3.1.2-SNAPSHOT-site.xml under org/apache/maven/archetype/archetype-models/3.1.2-SNAPSHOT/archetype-models-3.1.2-SNAPSHOT-site.xml
[withMaven] artifactsPublisher - Archive artifact linux-jdk12-m3.6.x_build/archetype-models/archetype-catalog/pom.xml under org/apache/maven/archetype/archetype-catalog/3.1.2-SNAPSHOT/archetype-catalog-3.1.2-SNAPSHOT.pom
[withMaven] artifactsPublisher - Archive artifact linux-jdk12-m3.6.x_build/archetype-models/archetype-catalog/target/archetype-catalog-3.1.2-SNAPSHOT.jar under org/apache/maven/archetype/archetype-catalog/3.1.2-SNAPSHOT/archetype-catalog-3.1.2-SNAPSHOT.jar
[withMaven] artifactsPublisher - Archive artifact linux-jdk12-m3.6.x_build/archetype-models/archetype-descriptor/pom.xml under org/apache/maven/archetype/archetype-descriptor/3.1.2-SNAPSHOT/archetype-descriptor-3.1.2-SNAPSHOT.pom
[withMaven] artifactsPublisher - Archive artifact linux-jdk12-m3.6.x_build/archetype-models/archetype-descriptor/target/archetype-descriptor-3.1.2-SNAPSHOT.jar under org/apache/maven/archetype/archetype-descriptor/3.1.2-SNAPSHOT/archetype-descriptor-3.1.2-SNAPSHOT.jar
[withMaven] artifactsPublisher - Archive artifact linux-jdk12-m3.6.x_build/archetype-common/pom.xml under org/apache/maven/archetype/archetype-common/3.1.2-SNAPSHOT/archetype-common-3.1.2-SNAPSHOT.pom
[INFO] run post-build script verify.groovy
[INFO]           create-3/pom.xml ................................. SUCCESS (6.7 s)
[INFO] Building: build-ignore-eol/pom.xml
[INFO] run pre-build script setup.bsh
[withMaven] artifactsPublisher - Archive artifact linux-jdk12-m3.6.x_build/archetype-common/target/archetype-common-3.1.2-SNAPSHOT.jar under org/apache/maven/archetype/archetype-common/3.1.2-SNAPSHOT/archetype-common-3.1.2-SNAPSHOT.jar
[withMaven] artifactsPublisher - Archive artifact linux-jdk12-m3.6.x_build/archetype-packaging/pom.xml under org/apache/maven/archetype/archetype-packaging/3.1.2-SNAPSHOT/archetype-packaging-3.1.2-SNAPSHOT.pom
[withMaven] artifactsPublisher - Archive artifact linux-jdk12-m3.6.x_build/archetype-packaging/target/archetype-packaging-3.1.2-SNAPSHOT.jar under org/apache/maven/archetype/archetype-packaging/3.1.2-SNAPSHOT/archetype-packaging-3.1.2-SNAPSHOT.jar
[withMaven] artifactsPublisher - Archive artifact linux-jdk12-m3.6.x_build/maven-archetype-plugin/pom.xml under org/apache/maven/plugins/maven-archetype-plugin/3.1.2-SNAPSHOT/maven-archetype-plugin-3.1.2-SNAPSHOT.pom
[withMaven] artifactsPublisher - Archive artifact linux-jdk12-m3.6.x_build/maven-archetype-plugin/target/maven-archetype-plugin-3.1.2-SNAPSHOT.jar under org/apache/maven/plugins/maven-archetype-plugin/3.1.2-SNAPSHOT/maven-archetype-plugin-3.1.2-SNAPSHOT.jar
[Fast Archiver] No prior successful build to compare, so performing full copy of artifacts
[withMaven] junitPublisher - Archive test results for Maven artifact org.apache.maven.archetype:archetype-catalog:jar:3.1.2-SNAPSHOT generated by maven-surefire-plugin:test (default-test): linux-jdk12-m3.6.x_build/archetype-models/archetype-catalog/target/surefire-reports/*.xml
[withMaven] junitPublisher - Archive test results for Maven artifact org.apache.maven.archetype:archetype-descriptor:jar:3.1.2-SNAPSHOT generated by maven-surefire-plugin:test (default-test): linux-jdk12-m3.6.x_build/archetype-models/archetype-descriptor/target/surefire-reports/*.xml
[withMaven] junitPublisher - Archive test results for Maven artifact org.apache.maven.archetype:archetype-common:jar:3.1.2-SNAPSHOT generated by maven-surefire-plugin:test (default-test): linux-jdk12-m3.6.x_build/archetype-common/target/surefire-reports/*.xml
[withMaven] junitPublisher - Archive test results for Maven artifact org.apache.maven.archetype:archetype-packaging:jar:3.1.2-SNAPSHOT generated by maven-surefire-plugin:test (default-test): linux-jdk12-m3.6.x_build/archetype-packaging/target/surefire-reports/*.xml
[withMaven] junitPublisher - Archive test results for Maven artifact org.apache.maven.plugins:maven-archetype-plugin:maven-plugin:3.1.2-SNAPSHOT generated by maven-surefire-plugin:test (default-test): linux-jdk12-m3.6.x_build/maven-archetype-plugin/target/surefire-reports/*.xml
Recording test results
[withMaven] openTasksPublisher - Scan Tasks for Maven artifact org.apache.maven.archetype:archetype-common:jar:3.1.2-SNAPSHOT in source directory linux-jdk12-m3.6.x_build/archetype-common/src/main/java
[withMaven] openTasksPublisher - Scan Tasks for Maven artifact org.apache.maven.plugins:maven-archetype-plugin:maven-plugin:3.1.2-SNAPSHOT in source directory linux-jdk12-m3.6.x_build/maven-archetype-plugin/src/main/java
[TASKS] Scanning folder '/home/jenkins/jenkins-slave/workspace/ven-box_maven-archetype_buildfix@2' for files matching the pattern 'linux-jdk12-m3.6.x_build/archetype-common/src/main/java/**/*,linux-jdk12-m3.6.x_build/maven-archetype-plugin/src/main/java/**/*' - excludes: null
[TASKS] Found 89 files to scan for tasks
[TASKS] Found 26 open tasks.
Skipping warnings blame since pipelines do not have an SCM link.%n
[INFO] run post-build script verify.bsh
[INFO]           build-ignore-eol/pom.xml ......................... SUCCESS (13.2 s)
[INFO] -------------------------------------------------
[INFO] Build Summary:
[INFO]   Passed: 25, Failed: 0, Errors: 0, Skipped: 0
[INFO] -------------------------------------------------
[INFO]
[INFO] --- mrm-maven-plugin:1.1.0:stop (mirror) @ maven-archetype-plugin ---
[INFO] Stopping Mock Repository Manager on http://localhost:45439
[INFO] Stopped SocketConnector@0.0.0.0:45439
[INFO] Mock Repository Manager http://localhost:45439 is stopped.
[INFO]
[INFO] --- mrm-maven-plugin:1.1.0:stop (archetype-repository) @ maven-archetype-plugin ---
[INFO] Stopping Mock Repository Manager on http://localhost:40097
[INFO] Stopped SocketConnector@0.0.0.0:40097
[INFO] Mock Repository Manager http://localhost:40097 is stopped.
[INFO]
[INFO] --- maven-checkstyle-plugin:3.0.0:check (checkstyle-check) @ maven-archetype-plugin ---
[INFO] There are 46 errors reported by Checkstyle 6.18 with config/maven_checks.xml ruleset.
[INFO] Ignored 46 errors, 0 violation remaining.
[INFO] ------------------------------------------------------------------------
[INFO] Reactor Summary for Maven Archetype 3.1.2-SNAPSHOT:
[INFO]
[INFO] Maven Archetype .................................... SUCCESS [  5.264 s]
[INFO] Maven Archetype Models ............................. SUCCESS [  0.358 s]
[INFO] Maven Archetype Catalog Model ...................... SUCCESS [  2.242 s]
[INFO] Maven Archetype Descriptor Model ................... SUCCESS [  0.705 s]
[INFO] Maven Archetype Common ............................. SUCCESS [ 13.873 s]
[INFO] Maven Archetype Packaging .......................... SUCCESS [  0.331 s]
[INFO] Maven Archetype Plugin ............................. SUCCESS [03:37 min]
[INFO] ------------------------------------------------------------------------
[INFO] BUILD SUCCESS
[INFO] ------------------------------------------------------------------------
[INFO] Total time:  04:00 min
[INFO] Finished at: 2019-07-27T15:53:32Z
[INFO] ------------------------------------------------------------------------
[INFO] [jenkins-event-spy] Generated /home/jenkins/jenkins-slave/workspace/ven-box_maven-archetype_buildfix@2@tmp/withMavena5b2a2ef/maven-spy-20190727-154931-1228070975200640526132.log
[Pipeline] }
[Pipeline] // dir
[Pipeline] }
[withMaven] artifactsPublisher - Archive artifact linux-jdk13-m3.6.x_build/pom.xml under org/apache/maven/archetype/maven-archetype/3.1.2-SNAPSHOT/maven-archetype-3.1.2-SNAPSHOT.pom
[withMaven] artifactsPublisher - Archive artifact linux-jdk13-m3.6.x_build/target/maven-archetype-3.1.2-SNAPSHOT-site.xml under org/apache/maven/archetype/maven-archetype/3.1.2-SNAPSHOT/maven-archetype-3.1.2-SNAPSHOT-site.xml
[withMaven] artifactsPublisher - Archive artifact linux-jdk13-m3.6.x_build/archetype-models/pom.xml under org/apache/maven/archetype/archetype-models/3.1.2-SNAPSHOT/archetype-models-3.1.2-SNAPSHOT.pom
[withMaven] invokerPublisher - Archive invoker results for Maven artifact MavenArtifact{org.apache.maven.plugins:maven-archetype-plugin:maven-plugin:3.1.2-SNAPSHOT(version: 3.1.2-SNAPSHOT, snapshot:false) } generated by PluginInvocation{org.apache.maven.plugins:maven-invoker-plugin:3.1.0@run  integration-test}: linux-jdk12-m3.6.x_build/maven-archetype-plugin/target/invoker-reports/*.xml
[withMaven] artifactsPublisher - Archive artifact linux-jdk13-m3.6.x_build/archetype-models/target/archetype-models-3.1.2-SNAPSHOT-site.xml under org/apache/maven/archetype/archetype-models/3.1.2-SNAPSHOT/archetype-models-3.1.2-SNAPSHOT-site.xml
[withMaven] artifactsPublisher - Archive artifact linux-jdk13-m3.6.x_build/archetype-models/archetype-catalog/pom.xml under org/apache/maven/archetype/archetype-catalog/3.1.2-SNAPSHOT/archetype-catalog-3.1.2-SNAPSHOT.pom
[withMaven] artifactsPublisher - Archive artifact linux-jdk13-m3.6.x_build/archetype-models/archetype-catalog/target/archetype-catalog-3.1.2-SNAPSHOT.jar under org/apache/maven/archetype/archetype-catalog/3.1.2-SNAPSHOT/archetype-catalog-3.1.2-SNAPSHOT.jar
[withMaven] artifactsPublisher - Archive artifact linux-jdk13-m3.6.x_build/archetype-models/archetype-descriptor/pom.xml under org/apache/maven/archetype/archetype-descriptor/3.1.2-SNAPSHOT/archetype-descriptor-3.1.2-SNAPSHOT.pom
[withMaven] artifactsPublisher - Archive artifact linux-jdk13-m3.6.x_build/archetype-models/archetype-descriptor/target/archetype-descriptor-3.1.2-SNAPSHOT.jar under org/apache/maven/archetype/archetype-descriptor/3.1.2-SNAPSHOT/archetype-descriptor-3.1.2-SNAPSHOT.jar
[withMaven] artifactsPublisher - Archive artifact linux-jdk13-m3.6.x_build/archetype-common/pom.xml under org/apache/maven/archetype/archetype-common/3.1.2-SNAPSHOT/archetype-common-3.1.2-SNAPSHOT.pom
[withMaven] artifactsPublisher - Archive artifact linux-jdk13-m3.6.x_build/archetype-common/target/archetype-common-3.1.2-SNAPSHOT.jar under org/apache/maven/archetype/archetype-common/3.1.2-SNAPSHOT/archetype-common-3.1.2-SNAPSHOT.jar
[withMaven] artifactsPublisher - Archive artifact linux-jdk13-m3.6.x_build/archetype-packaging/pom.xml under org/apache/maven/archetype/archetype-packaging/3.1.2-SNAPSHOT/archetype-packaging-3.1.2-SNAPSHOT.pom
[withMaven] artifactsPublisher - Archive artifact linux-jdk13-m3.6.x_build/archetype-packaging/target/archetype-packaging-3.1.2-SNAPSHOT.jar under org/apache/maven/archetype/archetype-packaging/3.1.2-SNAPSHOT/archetype-packaging-3.1.2-SNAPSHOT.jar
[withMaven] artifactsPublisher - Archive artifact linux-jdk13-m3.6.x_build/maven-archetype-plugin/pom.xml under org/apache/maven/plugins/maven-archetype-plugin/3.1.2-SNAPSHOT/maven-archetype-plugin-3.1.2-SNAPSHOT.pom
[withMaven] artifactsPublisher - Archive artifact linux-jdk13-m3.6.x_build/maven-archetype-plugin/target/maven-archetype-plugin-3.1.2-SNAPSHOT.jar under org/apache/maven/plugins/maven-archetype-plugin/3.1.2-SNAPSHOT/maven-archetype-plugin-3.1.2-SNAPSHOT.jar
[Fast Archiver] No prior successful build to compare, so performing full copy of artifacts
[withMaven] junitPublisher - Archive test results for Maven artifact org.apache.maven.archetype:archetype-catalog:jar:3.1.2-SNAPSHOT generated by maven-surefire-plugin:test (default-test): linux-jdk13-m3.6.x_build/archetype-models/archetype-catalog/target/surefire-reports/*.xml
[withMaven] junitPublisher - Archive test results for Maven artifact org.apache.maven.archetype:archetype-descriptor:jar:3.1.2-SNAPSHOT generated by maven-surefire-plugin:test (default-test): linux-jdk13-m3.6.x_build/archetype-models/archetype-descriptor/target/surefire-reports/*.xml
[withMaven] junitPublisher - Archive test results for Maven artifact org.apache.maven.archetype:archetype-common:jar:3.1.2-SNAPSHOT generated by maven-surefire-plugin:test (default-test): linux-jdk13-m3.6.x_build/archetype-common/target/surefire-reports/*.xml
[withMaven] junitPublisher - Archive test results for Maven artifact org.apache.maven.archetype:archetype-packaging:jar:3.1.2-SNAPSHOT generated by maven-surefire-plugin:test (default-test): linux-jdk13-m3.6.x_build/archetype-packaging/target/surefire-reports/*.xml
[withMaven] junitPublisher - Archive test results for Maven artifact org.apache.maven.plugins:maven-archetype-plugin:maven-plugin:3.1.2-SNAPSHOT generated by maven-surefire-plugin:test (default-test): linux-jdk13-m3.6.x_build/maven-archetype-plugin/target/surefire-reports/*.xml
Recording test results
[withMaven] openTasksPublisher - Scan Tasks for Maven artifact org.apache.maven.archetype:archetype-common:jar:3.1.2-SNAPSHOT in source directory linux-jdk13-m3.6.x_build/archetype-common/src/main/java
[withMaven] openTasksPublisher - Scan Tasks for Maven artifact org.apache.maven.plugins:maven-archetype-plugin:maven-plugin:3.1.2-SNAPSHOT in source directory linux-jdk13-m3.6.x_build/maven-archetype-plugin/src/main/java
[TASKS] Scanning folder '/home/jenkins/jenkins-slave/workspace/ven-box_maven-archetype_buildfix@2' for files matching the pattern 'linux-jdk13-m3.6.x_build/archetype-common/src/main/java/**/*,linux-jdk13-m3.6.x_build/maven-archetype-plugin/src/main/java/**/*' - excludes: null
[TASKS] Found 89 files to scan for tasks
[TASKS] Found 26 open tasks.
Skipping warnings blame since pipelines do not have an SCM link.%n
[withMaven] invokerPublisher - Archive invoker results for Maven artifact MavenArtifact{org.apache.maven.plugins:maven-archetype-plugin:maven-plugin:3.1.2-SNAPSHOT(version: 3.1.2-SNAPSHOT, snapshot:false) } generated by PluginInvocation{org.apache.maven.plugins:maven-invoker-plugin:3.1.0@run  integration-test}: linux-jdk13-m3.6.x_build/maven-archetype-plugin/target/invoker-reports/*.xml
[withMaven] Publishers: Generated Artifacts Publisher: 5622 ms, Junit Publisher: 8056 ms, Open Task Scanner Publisher: 3561 ms, Dependencies Fingerprint Publisher: 1537 ms, Invoker Publisher: 24627 ms, Pipeline Graph Publisher: 8 ms
[Pipeline] // withMaven
[Pipeline] cleanWs
[WS-CLEANUP] Deleting project workspace...
[WS-CLEANUP] Deferred wipeout is used...
[WS-CLEANUP] done
[Pipeline] }
[Pipeline] // stage
[Pipeline] }
[Pipeline] // ws
[Pipeline] }
[Pipeline] // node
[Pipeline] }
[withMaven] Publishers: Generated Artifacts Publisher: 5647 ms, Junit Publisher: 7952 ms, Open Task Scanner Publisher: 3928 ms, Dependencies Fingerprint Publisher: 1515 ms, Invoker Publisher: 26542 ms, Pipeline Graph Publisher: 4 ms
[Pipeline] // withMaven
[Pipeline] cleanWs
[WS-CLEANUP] Deleting project workspace...
[WS-CLEANUP] Deferred wipeout is used...
[WS-CLEANUP] done
[Pipeline] }
[Pipeline] // stage
[Pipeline] }
[Pipeline] // ws
[Pipeline] }
[Pipeline] // node
[Pipeline] }
[Pipeline] // parallel
[Pipeline] stage
[Pipeline] { (Notifications)
[Pipeline] echo
Build result: FAILURE
[Pipeline] jiraIssueSelector
[Pipeline] emailext
Reply | Threaded
Open this post in threaded view
|

Build failed in Jenkins: Maven TLP » maven-archetype » buildfix #2

Apache Jenkins Server-2
See https://builds.apache.org/job/maven-box/job/maven-archetype/job/buildfix/2/

Changes:

* more logs
* more logs
* more logs
* more logs

All tests passed

Build log:
[...truncated 235848 lines...]
[INFO] [DEBUG]   Included: org.codehaus.plexus:plexus-utils:jar:3.0.21
[INFO] [DEBUG]   Included: org.codehaus.plexus:plexus-interactivity-api:jar:1.0-alpha-6
[INFO] [DEBUG]   Included: org.sonatype.sisu:sisu-inject-bean:jar:1.4.2
[INFO] [DEBUG]   Included: org.sonatype.sisu:sisu-guice:jar:noaop:2.1.7
[INFO] [DEBUG]   Included: org.sonatype.aether:aether-util:jar:1.7
[INFO] [DEBUG]   Included: org.codehaus.plexus:plexus-interpolation:jar:1.14
[INFO] [DEBUG]   Included: org.sonatype.plexus:plexus-sec-dispatcher:jar:1.3
[INFO] [DEBUG]   Included: org.sonatype.plexus:plexus-cipher:jar:1.4
[INFO] [DEBUG]   Included: org.apache.maven.shared:maven-invoker:jar:3.0.1
[INFO] [DEBUG]   Included: org.apache.maven.shared:maven-shared-utils:jar:3.2.1
[INFO] [DEBUG]   Included: org.apache.maven.shared:maven-artifact-transfer:jar:0.9.0
[INFO] [DEBUG]   Included: org.apache.maven.shared:maven-common-artifact-filters:jar:3.0.0
[INFO] [DEBUG]   Included: commons-codec:commons-codec:jar:1.6
[INFO] [DEBUG]   Included: commons-collections:commons-collections:jar:3.2.1
[INFO] [DEBUG]   Included: org.apache.maven.shared:maven-script-interpreter:jar:1.0
[INFO] [DEBUG]   Included: org.beanshell:bsh:jar:2.0b4
[INFO] [DEBUG]   Included: org.apache.ant:ant:jar:1.8.1
[INFO] [DEBUG] Configuring mojo org.apache.maven.plugins:maven-archetype-plugin:3.1.2-SNAPSHOT:generate from plugin realm ClassRealm[plugin>org.apache.maven.plugins:maven-archetype-plugin:3.1.2-SNAPSHOT, parent: sun.misc.Launcher$AppClassLoader@5e875dee]
[INFO] [DEBUG] Setting property: classpath.resource.loader.class => 'org.codehaus.plexus.velocity.ContextClassLoaderResourceLoader'.
[INFO] [DEBUG] Setting property: site.resource.loader.class => 'org.codehaus.plexus.velocity.SiteResourceLoader'.
[INFO] [DEBUG] Setting property: velocimacro.messages.on => 'false'.
[INFO] [DEBUG] Setting property: resource.loader => 'classpath,site'.
[INFO] [DEBUG] Setting property: runtime.log.invalid.references => 'false'.
[INFO] [DEBUG] Setting property: resource.manager.logwhenfound => 'false'.
[INFO] [DEBUG] Initializing Velocity, Calling init()...
[INFO] [DEBUG] *******************************************************************
[INFO] [DEBUG] Starting Apache Velocity v1.7 (compiled: 2010-11-19 12:14:37)
[INFO] [DEBUG] RuntimeInstance initializing.
[INFO] [DEBUG] Default Properties File: org/apache/velocity/runtime/defaults/velocity.properties
[INFO] [DEBUG] LogSystem has been deprecated. Please use a LogChute implementation.
[INFO] [DEBUG] Default ResourceManager initializing. (class org.apache.velocity.runtime.resource.ResourceManagerImpl)
[INFO] [DEBUG] ResourceLoader instantiated: org.codehaus.plexus.velocity.ContextClassLoaderResourceLoader
[INFO] [DEBUG] ResourceLoader instantiated: org.codehaus.plexus.velocity.SiteResourceLoader
[INFO] [DEBUG] ResourceCache: initialized (class org.apache.velocity.runtime.resource.ResourceCacheImpl) with class java.util.Collections$SynchronizedMap cache map.
[INFO] [DEBUG] Default ResourceManager initialization complete.
[INFO] [DEBUG] Loaded System Directive: org.apache.velocity.runtime.directive.Stop
[INFO] [DEBUG] Loaded System Directive: org.apache.velocity.runtime.directive.Define
[INFO] [DEBUG] Loaded System Directive: org.apache.velocity.runtime.directive.Break
[INFO] [DEBUG] Loaded System Directive: org.apache.velocity.runtime.directive.Evaluate
[INFO] [DEBUG] Loaded System Directive: org.apache.velocity.runtime.directive.Literal
[INFO] [DEBUG] Loaded System Directive: org.apache.velocity.runtime.directive.Macro
[INFO] [DEBUG] Loaded System Directive: org.apache.velocity.runtime.directive.Parse
[INFO] [DEBUG] Loaded System Directive: org.apache.velocity.runtime.directive.Include
[INFO] [DEBUG] Loaded System Directive: org.apache.velocity.runtime.directive.Foreach
[INFO] [DEBUG] Created '20' parsers.
[INFO] [DEBUG] Velocimacro : initialization starting.
[INFO] [DEBUG] Velocimacro : allowInline = true : VMs can be defined inline in templates
[INFO] [DEBUG] Velocimacro : allowInlineToOverride = false : VMs defined inline may NOT replace previous VM definitions
[INFO] [DEBUG] Velocimacro : allowInlineLocal = false : VMs defined inline will be global in scope if allowed.
[INFO] [DEBUG] Velocimacro : autoload off : VM system will not automatically reload global library macros
[INFO] [DEBUG] Velocimacro : Velocimacro : initialization complete.
[INFO] [DEBUG] RuntimeInstance successfully initialized.
[INFO] [DEBUG] Configuring mojo 'org.apache.maven.plugins:maven-archetype-plugin:3.1.2-SNAPSHOT:generate' with basic configurator -->
[INFO] [DEBUG]   (f) archetypeArtifactId = maven-archetype-quickstart
[INFO] [DEBUG]   (f) archetypeCatalog = remote,local
[INFO] [DEBUG]   (f) archetypeGroupId = org.apache.maven.archetypes
[INFO] [DEBUG]   (f) archetypeVersion = 1.1
[INFO] [DEBUG]   (f) interactiveMode = false
[INFO] [DEBUG]   (f) localRepository =       id: local
[INFO]       url: file:///home/jenkins/jenkins-slave/workspace/ven-box_maven-archetype_buildfix@2/linux-jdk7-m3.5.x_build/maven-archetype-plugin/target/local-repo/
[INFO]    layout: default
[INFO] snapshots: [enabled => true, update => always]
[INFO]  releases: [enabled => true, update => always]
[INFO]
[INFO] [DEBUG]   (f) outputDirectory = /home/jenkins/jenkins-slave/workspace/ven-box_maven-archetype_buildfix@2/linux-jdk7-m3.5.x_build/maven-archetype-plugin/target/it/projects/generate-basic
[INFO] [DEBUG]   (f) remoteArtifactRepositories = [      id: mrm-maven-plugin
[INFO]       url: http://localhost:42964
[INFO]    layout: default
[INFO] snapshots: [enabled => true, update => always]
[INFO]  releases: [enabled => true, update => daily]
[INFO] ]
[INFO] [DEBUG]   (f) session = org.apache.maven.execution.MavenSession@255c8601
[INFO] [DEBUG] -- end configuration --
[INFO] [INFO] Generating project in Batch mode
[INFO] [DEBUG] Searching for remote catalog: http://localhost:42964/archetype-catalog.xml
[INFO] [DEBUG] Using catalog /home/jenkins/jenkins-slave/workspace/ven-box_maven-archetype_buildfix@2/linux-jdk7-m3.5.x_build/maven-archetype-plugin/target/local-repo/archetype-catalog.xml
[INFO] [WARNING] Archetype not found in any catalog. Falling back to central repository.
[INFO] [WARNING] Add a repository with id 'archetype' in your settings.xml if archetype's repository is elsewhere.
[INFO] [DEBUG] Not found archetype org.apache.maven.archetypes:maven-archetype-quickstart:1.1 in cache
[INFO] [DEBUG] Found archetype org.apache.maven.archetypes:maven-archetype-quickstart:1.1 in cache: /home/jenkins/jenkins-slave/workspace/ven-box_maven-archetype_buildfix@2/linux-jdk7-m3.5.x_build/maven-archetype-plugin/target/local-repo/org/apache/maven/archetypes/maven-archetype-quickstart/1.1/maven-archetype-quickstart-1.1.jar
[INFO] [DEBUG] checking fileset archetype status on /home/jenkins/jenkins-slave/workspace/ven-box_maven-archetype_buildfix@2/linux-jdk7-m3.5.x_build/maven-archetype-plugin/target/local-repo/org/apache/maven/archetypes/maven-archetype-quickstart/1.1/maven-archetype-quickstart-1.1.jar
[INFO] [DEBUG] Searching for META-INF/maven/archetype-metadata.xml inside /home/jenkins/jenkins-slave/workspace/ven-box_maven-archetype_buildfix@2/linux-jdk7-m3.5.x_build/maven-archetype-plugin/target/local-repo/org/apache/maven/archetypes/maven-archetype-quickstart/1.1/maven-archetype-quickstart-1.1.jar
[INFO] [DEBUG]   - META-INF/maven/archetype.xml
[INFO] [DEBUG]   - META-INF/DEPENDENCIES
[INFO] [DEBUG]   - META-INF/LICENSE
[INFO] [DEBUG]   - META-INF/NOTICE
[INFO] [DEBUG]   - archetype-resources/pom.xml
[INFO] [DEBUG]   - archetype-resources/src/test/java/AppTest.java
[INFO] [DEBUG]   - archetype-resources/src/main/java/App.java
[INFO] [DEBUG] Found archetype org.apache.maven.archetypes:maven-archetype-quickstart:1.1 in cache: /home/jenkins/jenkins-slave/workspace/ven-box_maven-archetype_buildfix@2/linux-jdk7-m3.5.x_build/maven-archetype-plugin/target/local-repo/org/apache/maven/archetypes/maven-archetype-quickstart/1.1/maven-archetype-quickstart-1.1.jar
[INFO] [DEBUG] checking old archetype status on /home/jenkins/jenkins-slave/workspace/ven-box_maven-archetype_buildfix@2/linux-jdk7-m3.5.x_build/maven-archetype-plugin/target/local-repo/org/apache/maven/archetypes/maven-archetype-quickstart/1.1/maven-archetype-quickstart-1.1.jar
[INFO] [DEBUG] Searching for META-INF/maven/archetype.xml inside /home/jenkins/jenkins-slave/workspace/ven-box_maven-archetype_buildfix@2/linux-jdk7-m3.5.x_build/maven-archetype-plugin/target/local-repo/org/apache/maven/archetypes/maven-archetype-quickstart/1.1/maven-archetype-quickstart-1.1.jar
[INFO] [DEBUG]   - META-INF/maven/archetype.xml
[INFO] [DEBUG] Entry found
[INFO] [DEBUG] Found archetype org.apache.maven.archetypes:maven-archetype-quickstart:1.1 in cache: /home/jenkins/jenkins-slave/workspace/ven-box_maven-archetype_buildfix@2/linux-jdk7-m3.5.x_build/maven-archetype-plugin/target/local-repo/org/apache/maven/archetypes/maven-archetype-quickstart/1.1/maven-archetype-quickstart-1.1.jar
[INFO] [DEBUG] Searching for META-INF/maven/archetype.xml inside /home/jenkins/jenkins-slave/workspace/ven-box_maven-archetype_buildfix@2/linux-jdk7-m3.5.x_build/maven-archetype-plugin/target/local-repo/org/apache/maven/archetypes/maven-archetype-quickstart/1.1/maven-archetype-quickstart-1.1.jar
[INFO] [DEBUG]   - META-INF/maven/archetype.xml
[INFO] [DEBUG] Entry found
[INFO] [DEBUG] Creating ArchetypeConfiguration from legacy descriptor and Properties
[INFO] [DEBUG] Adding requiredProperty groupId
[INFO] [DEBUG] Setting property groupId=com.company
[INFO] [DEBUG] Adding requiredProperty artifactId
[INFO] [DEBUG] Setting property artifactId=project
[INFO] [DEBUG] Adding requiredProperty version
[INFO] [DEBUG] Setting property version=1.0-SNAPSHOT
[INFO] [DEBUG] Adding requiredProperty package
[INFO] [DEBUG] Setting property package=com.company.project
[INFO] [DEBUG] Found archetype org.apache.maven.archetypes:maven-archetype-quickstart:1.1 in cache: /home/jenkins/jenkins-slave/workspace/ven-box_maven-archetype_buildfix@2/linux-jdk7-m3.5.x_build/maven-archetype-plugin/target/local-repo/org/apache/maven/archetypes/maven-archetype-quickstart/1.1/maven-archetype-quickstart-1.1.jar
[INFO] [DEBUG] Found archetype org.apache.maven.archetypes:maven-archetype-quickstart:1.1 in cache: /home/jenkins/jenkins-slave/workspace/ven-box_maven-archetype_buildfix@2/linux-jdk7-m3.5.x_build/maven-archetype-plugin/target/local-repo/org/apache/maven/archetypes/maven-archetype-quickstart/1.1/maven-archetype-quickstart-1.1.jar
[INFO] [DEBUG] checking fileset archetype status on /home/jenkins/jenkins-slave/workspace/ven-box_maven-archetype_buildfix@2/linux-jdk7-m3.5.x_build/maven-archetype-plugin/target/local-repo/org/apache/maven/archetypes/maven-archetype-quickstart/1.1/maven-archetype-quickstart-1.1.jar
[INFO] [DEBUG] Searching for META-INF/maven/archetype-metadata.xml inside /home/jenkins/jenkins-slave/workspace/ven-box_maven-archetype_buildfix@2/linux-jdk7-m3.5.x_build/maven-archetype-plugin/target/local-repo/org/apache/maven/archetypes/maven-archetype-quickstart/1.1/maven-archetype-quickstart-1.1.jar
[INFO] [DEBUG]   - META-INF/maven/archetype.xml
[INFO] [DEBUG]   - META-INF/DEPENDENCIES
[INFO] [DEBUG]   - META-INF/LICENSE
[INFO] [DEBUG]   - META-INF/NOTICE
[INFO] [DEBUG]   - archetype-resources/pom.xml
[INFO] [DEBUG]   - archetype-resources/src/test/java/AppTest.java
[INFO] [DEBUG]   - archetype-resources/src/main/java/App.java
[INFO] [DEBUG] checking old archetype status on /home/jenkins/jenkins-slave/workspace/ven-box_maven-archetype_buildfix@2/linux-jdk7-m3.5.x_build/maven-archetype-plugin/target/local-repo/org/apache/maven/archetypes/maven-archetype-quickstart/1.1/maven-archetype-quickstart-1.1.jar
[INFO] [DEBUG] Searching for META-INF/maven/archetype.xml inside /home/jenkins/jenkins-slave/workspace/ven-box_maven-archetype_buildfix@2/linux-jdk7-m3.5.x_build/maven-archetype-plugin/target/local-repo/org/apache/maven/archetypes/maven-archetype-quickstart/1.1/maven-archetype-quickstart-1.1.jar
[INFO] [DEBUG]   - META-INF/maven/archetype.xml
[INFO] [DEBUG] Entry found
[INFO] [INFO] ----------------------------------------------------------------------------
[INFO] [INFO] Using following parameters for creating project from Old (1.x) Archetype: maven-archetype-quickstart:1.1
[INFO] [INFO] ----------------------------------------------------------------------------
[INFO] [INFO] Parameter: groupId, Value: com.company
[INFO] [INFO] Parameter: packageName, Value: com.company.project
[INFO] [INFO] Parameter: package, Value: com.company.project
[INFO] [INFO] Parameter: artifactId, Value: project
[INFO] [INFO] Parameter: basedir, Value: /home/jenkins/jenkins-slave/workspace/ven-box_maven-archetype_buildfix@2/linux-jdk7-m3.5.x_build/maven-archetype-plugin/target/it/projects/generate-basic
[INFO] [INFO] Parameter: version, Value: 1.0-SNAPSHOT
[INFO] [DEBUG] ********************* Debug info for resources created from generated Model ***********************
[INFO] [DEBUG] Was build element found in generated POM?: false
[INFO] [DEBUG] ********************* End of debug info from resources from generated POM ***********************
[INFO] [INFO] project created from Old (1.x) Archetype in dir: /home/jenkins/jenkins-slave/workspace/ven-box_maven-archetype_buildfix@2/linux-jdk7-m3.5.x_build/maven-archetype-plugin/target/it/projects/generate-basic/project
[INFO] [INFO] ------------------------------------------------------------------------
[INFO] [INFO] BUILD SUCCESS
[INFO] [INFO] ------------------------------------------------------------------------
[INFO] [INFO] Total time: 2.465 s
[INFO] [INFO] Finished at: 2019-07-27T16:00:25Z
[INFO] [INFO] ------------------------------------------------------------------------
[TASKS] Scanning folder '/home/jenkins/jenkins-slave/workspace/ven-box_maven-archetype_buildfix@2' for files matching the pattern 'linux-jdk7-m3.2.x_build/archetype-common/src/main/java/**/*,linux-jdk7-m3.2.x_build/maven-archetype-plugin/src/main/java/**/*' - excludes: null
[TASKS] Found 89 files to scan for tasks
[TASKS] Found 26 open tasks.
Skipping warnings blame since pipelines do not have an SCM link.%n
[INFO] run post-build script verify.bsh
[INFO] Running post-build script: /home/jenkins/jenkins-slave/workspace/ven-box_maven-archetype_buildfix@2/linux-jdk7-m3.5.x_build/maven-archetype-plugin/target/it/projects/generate-basic/verify.bsh
[INFO] Finished post-build script: /home/jenkins/jenkins-slave/workspace/ven-box_maven-archetype_buildfix@2/linux-jdk7-m3.5.x_build/maven-archetype-plugin/target/it/projects/generate-basic/verify.bsh
[INFO]           generate-basic ................................... SUCCESS (5.0 s)
[INFO] -------------------------------------------------
[INFO] Build Summary:
[INFO]   Passed: 25, Failed: 0, Errors: 0, Skipped: 0
[INFO] -------------------------------------------------
[INFO]
[INFO] --- mrm-maven-plugin:1.1.0:stop (mirror) @ maven-archetype-plugin ---
[INFO] Stopping Mock Repository Manager on http://localhost:42964
[INFO] Stopped SocketConnector@0.0.0.0:42964
[INFO] Mock Repository Manager http://localhost:42964 is stopped.
[INFO]
[INFO] --- mrm-maven-plugin:1.1.0:stop (archetype-repository) @ maven-archetype-plugin ---
[INFO] Stopping Mock Repository Manager on http://localhost:46700
[INFO] Stopped SocketConnector@0.0.0.0:46700
[INFO] Mock Repository Manager http://localhost:46700 is stopped.
[INFO]
[INFO] --- maven-checkstyle-plugin:3.0.0:check (checkstyle-check) @ maven-archetype-plugin ---
[INFO] There are 46 errors reported by Checkstyle 6.18 with config/maven_checks.xml ruleset.
[INFO] Ignored 46 errors, 0 violation remaining.
[INFO] ------------------------------------------------------------------------
[INFO] Reactor Summary:
[INFO]
[INFO] Maven Archetype 3.1.2-SNAPSHOT ..................... SUCCESS [  6.180 s]
[INFO] Maven Archetype Models ............................. SUCCESS [  0.759 s]
[INFO] Maven Archetype Catalog Model ...................... SUCCESS [  3.100 s]
[INFO] Maven Archetype Descriptor Model ................... SUCCESS [  1.265 s]
[INFO] Maven Archetype Common ............................. SUCCESS [ 21.417 s]
[INFO] Maven Archetype Packaging .......................... SUCCESS [  0.690 s]
[INFO] Maven Archetype Plugin 3.1.2-SNAPSHOT .............. SUCCESS [05:39 min]
[INFO] ------------------------------------------------------------------------
[INFO] BUILD SUCCESS
[INFO] ------------------------------------------------------------------------
[INFO] Total time: 06:13 min
[INFO] Finished at: 2019-07-27T16:00:26Z
[INFO] ------------------------------------------------------------------------
[INFO] [jenkins-event-spy] Generated /home/jenkins/jenkins-slave/workspace/ven-box_maven-archetype_buildfix@2@tmp/withMaven06a5734c/maven-spy-20190727-155412-2769067718845619964153.log
[Pipeline] }
[Pipeline] // dir
[Pipeline] }
[withMaven] artifactsPublisher - Archive artifact linux-jdk7-m3.5.x_build/pom.xml under org/apache/maven/archetype/maven-archetype/3.1.2-SNAPSHOT/maven-archetype-3.1.2-SNAPSHOT.pom
[withMaven] artifactsPublisher - Archive artifact linux-jdk7-m3.5.x_build/target/maven-archetype-3.1.2-SNAPSHOT-site.xml under org/apache/maven/archetype/maven-archetype/3.1.2-SNAPSHOT/maven-archetype-3.1.2-SNAPSHOT-site.xml
[withMaven] artifactsPublisher - Archive artifact linux-jdk7-m3.5.x_build/archetype-models/pom.xml under org/apache/maven/archetype/archetype-models/3.1.2-SNAPSHOT/archetype-models-3.1.2-SNAPSHOT.pom
[withMaven] invokerPublisher - Archive invoker results for Maven artifact MavenArtifact{org.apache.maven.plugins:maven-archetype-plugin:maven-plugin:3.1.2-SNAPSHOT(version: 3.1.2-SNAPSHOT, snapshot:false) } generated by PluginInvocation{org.apache.maven.plugins:maven-invoker-plugin:3.1.0@run  integration-test}: linux-jdk7-m3.2.x_build/maven-archetype-plugin/target/invoker-reports/*.xml
[withMaven] artifactsPublisher - Archive artifact linux-jdk7-m3.5.x_build/archetype-models/target/archetype-models-3.1.2-SNAPSHOT-site.xml under org/apache/maven/archetype/archetype-models/3.1.2-SNAPSHOT/archetype-models-3.1.2-SNAPSHOT-site.xml
[withMaven] artifactsPublisher - Archive artifact linux-jdk7-m3.5.x_build/archetype-models/archetype-catalog/pom.xml under org/apache/maven/archetype/archetype-catalog/3.1.2-SNAPSHOT/archetype-catalog-3.1.2-SNAPSHOT.pom
[withMaven] artifactsPublisher - Archive artifact linux-jdk7-m3.5.x_build/archetype-models/archetype-catalog/target/archetype-catalog-3.1.2-SNAPSHOT.jar under org/apache/maven/archetype/archetype-catalog/3.1.2-SNAPSHOT/archetype-catalog-3.1.2-SNAPSHOT.jar
[withMaven] artifactsPublisher - Archive artifact linux-jdk7-m3.5.x_build/archetype-models/archetype-descriptor/pom.xml under org/apache/maven/archetype/archetype-descriptor/3.1.2-SNAPSHOT/archetype-descriptor-3.1.2-SNAPSHOT.pom
[withMaven] artifactsPublisher - Archive artifact linux-jdk7-m3.5.x_build/archetype-models/archetype-descriptor/target/archetype-descriptor-3.1.2-SNAPSHOT.jar under org/apache/maven/archetype/archetype-descriptor/3.1.2-SNAPSHOT/archetype-descriptor-3.1.2-SNAPSHOT.jar
[withMaven] artifactsPublisher - Archive artifact linux-jdk7-m3.5.x_build/archetype-common/pom.xml under org/apache/maven/archetype/archetype-common/3.1.2-SNAPSHOT/archetype-common-3.1.2-SNAPSHOT.pom
[withMaven] artifactsPublisher - Archive artifact linux-jdk7-m3.5.x_build/archetype-common/target/archetype-common-3.1.2-SNAPSHOT.jar under org/apache/maven/archetype/archetype-common/3.1.2-SNAPSHOT/archetype-common-3.1.2-SNAPSHOT.jar
[withMaven] artifactsPublisher - Archive artifact linux-jdk7-m3.5.x_build/archetype-packaging/pom.xml under org/apache/maven/archetype/archetype-packaging/3.1.2-SNAPSHOT/archetype-packaging-3.1.2-SNAPSHOT.pom
[withMaven] artifactsPublisher - Archive artifact linux-jdk7-m3.5.x_build/archetype-packaging/target/archetype-packaging-3.1.2-SNAPSHOT.jar under org/apache/maven/archetype/archetype-packaging/3.1.2-SNAPSHOT/archetype-packaging-3.1.2-SNAPSHOT.jar
[withMaven] artifactsPublisher - Archive artifact linux-jdk7-m3.5.x_build/maven-archetype-plugin/pom.xml under org/apache/maven/plugins/maven-archetype-plugin/3.1.2-SNAPSHOT/maven-archetype-plugin-3.1.2-SNAPSHOT.pom
[withMaven] artifactsPublisher - Archive artifact linux-jdk7-m3.5.x_build/maven-archetype-plugin/target/maven-archetype-plugin-3.1.2-SNAPSHOT.jar under org/apache/maven/plugins/maven-archetype-plugin/3.1.2-SNAPSHOT/maven-archetype-plugin-3.1.2-SNAPSHOT.jar
[Fast Archiver] No prior successful build to compare, so performing full copy of artifacts
[withMaven] junitPublisher - Archive test results for Maven artifact org.apache.maven.archetype:archetype-catalog:jar:3.1.2-SNAPSHOT generated by maven-surefire-plugin:test (default-test): linux-jdk7-m3.5.x_build/archetype-models/archetype-catalog/target/surefire-reports/*.xml
[withMaven] junitPublisher - Archive test results for Maven artifact org.apache.maven.archetype:archetype-descriptor:jar:3.1.2-SNAPSHOT generated by maven-surefire-plugin:test (default-test): linux-jdk7-m3.5.x_build/archetype-models/archetype-descriptor/target/surefire-reports/*.xml
[withMaven] junitPublisher - Archive test results for Maven artifact org.apache.maven.archetype:archetype-common:jar:3.1.2-SNAPSHOT generated by maven-surefire-plugin:test (default-test): linux-jdk7-m3.5.x_build/archetype-common/target/surefire-reports/*.xml
[withMaven] junitPublisher - Archive test results for Maven artifact org.apache.maven.archetype:archetype-packaging:jar:3.1.2-SNAPSHOT generated by maven-surefire-plugin:test (default-test): linux-jdk7-m3.5.x_build/archetype-packaging/target/surefire-reports/*.xml
[withMaven] junitPublisher - Archive test results for Maven artifact org.apache.maven.plugins:maven-archetype-plugin:maven-plugin:3.1.2-SNAPSHOT generated by maven-surefire-plugin:test (default-test): linux-jdk7-m3.5.x_build/maven-archetype-plugin/target/surefire-reports/*.xml
Recording test results
[withMaven] openTasksPublisher - Scan Tasks for Maven artifact org.apache.maven.archetype:archetype-common:jar:3.1.2-SNAPSHOT in source directory linux-jdk7-m3.5.x_build/archetype-common/src/main/java
[withMaven] openTasksPublisher - Scan Tasks for Maven artifact org.apache.maven.plugins:maven-archetype-plugin:maven-plugin:3.1.2-SNAPSHOT in source directory linux-jdk7-m3.5.x_build/maven-archetype-plugin/src/main/java
[TASKS] Scanning folder '/home/jenkins/jenkins-slave/workspace/ven-box_maven-archetype_buildfix@2' for files matching the pattern 'linux-jdk7-m3.5.x_build/archetype-common/src/main/java/**/*,linux-jdk7-m3.5.x_build/maven-archetype-plugin/src/main/java/**/*' - excludes: null
[TASKS] Found 89 files to scan for tasks
[TASKS] Found 26 open tasks.
Skipping warnings blame since pipelines do not have an SCM link.%n
[withMaven] invokerPublisher - Archive invoker results for Maven artifact MavenArtifact{org.apache.maven.plugins:maven-archetype-plugin:maven-plugin:3.1.2-SNAPSHOT(version: 3.1.2-SNAPSHOT, snapshot:false) } generated by PluginInvocation{org.apache.maven.plugins:maven-invoker-plugin:3.1.0@run  integration-test}: linux-jdk7-m3.5.x_build/maven-archetype-plugin/target/invoker-reports/*.xml
[withMaven] Publishers: Generated Artifacts Publisher: 5623 ms, Junit Publisher: 8084 ms, Open Task Scanner Publisher: 3567 ms, Dependencies Fingerprint Publisher: 1556 ms, Invoker Publisher: 25202 ms, Pipeline Graph Publisher: 6 ms
[Pipeline] // withMaven
[Pipeline] cleanWs
[WS-CLEANUP] Deleting project workspace...
[WS-CLEANUP] Deferred wipeout is used...
[WS-CLEANUP] done
[Pipeline] }
[Pipeline] // stage
[Pipeline] }
[Pipeline] // ws
[Pipeline] }
[Pipeline] // node
[Pipeline] }
[withMaven] Publishers: Generated Artifacts Publisher: 5589 ms, Junit Publisher: 8062 ms, Open Task Scanner Publisher: 3504 ms, Dependencies Fingerprint Publisher: 1515 ms, Invoker Publisher: 25018 ms, Pipeline Graph Publisher: 3 ms
[Pipeline] // withMaven
[Pipeline] cleanWs
[WS-CLEANUP] Deleting project workspace...
[WS-CLEANUP] Deferred wipeout is used...
[WS-CLEANUP] done
[Pipeline] }
[Pipeline] // stage
[Pipeline] }
[Pipeline] // ws
[Pipeline] }
[Pipeline] // node
[Pipeline] }
[Pipeline] // parallel
[Pipeline] stage
[Pipeline] { (Notifications)
[Pipeline] echo
Build result: FAILURE
[Pipeline] jiraIssueSelector
[Pipeline] emailext
Reply | Threaded
Open this post in threaded view
|

Build failed in Jenkins: Maven TLP » maven-archetype » buildfix #3

Apache Jenkins Server-2
See https://builds.apache.org/job/maven-box/job/maven-archetype/job/buildfix/3/

Changes:

* added archives
* archived ITs
* archived ITs
* archived ITs
* archived ITs
* archived ITs
* archived ITs
* archived ITs

All tests passed

Build log:
[...truncated 235828 lines...]
[INFO] [DEBUG] Processing fileset project pom F:\short\jenkins-maven-box-maven-archetype-buildfix-3@2\j7m3.6.xb\maven-archetype-plugin\target\it\projects\roundtrip-multi\out\myapp\myapp-stores\pom.xml
[INFO] [DEBUG] Processing fileset project moduleOffset __rootArtifactId__-stores
[INFO] [DEBUG] Processing fileset project outputDirectoryFile F:\short\jenkins-maven-box-maven-archetype-buildfix-3@2\j7m3.6.xb\maven-archetype-plugin\target\it\projects\roundtrip-multi\out\myapp\myapp-stores
[INFO] [DEBUG] Processing fileset project basedirPom F:\short\jenkins-maven-box-maven-archetype-buildfix-3@2\j7m3.6.xb\maven-archetype-plugin\target\it\projects\roundtrip-multi\out\myapp\pom.xml
[INFO] [DEBUG] Processing pom F:\short\jenkins-maven-box-maven-archetype-buildfix-3@2\j7m3.6.xb\maven-archetype-plugin\target\it\projects\roundtrip-multi\out\myapp\myapp-stores\pom.xml with parent F:\short\jenkins-maven-box-maven-archetype-buildfix-3@2\j7m3.6.xb\maven-archetype-plugin\target\it\projects\roundtrip-multi\out\myapp\pom.xml
[INFO] [DEBUG] Processing template archetype-resources/__rootArtifactId__-stores/pom.xml
[INFO] [DEBUG] Merging into F:\short\jenkins-maven-box-maven-archetype-buildfix-3@2\j7m3.6.xb\maven-archetype-plugin\target\it\projects\roundtrip-multi\out\myapp\myapp-stores\pom.xml
[INFO] [DEBUG] Adding module myapp-stores
[INFO] [INFO] Parent element not overwritten in F:\short\jenkins-maven-box-maven-archetype-buildfix-3@2\j7m3.6.xb\maven-archetype-plugin\target\it\projects\roundtrip-multi\out\myapp\myapp-stores\pom.xml
[INFO] [DEBUG] Processed 0 filesets
[INFO] [DEBUG] myapp-stores has modules ([org.apache.maven.archetype.metadata.ModuleDescriptor@6eaf100d, org.apache.maven.archetype.metadata.ModuleDescriptor@2746fe40])
[INFO] [DEBUG] Final interpolated file path: 'myapp-store-memory'
[INFO] [DEBUG] Final interpolated file path: 'myapp-store-memory'
[INFO] [DEBUG] Processing module myapp-store-memory
[INFO] [DEBUG] Processing module rootArtifactId myapp
[INFO] [DEBUG] Processing module pom F:\short\jenkins-maven-box-maven-archetype-buildfix-3@2\j7m3.6.xb\maven-archetype-plugin\target\it\projects\roundtrip-multi\out\myapp\myapp-stores\myapp-store-memory\pom.xml
[INFO] [DEBUG] Processing module moduleOffset __rootArtifactId__-stores/__rootArtifactId__-store-memory
[INFO] [DEBUG] Processing module outputDirectoryFile F:\short\jenkins-maven-box-maven-archetype-buildfix-3@2\j7m3.6.xb\maven-archetype-plugin\target\it\projects\roundtrip-multi\out\myapp\myapp-stores\myapp-store-memory
[INFO] [DEBUG] Processing fileset project moduleId myapp-store-memory
[INFO] [DEBUG] Processing fileset project pom F:\short\jenkins-maven-box-maven-archetype-buildfix-3@2\j7m3.6.xb\maven-archetype-plugin\target\it\projects\roundtrip-multi\out\myapp\myapp-stores\myapp-store-memory\pom.xml
[INFO] [DEBUG] Processing fileset project moduleOffset __rootArtifactId__-stores/__rootArtifactId__-store-memory
[INFO] [DEBUG] Processing fileset project outputDirectoryFile F:\short\jenkins-maven-box-maven-archetype-buildfix-3@2\j7m3.6.xb\maven-archetype-plugin\target\it\projects\roundtrip-multi\out\myapp\myapp-stores\myapp-store-memory
[INFO] [DEBUG] Processing fileset project basedirPom F:\short\jenkins-maven-box-maven-archetype-buildfix-3@2\j7m3.6.xb\maven-archetype-plugin\target\it\projects\roundtrip-multi\out\myapp\myapp-stores\pom.xml
[INFO] [DEBUG] Processing pom F:\short\jenkins-maven-box-maven-archetype-buildfix-3@2\j7m3.6.xb\maven-archetype-plugin\target\it\projects\roundtrip-multi\out\myapp\myapp-stores\myapp-store-memory\pom.xml with parent F:\short\jenkins-maven-box-maven-archetype-buildfix-3@2\j7m3.6.xb\maven-archetype-plugin\target\it\projects\roundtrip-multi\out\myapp\myapp-stores\pom.xml
[INFO] [DEBUG] Processing template archetype-resources/__rootArtifactId__-stores/__rootArtifactId__-store-memory/pom.xml
[INFO] [DEBUG] Merging into F:\short\jenkins-maven-box-maven-archetype-buildfix-3@2\j7m3.6.xb\maven-archetype-plugin\target\it\projects\roundtrip-multi\out\myapp\myapp-stores\myapp-store-memory\pom.xml
[INFO] [DEBUG] Adding module myapp-store-memory
[INFO] [INFO] Parent element not overwritten in F:\short\jenkins-maven-box-maven-archetype-buildfix-3@2\j7m3.6.xb\maven-archetype-plugin\target\it\projects\roundtrip-multi\out\myapp\myapp-stores\myapp-store-memory\pom.xml
[INFO] [DEBUG] Processing filesets
[INFO]   [.checkstyle, .classpath, pom.xml, src/site/site.xml, __rootArtifactId__-api/.checkstyle, __rootArtifactId__-api/.classpath, __rootArtifactId__-api/pom.xml, __rootArtifactId__-api/src/main/java/api/Api.java, __rootArtifactId__-cli/.checkstyle, __rootArtifactId__-cli/.classpath, __rootArtifactId__-cli/pom.xml, __rootArtifactId__-cli/src/main/java/cli/Cli.java, __rootArtifactId__-core/.checkstyle, __rootArtifactId__-core/.classpath, __rootArtifactId__-core/pom.xml, __rootArtifactId__-core/src/main/java/core/Core.java, __rootArtifactId__-model/.checkstyle, __rootArtifactId__-model/.classpath, __rootArtifactId__-model/pom.xml, __rootArtifactId__-model/src/main/java/org/company/__parentArtifactId__/model/Model.java, __rootArtifactId__-stores/pom.xml, __rootArtifactId__-stores/__rootArtifactId__-store-memory/.checkstyle, __rootArtifactId__-stores/__rootArtifactId__-store-memory/.classpath, __rootArtifactId__-stores/__rootArtifactId__-store-memory/pom.xml, __rootArtifactId__-stores/__rootArtifactId__-store-memory/src/main/java/store/memory/Memory.java, __rootArtifactId__-stores/__rootArtifactId__-store-xstream/.checkstyle, __rootArtifactId__-stores/__rootArtifactId__-store-xstream/.classpath, __rootArtifactId__-stores/__rootArtifactId__-store-xstream/pom.xml, __rootArtifactId__-stores/__rootArtifactId__-store-xstream/src/main/java/store/xstream/XStream.java]
[INFO] [DEBUG] Final interpolated file path: 'src/main/java/com/mycompany/myapp/'
[INFO] [DEBUG]     Processing fileset src/main/java (Filtered-Packaged) [**/*.java -- ] -> 1:
[INFO]       [__rootArtifactId__-stores/__rootArtifactId__-store-memory/src/main/java/store/memory/Memory.java]
[INFO] [DEBUG] Final interpolated file path: 'src/main/java/com/mycompany/myapp///store/memory/Memory.java'
[INFO] [DEBUG] Processing template archetype-resources/__rootArtifactId__-stores/__rootArtifactId__-store-memory/src/main/java/store/memory/Memory.java
[INFO] [DEBUG] Merging into F:\short\jenkins-maven-box-maven-archetype-buildfix-3@2\j7m3.6.xb\maven-archetype-plugin\target\it\projects\roundtrip-multi\out\myapp\myapp-stores\myapp-store-memory\src\main\java\com\mycompany\myapp\store\memory\Memory.java
[INFO] [DEBUG]     Processed 1 files.
[INFO] [DEBUG] Final interpolated file path: '//'
[INFO] [DEBUG]     Processing fileset  (Filtered-Flat) [.classpath -- ] -> 1:
[INFO]       [__rootArtifactId__-stores/__rootArtifactId__-store-memory/.classpath]
[INFO] [DEBUG] Final interpolated file path: '///.classpath'
[INFO] [DEBUG] Processing template archetype-resources/__rootArtifactId__-stores/__rootArtifactId__-store-memory/.classpath
[INFO] [DEBUG] Merging into F:\short\jenkins-maven-box-maven-archetype-buildfix-3@2\j7m3.6.xb\maven-archetype-plugin\target\it\projects\roundtrip-multi\out\myapp\myapp-stores\myapp-store-memory\.classpath
[INFO] [DEBUG]     Processed 1 files.
[INFO] [DEBUG] Final interpolated file path: '//'
[INFO] [DEBUG]     Copying fileset  (Copied-Flat) [.checkstyle -- ] -> 1:
[INFO]       [__rootArtifactId__-stores/__rootArtifactId__-store-memory/.checkstyle]
[INFO] [DEBUG] Final interpolated file path: '///.checkstyle'
[INFO] [DEBUG] Copying file __rootArtifactId__-stores/__rootArtifactId__-store-memory/.checkstyle
[INFO] [DEBUG]     Copied 1 files.
[INFO] [DEBUG] Processed 3 filesets
[INFO] [DEBUG] Processed myapp-store-memory
[INFO] [DEBUG] Final interpolated file path: 'myapp-store-xstream'
[INFO] [DEBUG] Final interpolated file path: 'myapp-store-xstream'
[INFO] [DEBUG] Processing module myapp-store-xstream
[INFO] [DEBUG] Processing module rootArtifactId myapp
[INFO] [DEBUG] Processing module pom F:\short\jenkins-maven-box-maven-archetype-buildfix-3@2\j7m3.6.xb\maven-archetype-plugin\target\it\projects\roundtrip-multi\out\myapp\myapp-stores\myapp-store-xstream\pom.xml
[INFO] [DEBUG] Processing module moduleOffset __rootArtifactId__-stores/__rootArtifactId__-store-xstream
[INFO] [DEBUG] Processing module outputDirectoryFile F:\short\jenkins-maven-box-maven-archetype-buildfix-3@2\j7m3.6.xb\maven-archetype-plugin\target\it\projects\roundtrip-multi\out\myapp\myapp-stores\myapp-store-xstream
[INFO] [DEBUG] Processing fileset project moduleId myapp-store-xstream
[INFO] [DEBUG] Processing fileset project pom F:\short\jenkins-maven-box-maven-archetype-buildfix-3@2\j7m3.6.xb\maven-archetype-plugin\target\it\projects\roundtrip-multi\out\myapp\myapp-stores\myapp-store-xstream\pom.xml
[INFO] [DEBUG] Processing fileset project moduleOffset __rootArtifactId__-stores/__rootArtifactId__-store-xstream
[INFO] [DEBUG] Processing fileset project outputDirectoryFile F:\short\jenkins-maven-box-maven-archetype-buildfix-3@2\j7m3.6.xb\maven-archetype-plugin\target\it\projects\roundtrip-multi\out\myapp\myapp-stores\myapp-store-xstream
[INFO] [DEBUG] Processing fileset project basedirPom F:\short\jenkins-maven-box-maven-archetype-buildfix-3@2\j7m3.6.xb\maven-archetype-plugin\target\it\projects\roundtrip-multi\out\myapp\myapp-stores\pom.xml
[INFO] [DEBUG] Processing pom F:\short\jenkins-maven-box-maven-archetype-buildfix-3@2\j7m3.6.xb\maven-archetype-plugin\target\it\projects\roundtrip-multi\out\myapp\myapp-stores\myapp-store-xstream\pom.xml with parent F:\short\jenkins-maven-box-maven-archetype-buildfix-3@2\j7m3.6.xb\maven-archetype-plugin\target\it\projects\roundtrip-multi\out\myapp\myapp-stores\pom.xml
[INFO] [DEBUG] Processing template archetype-resources/__rootArtifactId__-stores/__rootArtifactId__-store-xstream/pom.xml
[INFO] [DEBUG] Merging into F:\short\jenkins-maven-box-maven-archetype-buildfix-3@2\j7m3.6.xb\maven-archetype-plugin\target\it\projects\roundtrip-multi\out\myapp\myapp-stores\myapp-store-xstream\pom.xml
[INFO] [DEBUG] Adding module myapp-store-xstream
[INFO] [INFO] Parent element not overwritten in F:\short\jenkins-maven-box-maven-archetype-buildfix-3@2\j7m3.6.xb\maven-archetype-plugin\target\it\projects\roundtrip-multi\out\myapp\myapp-stores\myapp-store-xstream\pom.xml
[INFO] [DEBUG] Processing filesets
[INFO]   [.checkstyle, .classpath, pom.xml, src/site/site.xml, __rootArtifactId__-api/.checkstyle, __rootArtifactId__-api/.classpath, __rootArtifactId__-api/pom.xml, __rootArtifactId__-api/src/main/java/api/Api.java, __rootArtifactId__-cli/.checkstyle, __rootArtifactId__-cli/.classpath, __rootArtifactId__-cli/pom.xml, __rootArtifactId__-cli/src/main/java/cli/Cli.java, __rootArtifactId__-core/.checkstyle, __rootArtifactId__-core/.classpath, __rootArtifactId__-core/pom.xml, __rootArtifactId__-core/src/main/java/core/Core.java, __rootArtifactId__-model/.checkstyle, __rootArtifactId__-model/.classpath, __rootArtifactId__-model/pom.xml, __rootArtifactId__-model/src/main/java/org/company/__parentArtifactId__/model/Model.java, __rootArtifactId__-stores/pom.xml, __rootArtifactId__-stores/__rootArtifactId__-store-memory/.checkstyle, __rootArtifactId__-stores/__rootArtifactId__-store-memory/.classpath, __rootArtifactId__-stores/__rootArtifactId__-store-memory/pom.xml, __rootArtifactId__-stores/__rootArtifactId__-store-memory/src/main/java/store/memory/Memory.java, __rootArtifactId__-stores/__rootArtifactId__-store-xstream/.checkstyle, __rootArtifactId__-stores/__rootArtifactId__-store-xstream/.classpath, __rootArtifactId__-stores/__rootArtifactId__-store-xstream/pom.xml, __rootArtifactId__-stores/__rootArtifactId__-store-xstream/src/main/java/store/xstream/XStream.java]
[INFO] [DEBUG] Final interpolated file path: 'src/main/java/com/mycompany/myapp/'
[INFO] [DEBUG]     Processing fileset src/main/java (Filtered-Packaged) [**/*.java -- ] -> 1:
[INFO]       [__rootArtifactId__-stores/__rootArtifactId__-store-xstream/src/main/java/store/xstream/XStream.java]
[INFO] [DEBUG] Final interpolated file path: 'src/main/java/com/mycompany/myapp///store/xstream/XStream.java'
[INFO] [DEBUG] Processing template archetype-resources/__rootArtifactId__-stores/__rootArtifactId__-store-xstream/src/main/java/store/xstream/XStream.java
[INFO] [DEBUG] Merging into F:\short\jenkins-maven-box-maven-archetype-buildfix-3@2\j7m3.6.xb\maven-archetype-plugin\target\it\projects\roundtrip-multi\out\myapp\myapp-stores\myapp-store-xstream\src\main\java\com\mycompany\myapp\store\xstream\XStream.java
[INFO] [DEBUG]     Processed 1 files.
[INFO] [DEBUG] Final interpolated file path: '//'
[INFO] [DEBUG]     Processing fileset  (Filtered-Flat) [.classpath -- ] -> 1:
[INFO]       [__rootArtifactId__-stores/__rootArtifactId__-store-xstream/.classpath]
[INFO] [DEBUG] Final interpolated file path: '///.classpath'
[INFO] [DEBUG] Processing template archetype-resources/__rootArtifactId__-stores/__rootArtifactId__-store-xstream/.classpath
[INFO] [DEBUG] Merging into F:\short\jenkins-maven-box-maven-archetype-buildfix-3@2\j7m3.6.xb\maven-archetype-plugin\target\it\projects\roundtrip-multi\out\myapp\myapp-stores\myapp-store-xstream\.classpath
[INFO] [DEBUG]     Processed 1 files.
[INFO] [DEBUG] Final interpolated file path: '//'
[INFO] [DEBUG]     Copying fileset  (Copied-Flat) [.checkstyle -- ] -> 1:
[INFO]       [__rootArtifactId__-stores/__rootArtifactId__-store-xstream/.checkstyle]
[INFO] [DEBUG] Final interpolated file path: '///.checkstyle'
[INFO] [DEBUG] Copying file __rootArtifactId__-stores/__rootArtifactId__-store-xstream/.checkstyle
[INFO] [DEBUG]     Copied 1 files.
[INFO] [DEBUG] Processed 3 filesets
[INFO] [DEBUG] Processed myapp-store-xstream
[INFO] [DEBUG] Processed myapp-stores
[INFO] [DEBUG] Processed myapp
[INFO] [DEBUG] Searching for META-INF/archetype-post-generate.groovy inside F:\short\jenkins-maven-box-maven-archetype-buildfix-3@2\j7m3.6.xb\maven-archetype-plugin\target\local-repo\com\company\proficio\proficio-archetype\1.0-SNAPSHOT\proficio-archetype-1.0-SNAPSHOT.jar
[INFO] [DEBUG]   - archetype-resources/.checkstyle
[INFO] [DEBUG]   - archetype-resources/.classpath
[INFO] [DEBUG]   - archetype-resources/pom.xml
[INFO] [DEBUG]   - archetype-resources/src/site/site.xml
[INFO] [DEBUG]   - archetype-resources/__rootArtifactId__-api/.checkstyle
[INFO] [DEBUG]   - archetype-resources/__rootArtifactId__-api/.classpath
[INFO] [DEBUG]   - archetype-resources/__rootArtifactId__-api/pom.xml
[INFO] [DEBUG]   - archetype-resources/__rootArtifactId__-api/src/main/java/api/Api.java
[INFO] [DEBUG]   - archetype-resources/__rootArtifactId__-cli/.checkstyle
[INFO] [DEBUG]   - archetype-resources/__rootArtifactId__-cli/.classpath
[INFO] [DEBUG]   - archetype-resources/__rootArtifactId__-cli/pom.xml
[INFO] [DEBUG]   - archetype-resources/__rootArtifactId__-cli/src/main/java/cli/Cli.java
[INFO] [DEBUG]   - archetype-resources/__rootArtifactId__-core/.checkstyle
[INFO] [DEBUG]   - archetype-resources/__rootArtifactId__-core/.classpath
[INFO] [DEBUG]   - archetype-resources/__rootArtifactId__-core/pom.xml
[INFO] [DEBUG]   - archetype-resources/__rootArtifactId__-core/src/main/java/core/Core.java
[INFO] [DEBUG]   - archetype-resources/__rootArtifactId__-model/.checkstyle
[INFO] [DEBUG]   - archetype-resources/__rootArtifactId__-model/.classpath
[INFO] [DEBUG]   - archetype-resources/__rootArtifactId__-model/pom.xml
[INFO] [DEBUG]   - archetype-resources/__rootArtifactId__-model/src/main/java/org/company/__parentArtifactId__/model/Model.java
[INFO] [DEBUG]   - archetype-resources/__rootArtifactId__-stores/pom.xml
[INFO] [DEBUG]   - archetype-resources/__rootArtifactId__-stores/__rootArtifactId__-store-memory/.checkstyle
[INFO] [DEBUG]   - archetype-resources/__rootArtifactId__-stores/__rootArtifactId__-store-memory/.classpath
[INFO] [DEBUG]   - archetype-resources/__rootArtifactId__-stores/__rootArtifactId__-store-memory/pom.xml
[INFO] [DEBUG]   - archetype-resources/__rootArtifactId__-stores/__rootArtifactId__-store-memory/src/main/java/store/memory/Memory.java
[INFO] [DEBUG]   - archetype-resources/__rootArtifactId__-stores/__rootArtifactId__-store-xstream/.checkstyle
[INFO] [DEBUG]   - archetype-resources/__rootArtifactId__-stores/__rootArtifactId__-store-xstream/.classpath
[INFO] [DEBUG]   - archetype-resources/__rootArtifactId__-stores/__rootArtifactId__-store-xstream/pom.xml
[INFO] [DEBUG]   - archetype-resources/__rootArtifactId__-stores/__rootArtifactId__-store-xstream/src/main/java/store/xstream/XStream.java
[INFO] [DEBUG]   - META-INF/maven/archetype-metadata.xml
[INFO] [INFO] Project created from Archetype in dir: F:\short\jenkins-maven-box-maven-archetype-buildfix-3@2\j7m3.6.xb\maven-archetype-plugin\target\it\projects\roundtrip-multi\out\myapp
[INFO] [INFO] ------------------------------------------------------------------------
[INFO] [INFO] Reactor Summary for proficio 1.0-SNAPSHOT:
[INFO] [INFO]
[INFO] [INFO] proficio ........................................... SUCCESS [  2.005 s]
[INFO] [INFO] proficio model ..................................... SKIPPED
[INFO] [INFO] proficio api ....................................... SKIPPED
[INFO] [INFO] proficio core ...................................... SKIPPED
[INFO] [INFO] proficio stores .................................... SKIPPED
[INFO] [INFO] proficio store memory .............................. SKIPPED
[INFO] [INFO] proficio store xstream ............................. SKIPPED
[INFO] [INFO] proficio cli ....................................... SKIPPED
[INFO] [INFO] ------------------------------------------------------------------------
[INFO] [INFO] BUILD SUCCESS
[INFO] [INFO] ------------------------------------------------------------------------
[INFO] [INFO] Total time:  2.854 s
[INFO] [INFO] Finished at: 2019-07-27T16:36:47-07:00
[INFO] [INFO] ------------------------------------------------------------------------
[INFO] Picked up JAVA_TOOL_OPTIONS: -Dmaven.ext.class.path="F:\short\jenkins-maven-box-maven-archetype-buildfix-3@2@tmp\withMavend7082761\pipeline-maven-spy.jar" -Dorg.jenkinsci.plugins.pipeline.maven.reportsFolder="F:\short\jenkins-maven-box-maven-archetype-buildfix-3@2@tmp\withMavend7082761"
[INFO] run post-build script verify.groovy
[INFO] Running post-build script: F:\short\jenkins-maven-box-maven-archetype-buildfix-3@2\j7m3.6.xb\maven-archetype-plugin\target\it\projects\roundtrip-multi\verify.groovy
[INFO] Finished post-build script: F:\short\jenkins-maven-box-maven-archetype-buildfix-3@2\j7m3.6.xb\maven-archetype-plugin\target\it\projects\roundtrip-multi\verify.groovy
[INFO]           roundtrip-multi\pom.xml .......................... SUCCESS (21.1 s)
[INFO] -------------------------------------------------
[INFO] Build Summary:
[INFO]   Passed: 25, Failed: 0, Errors: 0, Skipped: 0
[INFO] -------------------------------------------------
[INFO]
[INFO] --- mrm-maven-plugin:1.1.0:stop (mirror) @ maven-archetype-plugin ---
[INFO] Stopping Mock Repository Manager on http://localhost:60848
[INFO] Stopped SocketConnector@0.0.0.0:60848
[INFO] Mock Repository Manager http://localhost:60848 is stopped.
[INFO]
[INFO] --- mrm-maven-plugin:1.1.0:stop (archetype-repository) @ maven-archetype-plugin ---
[INFO] Stopping Mock Repository Manager on http://localhost:60849
[INFO] Stopped SocketConnector@0.0.0.0:60849
[INFO] Mock Repository Manager http://localhost:60849 is stopped.
[INFO]
[INFO] --- maven-checkstyle-plugin:3.0.0:check (checkstyle-check) @ maven-archetype-plugin ---
[INFO] There are 46 errors reported by Checkstyle 6.18 with config/maven_checks.xml ruleset.
[INFO] Ignored 46 errors, 0 violation remaining.
[INFO] ------------------------------------------------------------------------
[INFO] Reactor Summary for Maven Archetype 3.1.2-SNAPSHOT:
[INFO]
[INFO] Maven Archetype .................................... SUCCESS [  4.989 s]
[INFO] Maven Archetype Models ............................. SUCCESS [  0.618 s]
[INFO] Maven Archetype Catalog Model ...................... SUCCESS [  2.916 s]
[INFO] Maven Archetype Descriptor Model ................... SUCCESS [  1.431 s]
[INFO] Maven Archetype Common ............................. SUCCESS [ 23.568 s]
[INFO] Maven Archetype Packaging .......................... SUCCESS [  0.464 s]
[INFO] Maven Archetype Plugin ............................. SUCCESS [05:43 min]
[INFO] ------------------------------------------------------------------------
[INFO] BUILD SUCCESS
[INFO] ------------------------------------------------------------------------
[INFO] Total time:  06:17 min
[INFO] Finished at: 2019-07-27T16:36:48-07:00
[INFO] ------------------------------------------------------------------------
[INFO] [jenkins-event-spy] Generated F:\short\jenkins-maven-box-maven-archetype-buildfix-3@2@tmp\withMavend7082761\maven-spy-20190727-163030-7177046643986895792065.log
Picked up JAVA_TOOL_OPTIONS: -Dmaven.ext.class.path="F:\short\jenkins-maven-box-maven-archetype-buildfix-3@2@tmp\withMavend7082761\pipeline-maven-spy.jar" -Dorg.jenkinsci.plugins.pipeline.maven.reportsFolder="F:\short\jenkins-maven-box-maven-archetype-buildfix-3@2@tmp\withMavend7082761"
[Pipeline] }
[Pipeline] // dir
[Pipeline] }
[withMaven] artifactsPublisher - Archive artifact j7m3.6.xb\pom.xml under org\apache\maven\archetype\maven-archetype\3.1.2-SNAPSHOT\maven-archetype-3.1.2-SNAPSHOT.pom
[withMaven] artifactsPublisher - Archive artifact j7m3.6.xb\target\maven-archetype-3.1.2-SNAPSHOT-site.xml under org\apache\maven\archetype\maven-archetype\3.1.2-SNAPSHOT\maven-archetype-3.1.2-SNAPSHOT-site.xml
[withMaven] artifactsPublisher - Archive artifact j7m3.6.xb\archetype-models\pom.xml under org\apache\maven\archetype\archetype-models\3.1.2-SNAPSHOT\archetype-models-3.1.2-SNAPSHOT.pom
[withMaven] artifactsPublisher - Archive artifact j7m3.6.xb\archetype-models\target\archetype-models-3.1.2-SNAPSHOT-site.xml under org\apache\maven\archetype\archetype-models\3.1.2-SNAPSHOT\archetype-models-3.1.2-SNAPSHOT-site.xml
[withMaven] artifactsPublisher - Archive artifact j7m3.6.xb\archetype-models\archetype-catalog\pom.xml under org\apache\maven\archetype\archetype-catalog\3.1.2-SNAPSHOT\archetype-catalog-3.1.2-SNAPSHOT.pom
[withMaven] artifactsPublisher - Archive artifact j7m3.6.xb\archetype-models\archetype-catalog\target\archetype-catalog-3.1.2-SNAPSHOT.jar under org\apache\maven\archetype\archetype-catalog\3.1.2-SNAPSHOT\archetype-catalog-3.1.2-SNAPSHOT.jar
[withMaven] artifactsPublisher - Archive artifact j7m3.6.xb\archetype-models\archetype-descriptor\pom.xml under org\apache\maven\archetype\archetype-descriptor\3.1.2-SNAPSHOT\archetype-descriptor-3.1.2-SNAPSHOT.pom
[withMaven] artifactsPublisher - Archive artifact j7m3.6.xb\archetype-models\archetype-descriptor\target\archetype-descriptor-3.1.2-SNAPSHOT.jar under org\apache\maven\archetype\archetype-descriptor\3.1.2-SNAPSHOT\archetype-descriptor-3.1.2-SNAPSHOT.jar
[withMaven] artifactsPublisher - Archive artifact j7m3.6.xb\archetype-common\pom.xml under org\apache\maven\archetype\archetype-common\3.1.2-SNAPSHOT\archetype-common-3.1.2-SNAPSHOT.pom
[withMaven] artifactsPublisher - Archive artifact j7m3.6.xb\archetype-common\target\archetype-common-3.1.2-SNAPSHOT.jar under org\apache\maven\archetype\archetype-common\3.1.2-SNAPSHOT\archetype-common-3.1.2-SNAPSHOT.jar
[withMaven] artifactsPublisher - Archive artifact j7m3.6.xb\archetype-packaging\pom.xml under org\apache\maven\archetype\archetype-packaging\3.1.2-SNAPSHOT\archetype-packaging-3.1.2-SNAPSHOT.pom
[withMaven] artifactsPublisher - Archive artifact j7m3.6.xb\archetype-packaging\target\archetype-packaging-3.1.2-SNAPSHOT.jar under org\apache\maven\archetype\archetype-packaging\3.1.2-SNAPSHOT\archetype-packaging-3.1.2-SNAPSHOT.jar
[withMaven] artifactsPublisher - Archive artifact j7m3.6.xb\maven-archetype-plugin\pom.xml under org\apache\maven\plugins\maven-archetype-plugin\3.1.2-SNAPSHOT\maven-archetype-plugin-3.1.2-SNAPSHOT.pom
[withMaven] artifactsPublisher - Archive artifact j7m3.6.xb\maven-archetype-plugin\target\maven-archetype-plugin-3.1.2-SNAPSHOT.jar under org\apache\maven\plugins\maven-archetype-plugin\3.1.2-SNAPSHOT\maven-archetype-plugin-3.1.2-SNAPSHOT.jar
[Fast Archiver] No prior successful build to compare, so performing full copy of artifacts
[withMaven] junitPublisher - Archive test results for Maven artifact org.apache.maven.archetype:archetype-catalog:jar:3.1.2-SNAPSHOT generated by maven-surefire-plugin:test (default-test): j7m3.6.xb\archetype-models\archetype-catalog\target\surefire-reports\*.xml
[withMaven] junitPublisher - Archive test results for Maven artifact org.apache.maven.archetype:archetype-descriptor:jar:3.1.2-SNAPSHOT generated by maven-surefire-plugin:test (default-test): j7m3.6.xb\archetype-models\archetype-descriptor\target\surefire-reports\*.xml
[withMaven] junitPublisher - Archive test results for Maven artifact org.apache.maven.archetype:archetype-common:jar:3.1.2-SNAPSHOT generated by maven-surefire-plugin:test (default-test): j7m3.6.xb\archetype-common\target\surefire-reports\*.xml
[withMaven] junitPublisher - Archive test results for Maven artifact org.apache.maven.archetype:archetype-packaging:jar:3.1.2-SNAPSHOT generated by maven-surefire-plugin:test (default-test): j7m3.6.xb\archetype-packaging\target\surefire-reports\*.xml
[withMaven] junitPublisher - Archive test results for Maven artifact org.apache.maven.plugins:maven-archetype-plugin:maven-plugin:3.1.2-SNAPSHOT generated by maven-surefire-plugin:test (default-test): j7m3.6.xb\maven-archetype-plugin\target\surefire-reports\*.xml
Recording test results
[withMaven] openTasksPublisher - Scan Tasks for Maven artifact org.apache.maven.archetype:archetype-common:jar:3.1.2-SNAPSHOT in source directory j7m3.6.xb\archetype-common\src\main\java
[withMaven] openTasksPublisher - Scan Tasks for Maven artifact org.apache.maven.plugins:maven-archetype-plugin:maven-plugin:3.1.2-SNAPSHOT in source directory j7m3.6.xb\maven-archetype-plugin\src\main\java
[TASKS] Scanning folder 'F:\short\jenkins-maven-box-maven-archetype-buildfix-3@2' for files matching the pattern 'j7m3.6.xb\archetype-common\src\main\java\**\*,j7m3.6.xb\maven-archetype-plugin\src\main\java\**\*' - excludes: null
[TASKS] Found 89 files to scan for tasks
[TASKS] Found 26 open tasks.
Skipping warnings blame since pipelines do not have an SCM link.%n
[withMaven] invokerPublisher - Archive invoker results for Maven artifact MavenArtifact{org.apache.maven.plugins:maven-archetype-plugin:maven-plugin:3.1.2-SNAPSHOT(version: 3.1.2-SNAPSHOT, snapshot:false) } generated by PluginInvocation{org.apache.maven.plugins:maven-invoker-plugin:3.1.0@run  integration-test}: j7m3.6.xb\maven-archetype-plugin\target\invoker-reports\*.xml
[withMaven] Publishers: Generated Artifacts Publisher: 312 ms, Junit Publisher: 329 ms, Open Task Scanner Publisher: 247 ms, Dependencies Fingerprint Publisher: 54 ms, Invoker Publisher: 17999 ms, Pipeline Graph Publisher: 4 ms
[Pipeline] // withMaven
[Pipeline] cleanWs
[WS-CLEANUP] Deleting project workspace...
[WS-CLEANUP] Deferred wipeout is used...
[WS-CLEANUP] done
[Pipeline] }
[Pipeline] // stage
[Pipeline] }
[Pipeline] // ws
[Pipeline] }
[Pipeline] // node
[Pipeline] }
[withMaven] Publishers: Generated Artifacts Publisher: 292 ms, Junit Publisher: 340 ms, Open Task Scanner Publisher: 278 ms, Dependencies Fingerprint Publisher: 54 ms, Invoker Publisher: 17690 ms, Pipeline Graph Publisher: 3 ms
[Pipeline] // withMaven
[Pipeline] cleanWs
[WS-CLEANUP] Deleting project workspace...
[WS-CLEANUP] Deferred wipeout is used...
[WS-CLEANUP] done
[Pipeline] }
[Pipeline] // stage
[Pipeline] }
[Pipeline] // ws
[Pipeline] }
[Pipeline] // node
[Pipeline] }
[Pipeline] // parallel
[Pipeline] stage
[Pipeline] { (Notifications)
[Pipeline] echo
Build result: FAILURE
[Pipeline] jiraIssueSelector
[Pipeline] emailext
Reply | Threaded
Open this post in threaded view
|

Build failed in Jenkins: Maven TLP » maven-archetype » buildfix #4

Apache Jenkins Server-2
See https://builds.apache.org/job/maven-box/job/maven-archetype/job/buildfix/4/

Changes:

* added archives fix
* removed streamLogs
* removed streamLogs
* removed streamLogs
* removed streamLogs
* removed streamLogs
* removed streamLogs
* removed streamLogs
* removed streamLogs

All tests passed

Build log:
[...truncated 10219 lines...]
[INFO] Maven Archetype Common ............................. SUCCESS [ 23.885 s]
[INFO] Maven Archetype Packaging .......................... SUCCESS [  0.430 s]
[INFO] Maven Archetype Plugin ............................. SUCCESS [05:18 min]
[INFO] ------------------------------------------------------------------------
[INFO] BUILD SUCCESS
[INFO] ------------------------------------------------------------------------
[INFO] Total time: 05:54 min
[INFO] Finished at: 2019-07-27T17:13:02-07:00
[INFO] Final Memory: 73M/1379M
[INFO] ------------------------------------------------------------------------
[INFO] [jenkins-event-spy] Generated F:\short\jenkins-maven-box-maven-archetype-buildfix-4@tmp\withMavene473b509\maven-spy-20190727-170707-7845316787994764924176.log
Picked up JAVA_TOOL_OPTIONS: -Dmaven.ext.class.path="F:\short\jenkins-maven-box-maven-archetype-buildfix-4@tmp\withMavene473b509\pipeline-maven-spy.jar" -Dorg.jenkinsci.plugins.pipeline.maven.reportsFolder="F:\short\jenkins-maven-box-maven-archetype-buildfix-4@tmp\withMavene473b509"
[Pipeline] }
[Pipeline] // dir
[Pipeline] }
[withMaven] artifactsPublisher - Archive artifact j7m3.3.xb\pom.xml under org\apache\maven\archetype\maven-archetype\3.1.2-SNAPSHOT\maven-archetype-3.1.2-SNAPSHOT.pom
[withMaven] artifactsPublisher - Archive artifact j7m3.3.xb\target\maven-archetype-3.1.2-SNAPSHOT-site.xml under org\apache\maven\archetype\maven-archetype\3.1.2-SNAPSHOT\maven-archetype-3.1.2-SNAPSHOT-site.xml
[withMaven] artifactsPublisher - Archive artifact j7m3.3.xb\archetype-models\pom.xml under org\apache\maven\archetype\archetype-models\3.1.2-SNAPSHOT\archetype-models-3.1.2-SNAPSHOT.pom
[withMaven] artifactsPublisher - Archive artifact j7m3.3.xb\archetype-models\target\archetype-models-3.1.2-SNAPSHOT-site.xml under org\apache\maven\archetype\archetype-models\3.1.2-SNAPSHOT\archetype-models-3.1.2-SNAPSHOT-site.xml
[withMaven] artifactsPublisher - Archive artifact j7m3.3.xb\archetype-models\archetype-catalog\pom.xml under org\apache\maven\archetype\archetype-catalog\3.1.2-SNAPSHOT\archetype-catalog-3.1.2-SNAPSHOT.pom
[withMaven] artifactsPublisher - Archive artifact j7m3.3.xb\archetype-models\archetype-catalog\target\archetype-catalog-3.1.2-SNAPSHOT.jar under org\apache\maven\archetype\archetype-catalog\3.1.2-SNAPSHOT\archetype-catalog-3.1.2-SNAPSHOT.jar
[withMaven] artifactsPublisher - Archive artifact j7m3.3.xb\archetype-models\archetype-descriptor\pom.xml under org\apache\maven\archetype\archetype-descriptor\3.1.2-SNAPSHOT\archetype-descriptor-3.1.2-SNAPSHOT.pom
[withMaven] artifactsPublisher - Archive artifact j7m3.3.xb\archetype-models\archetype-descriptor\target\archetype-descriptor-3.1.2-SNAPSHOT.jar under org\apache\maven\archetype\archetype-descriptor\3.1.2-SNAPSHOT\archetype-descriptor-3.1.2-SNAPSHOT.jar
[withMaven] artifactsPublisher - Archive artifact j7m3.3.xb\archetype-common\pom.xml under org\apache\maven\archetype\archetype-common\3.1.2-SNAPSHOT\archetype-common-3.1.2-SNAPSHOT.pom
[withMaven] artifactsPublisher - Archive artifact j7m3.3.xb\archetype-common\target\archetype-common-3.1.2-SNAPSHOT.jar under org\apache\maven\archetype\archetype-common\3.1.2-SNAPSHOT\archetype-common-3.1.2-SNAPSHOT.jar
[withMaven] artifactsPublisher - Archive artifact j7m3.3.xb\archetype-packaging\pom.xml under org\apache\maven\archetype\archetype-packaging\3.1.2-SNAPSHOT\archetype-packaging-3.1.2-SNAPSHOT.pom
[withMaven] artifactsPublisher - Archive artifact j7m3.3.xb\archetype-packaging\target\archetype-packaging-3.1.2-SNAPSHOT.jar under org\apache\maven\archetype\archetype-packaging\3.1.2-SNAPSHOT\archetype-packaging-3.1.2-SNAPSHOT.jar
[withMaven] artifactsPublisher - Archive artifact j7m3.3.xb\maven-archetype-plugin\pom.xml under org\apache\maven\plugins\maven-archetype-plugin\3.1.2-SNAPSHOT\maven-archetype-plugin-3.1.2-SNAPSHOT.pom
[withMaven] artifactsPublisher - Archive artifact j7m3.3.xb\maven-archetype-plugin\target\maven-archetype-plugin-3.1.2-SNAPSHOT.jar under org\apache\maven\plugins\maven-archetype-plugin\3.1.2-SNAPSHOT\maven-archetype-plugin-3.1.2-SNAPSHOT.jar
[Fast Archiver] No prior successful build to compare, so performing full copy of artifacts
[withMaven] junitPublisher - Archive test results for Maven artifact org.apache.maven.archetype:archetype-catalog:jar:3.1.2-SNAPSHOT generated by maven-surefire-plugin:test (default-test): j7m3.3.xb\archetype-models\archetype-catalog\target\surefire-reports\*.xml
[withMaven] junitPublisher - Archive test results for Maven artifact org.apache.maven.archetype:archetype-descriptor:jar:3.1.2-SNAPSHOT generated by maven-surefire-plugin:test (default-test): j7m3.3.xb\archetype-models\archetype-descriptor\target\surefire-reports\*.xml
[withMaven] junitPublisher - Archive test results for Maven artifact org.apache.maven.archetype:archetype-common:jar:3.1.2-SNAPSHOT generated by maven-surefire-plugin:test (default-test): j7m3.3.xb\archetype-common\target\surefire-reports\*.xml
[withMaven] junitPublisher - Archive test results for Maven artifact org.apache.maven.archetype:archetype-packaging:jar:3.1.2-SNAPSHOT generated by maven-surefire-plugin:test (default-test): j7m3.3.xb\archetype-packaging\target\surefire-reports\*.xml
[withMaven] junitPublisher - Archive test results for Maven artifact org.apache.maven.plugins:maven-archetype-plugin:maven-plugin:3.1.2-SNAPSHOT generated by maven-surefire-plugin:test (default-test): j7m3.3.xb\maven-archetype-plugin\target\surefire-reports\*.xml
Recording test results
[withMaven] openTasksPublisher - Scan Tasks for Maven artifact org.apache.maven.archetype:archetype-common:jar:3.1.2-SNAPSHOT in source directory j7m3.3.xb\archetype-common\src\main\java
[withMaven] openTasksPublisher - Scan Tasks for Maven artifact org.apache.maven.plugins:maven-archetype-plugin:maven-plugin:3.1.2-SNAPSHOT in source directory j7m3.3.xb\maven-archetype-plugin\src\main\java
[TASKS] Scanning folder 'F:\short\jenkins-maven-box-maven-archetype-buildfix-4' for files matching the pattern 'j7m3.3.xb\archetype-common\src\main\java\**\*,j7m3.3.xb\maven-archetype-plugin\src\main\java\**\*' - excludes: null
[TASKS] Found 89 files to scan for tasks
[TASKS] Found 26 open tasks.
Skipping warnings blame since pipelines do not have an SCM link.%n
[withMaven] invokerPublisher - Archive invoker results for Maven artifact MavenArtifact{org.apache.maven.plugins:maven-archetype-plugin:maven-plugin:3.1.2-SNAPSHOT(version: 3.1.2-SNAPSHOT, snapshot:false) } generated by PluginInvocation{org.apache.maven.plugins:maven-invoker-plugin:3.1.0@run  integration-test}: j7m3.3.xb\maven-archetype-plugin\target\invoker-reports\*.xml
[withMaven] Publishers: Generated Artifacts Publisher: 5571 ms, Junit Publisher: 8042 ms, Open Task Scanner Publisher: 3540 ms, Dependencies Fingerprint Publisher: 1541 ms, Invoker Publisher: 25150 ms, Pipeline Graph Publisher: 4 ms
[Pipeline] // withMaven
[Pipeline] cleanWs
[WS-CLEANUP] Deleting project workspace...
[WS-CLEANUP] Deferred wipeout is used...
[WS-CLEANUP] done
[Pipeline] }
[Pipeline] // stage
[Pipeline] }
[Pipeline] // ws
[Pipeline] }
[Pipeline] // node
[Pipeline] }
[INFO] run post-build script verify.groovy
[INFO]           included-system-properties/pom.xml ............... SUCCESS (10.8 s)
[INFO] Building: create-3/pom.xml
[INFO] run post-build script verify.groovy
[INFO]           create-3/pom.xml ................................. SUCCESS (11.0 s)
[INFO] Building: ARCHETYPE-517_failing-goals
[INFO] run pre-build script setup.groovy
[INFO] run post-build script verify.groovy
[INFO]           roundtrip-multi\pom.xml .......................... SUCCESS (19.9 s)
[INFO] -------------------------------------------------
[INFO] Build Summary:
[INFO]   Passed: 25, Failed: 0, Errors: 0, Skipped: 0
[INFO] -------------------------------------------------
[INFO]
[INFO] --- mrm-maven-plugin:1.1.0:stop (mirror) @ maven-archetype-plugin ---
[INFO] Stopping Mock Repository Manager on http://localhost:62324
[INFO] Stopped SocketConnector@0.0.0.0:62324
[INFO] Mock Repository Manager http://localhost:62324 is stopped.
[INFO]
[INFO] --- mrm-maven-plugin:1.1.0:stop (archetype-repository) @ maven-archetype-plugin ---
[INFO] Stopping Mock Repository Manager on http://localhost:62326
[INFO] Stopped SocketConnector@0.0.0.0:62326
[INFO] Mock Repository Manager http://localhost:62326 is stopped.
[INFO]
[INFO] --- maven-checkstyle-plugin:3.0.0:check (checkstyle-check) @ maven-archetype-plugin ---
[INFO] There are 46 errors reported by Checkstyle 6.18 with config/maven_checks.xml ruleset.
[INFO] Ignored 46 errors, 0 violation remaining.
[INFO] ------------------------------------------------------------------------
[INFO] Reactor Summary for Maven Archetype 3.1.2-SNAPSHOT:
[INFO]
[INFO] Maven Archetype .................................... SUCCESS [  5.494 s]
[INFO] Maven Archetype Models ............................. SUCCESS [  0.606 s]
[INFO] Maven Archetype Catalog Model ...................... SUCCESS [  3.029 s]
[INFO] Maven Archetype Descriptor Model ................... SUCCESS [  1.457 s]
[INFO] Maven Archetype Common ............................. SUCCESS [ 23.876 s]
[INFO] Maven Archetype Packaging .......................... SUCCESS [  0.411 s]
[INFO] Maven Archetype Plugin ............................. SUCCESS [05:35 min]
[INFO] ------------------------------------------------------------------------
[INFO] BUILD SUCCESS
[INFO] ------------------------------------------------------------------------
[INFO] Total time:  06:10 min
[INFO] Finished at: 2019-07-27T17:13:18-07:00
[INFO] ------------------------------------------------------------------------
[INFO] [jenkins-event-spy] Generated F:\short\jenkins-maven-box-maven-archetype-buildfix-4@2@tmp\withMaven75dea80b\maven-spy-20190727-170708-613904035882997828865.log
Picked up JAVA_TOOL_OPTIONS: -Dmaven.ext.class.path="F:\short\jenkins-maven-box-maven-archetype-buildfix-4@2@tmp\withMaven75dea80b\pipeline-maven-spy.jar" -Dorg.jenkinsci.plugins.pipeline.maven.reportsFolder="F:\short\jenkins-maven-box-maven-archetype-buildfix-4@2@tmp\withMaven75dea80b"
[Pipeline] }
[Pipeline] // dir
[Pipeline] }
[withMaven] artifactsPublisher - Archive artifact j7m3.6.xb\pom.xml under org\apache\maven\archetype\maven-archetype\3.1.2-SNAPSHOT\maven-archetype-3.1.2-SNAPSHOT.pom
[withMaven] artifactsPublisher - Archive artifact j7m3.6.xb\target\maven-archetype-3.1.2-SNAPSHOT-site.xml under org\apache\maven\archetype\maven-archetype\3.1.2-SNAPSHOT\maven-archetype-3.1.2-SNAPSHOT-site.xml
[withMaven] artifactsPublisher - Archive artifact j7m3.6.xb\archetype-models\pom.xml under org\apache\maven\archetype\archetype-models\3.1.2-SNAPSHOT\archetype-models-3.1.2-SNAPSHOT.pom
[withMaven] artifactsPublisher - Archive artifact j7m3.6.xb\archetype-models\target\archetype-models-3.1.2-SNAPSHOT-site.xml under org\apache\maven\archetype\archetype-models\3.1.2-SNAPSHOT\archetype-models-3.1.2-SNAPSHOT-site.xml
[withMaven] artifactsPublisher - Archive artifact j7m3.6.xb\archetype-models\archetype-catalog\pom.xml under org\apache\maven\archetype\archetype-catalog\3.1.2-SNAPSHOT\archetype-catalog-3.1.2-SNAPSHOT.pom
[withMaven] artifactsPublisher - Archive artifact j7m3.6.xb\archetype-models\archetype-catalog\target\archetype-catalog-3.1.2-SNAPSHOT.jar under org\apache\maven\archetype\archetype-catalog\3.1.2-SNAPSHOT\archetype-catalog-3.1.2-SNAPSHOT.jar
[withMaven] artifactsPublisher - Archive artifact j7m3.6.xb\archetype-models\archetype-descriptor\pom.xml under org\apache\maven\archetype\archetype-descriptor\3.1.2-SNAPSHOT\archetype-descriptor-3.1.2-SNAPSHOT.pom
[withMaven] artifactsPublisher - Archive artifact j7m3.6.xb\archetype-models\archetype-descriptor\target\archetype-descriptor-3.1.2-SNAPSHOT.jar under org\apache\maven\archetype\archetype-descriptor\3.1.2-SNAPSHOT\archetype-descriptor-3.1.2-SNAPSHOT.jar
[withMaven] artifactsPublisher - Archive artifact j7m3.6.xb\archetype-common\pom.xml under org\apache\maven\archetype\archetype-common\3.1.2-SNAPSHOT\archetype-common-3.1.2-SNAPSHOT.pom
[withMaven] artifactsPublisher - Archive artifact j7m3.6.xb\archetype-common\target\archetype-common-3.1.2-SNAPSHOT.jar under org\apache\maven\archetype\archetype-common\3.1.2-SNAPSHOT\archetype-common-3.1.2-SNAPSHOT.jar
[withMaven] artifactsPublisher - Archive artifact j7m3.6.xb\archetype-packaging\pom.xml under org\apache\maven\archetype\archetype-packaging\3.1.2-SNAPSHOT\archetype-packaging-3.1.2-SNAPSHOT.pom
[withMaven] artifactsPublisher - Archive artifact j7m3.6.xb\archetype-packaging\target\archetype-packaging-3.1.2-SNAPSHOT.jar under org\apache\maven\archetype\archetype-packaging\3.1.2-SNAPSHOT\archetype-packaging-3.1.2-SNAPSHOT.jar
[withMaven] artifactsPublisher - Archive artifact j7m3.6.xb\maven-archetype-plugin\pom.xml under org\apache\maven\plugins\maven-archetype-plugin\3.1.2-SNAPSHOT\maven-archetype-plugin-3.1.2-SNAPSHOT.pom
[withMaven] artifactsPublisher - Archive artifact j7m3.6.xb\maven-archetype-plugin\target\maven-archetype-plugin-3.1.2-SNAPSHOT.jar under org\apache\maven\plugins\maven-archetype-plugin\3.1.2-SNAPSHOT\maven-archetype-plugin-3.1.2-SNAPSHOT.jar
[Fast Archiver] No prior successful build to compare, so performing full copy of artifacts
[withMaven] junitPublisher - Archive test results for Maven artifact org.apache.maven.archetype:archetype-catalog:jar:3.1.2-SNAPSHOT generated by maven-surefire-plugin:test (default-test): j7m3.6.xb\archetype-models\archetype-catalog\target\surefire-reports\*.xml
[withMaven] junitPublisher - Archive test results for Maven artifact org.apache.maven.archetype:archetype-descriptor:jar:3.1.2-SNAPSHOT generated by maven-surefire-plugin:test (default-test): j7m3.6.xb\archetype-models\archetype-descriptor\target\surefire-reports\*.xml
[withMaven] junitPublisher - Archive test results for Maven artifact org.apache.maven.archetype:archetype-common:jar:3.1.2-SNAPSHOT generated by maven-surefire-plugin:test (default-test): j7m3.6.xb\archetype-common\target\surefire-reports\*.xml
[withMaven] junitPublisher - Archive test results for Maven artifact org.apache.maven.archetype:archetype-packaging:jar:3.1.2-SNAPSHOT generated by maven-surefire-plugin:test (default-test): j7m3.6.xb\archetype-packaging\target\surefire-reports\*.xml
[withMaven] junitPublisher - Archive test results for Maven artifact org.apache.maven.plugins:maven-archetype-plugin:maven-plugin:3.1.2-SNAPSHOT generated by maven-surefire-plugin:test (default-test): j7m3.6.xb\maven-archetype-plugin\target\surefire-reports\*.xml
Recording test results
[withMaven] Publishers: Generated Artifacts Publisher: 274 ms, Junit Publisher: 327 ms, Open Task Scanner Publisher: 231 ms, Dependencies Fingerprint Publisher: 57 ms, Invoker Publisher: 17689 ms, Pipeline Graph Publisher: 4 ms
[Pipeline] // withMaven
[withMaven] openTasksPublisher - Scan Tasks for Maven artifact org.apache.maven.archetype:archetype-common:jar:3.1.2-SNAPSHOT in source directory j7m3.6.xb\archetype-common\src\main\java
[withMaven] openTasksPublisher - Scan Tasks for Maven artifact org.apache.maven.plugins:maven-archetype-plugin:maven-plugin:3.1.2-SNAPSHOT in source directory j7m3.6.xb\maven-archetype-plugin\src\main\java
[Pipeline] cleanWs
[WS-CLEANUP] Deleting project workspace...
[WS-CLEANUP] Deferred wipeout is used...
[WS-CLEANUP] done
[Pipeline] }
[Pipeline] // stage
[Pipeline] }
[Pipeline] // ws
[Pipeline] }
[Pipeline] // node
[Pipeline] }
[TASKS] Scanning folder 'F:\short\jenkins-maven-box-maven-archetype-buildfix-4@2' for files matching the pattern 'j7m3.6.xb\archetype-common\src\main\java\**\*,j7m3.6.xb\maven-archetype-plugin\src\main\java\**\*' - excludes: null
[TASKS] Found 89 files to scan for tasks
[TASKS] Found 26 open tasks.
Skipping warnings blame since pipelines do not have an SCM link.%n
[withMaven] invokerPublisher - Archive invoker results for Maven artifact MavenArtifact{org.apache.maven.plugins:maven-archetype-plugin:maven-plugin:3.1.2-SNAPSHOT(version: 3.1.2-SNAPSHOT, snapshot:false) } generated by PluginInvocation{org.apache.maven.plugins:maven-invoker-plugin:3.1.0@run  integration-test}: j7m3.6.xb\maven-archetype-plugin\target\invoker-reports\*.xml
[INFO] run post-build script verify.groovy
[INFO]           ARCHETYPE-517_failing-goals ...................... SUCCESS (8.3 s)
[INFO] Building: generate-basic
[INFO] run post-build script verify.bsh
[INFO]           generate-basic ................................... SUCCESS (5.4 s)
[INFO] -------------------------------------------------
[INFO] Build Summary:
[INFO]   Passed: 25, Failed: 0, Errors: 0, Skipped: 0
[INFO] -------------------------------------------------
[INFO]
[INFO] --- mrm-maven-plugin:1.1.0:stop (mirror) @ maven-archetype-plugin ---
[INFO] Stopping Mock Repository Manager on http://localhost:38385
[INFO] Stopped SocketConnector@0.0.0.0:38385
[INFO] Mock Repository Manager http://localhost:38385 is stopped.
[INFO]
[INFO] --- mrm-maven-plugin:1.1.0:stop (archetype-repository) @ maven-archetype-plugin ---
[INFO] Stopping Mock Repository Manager on http://localhost:38959
[INFO] Stopped SocketConnector@0.0.0.0:38959
[INFO] Mock Repository Manager http://localhost:38959 is stopped.
[INFO]
[INFO] --- maven-checkstyle-plugin:3.0.0:check (checkstyle-check) @ maven-archetype-plugin ---
[INFO] There are 46 errors reported by Checkstyle 6.18 with config/maven_checks.xml ruleset.
[INFO] Ignored 46 errors, 0 violation remaining.
[INFO] ------------------------------------------------------------------------
[INFO] Reactor Summary for Maven Archetype 3.1.2-SNAPSHOT:
[INFO]
[INFO] Maven Archetype .................................... SUCCESS [  6.780 s]
[INFO] Maven Archetype Models ............................. SUCCESS [  0.697 s]
[INFO] Maven Archetype Catalog Model ...................... SUCCESS [  3.211 s]
[INFO] Maven Archetype Descriptor Model ................... SUCCESS [  1.260 s]
[INFO] Maven Archetype Common ............................. SUCCESS [ 23.254 s]
[INFO] Maven Archetype Packaging .......................... SUCCESS [  0.641 s]
[INFO] Maven Archetype Plugin ............................. SUCCESS [05:47 min]
[INFO] ------------------------------------------------------------------------
[INFO] BUILD SUCCESS
[INFO] ------------------------------------------------------------------------
[INFO] Total time:  06:23 min
[INFO] Finished at: 2019-07-28T00:13:33Z
[INFO] ------------------------------------------------------------------------
[INFO] [jenkins-event-spy] Generated /home/jenkins/jenkins-slave/workspace/ven-box_maven-archetype_buildfix@2@tmp/withMaven2dfc2f04/maven-spy-20190728-000709-5362431391606560639563.log
[Pipeline] }
[Pipeline] // dir
[Pipeline] }
[withMaven] artifactsPublisher - Archive artifact linux-jdk7-m3.6.x_build/pom.xml under org/apache/maven/archetype/maven-archetype/3.1.2-SNAPSHOT/maven-archetype-3.1.2-SNAPSHOT.pom
[withMaven] artifactsPublisher - Archive artifact linux-jdk7-m3.6.x_build/target/maven-archetype-3.1.2-SNAPSHOT-site.xml under org/apache/maven/archetype/maven-archetype/3.1.2-SNAPSHOT/maven-archetype-3.1.2-SNAPSHOT-site.xml
[withMaven] artifactsPublisher - Archive artifact linux-jdk7-m3.6.x_build/archetype-models/pom.xml under org/apache/maven/archetype/archetype-models/3.1.2-SNAPSHOT/archetype-models-3.1.2-SNAPSHOT.pom
[withMaven] artifactsPublisher - Archive artifact linux-jdk7-m3.6.x_build/archetype-models/target/archetype-models-3.1.2-SNAPSHOT-site.xml under org/apache/maven/archetype/archetype-models/3.1.2-SNAPSHOT/archetype-models-3.1.2-SNAPSHOT-site.xml
[withMaven] artifactsPublisher - Archive artifact linux-jdk7-m3.6.x_build/archetype-models/archetype-catalog/pom.xml under org/apache/maven/archetype/archetype-catalog/3.1.2-SNAPSHOT/archetype-catalog-3.1.2-SNAPSHOT.pom
[withMaven] artifactsPublisher - Archive artifact linux-jdk7-m3.6.x_build/archetype-models/archetype-catalog/target/archetype-catalog-3.1.2-SNAPSHOT.jar under org/apache/maven/archetype/archetype-catalog/3.1.2-SNAPSHOT/archetype-catalog-3.1.2-SNAPSHOT.jar
[withMaven] artifactsPublisher - Archive artifact linux-jdk7-m3.6.x_build/archetype-models/archetype-descriptor/pom.xml under org/apache/maven/archetype/archetype-descriptor/3.1.2-SNAPSHOT/archetype-descriptor-3.1.2-SNAPSHOT.pom
[withMaven] artifactsPublisher - Archive artifact linux-jdk7-m3.6.x_build/archetype-models/archetype-descriptor/target/archetype-descriptor-3.1.2-SNAPSHOT.jar under org/apache/maven/archetype/archetype-descriptor/3.1.2-SNAPSHOT/archetype-descriptor-3.1.2-SNAPSHOT.jar
[withMaven] artifactsPublisher - Archive artifact linux-jdk7-m3.6.x_build/archetype-common/pom.xml under org/apache/maven/archetype/archetype-common/3.1.2-SNAPSHOT/archetype-common-3.1.2-SNAPSHOT.pom
[withMaven] artifactsPublisher - Archive artifact linux-jdk7-m3.6.x_build/archetype-common/target/archetype-common-3.1.2-SNAPSHOT.jar under org/apache/maven/archetype/archetype-common/3.1.2-SNAPSHOT/archetype-common-3.1.2-SNAPSHOT.jar
[withMaven] artifactsPublisher - Archive artifact linux-jdk7-m3.6.x_build/archetype-packaging/pom.xml under org/apache/maven/archetype/archetype-packaging/3.1.2-SNAPSHOT/archetype-packaging-3.1.2-SNAPSHOT.pom
[withMaven] Publishers: Generated Artifacts Publisher: 273 ms, Junit Publisher: 387 ms, Open Task Scanner Publisher: 338 ms, Dependencies Fingerprint Publisher: 69 ms, Invoker Publisher: 16751 ms, Pipeline Graph Publisher: 4 ms
[Pipeline] // withMaven
[Pipeline] cleanWs
[WS-CLEANUP] Deleting project workspace...
[WS-CLEANUP] Deferred wipeout is used...
[WS-CLEANUP] done
[Pipeline] }
[Pipeline] // stage
[Pipeline] }
[Pipeline] // ws
[Pipeline] }
[Pipeline] // node
[Pipeline] }
[withMaven] artifactsPublisher - Archive artifact linux-jdk7-m3.6.x_build/archetype-packaging/target/archetype-packaging-3.1.2-SNAPSHOT.jar under org/apache/maven/archetype/archetype-packaging/3.1.2-SNAPSHOT/archetype-packaging-3.1.2-SNAPSHOT.jar
[withMaven] artifactsPublisher - Archive artifact linux-jdk7-m3.6.x_build/maven-archetype-plugin/pom.xml under org/apache/maven/plugins/maven-archetype-plugin/3.1.2-SNAPSHOT/maven-archetype-plugin-3.1.2-SNAPSHOT.pom
[withMaven] artifactsPublisher - Archive artifact linux-jdk7-m3.6.x_build/maven-archetype-plugin/target/maven-archetype-plugin-3.1.2-SNAPSHOT.jar under org/apache/maven/plugins/maven-archetype-plugin/3.1.2-SNAPSHOT/maven-archetype-plugin-3.1.2-SNAPSHOT.jar
[Fast Archiver] No prior successful build to compare, so performing full copy of artifacts
[withMaven] junitPublisher - Archive test results for Maven artifact org.apache.maven.archetype:archetype-catalog:jar:3.1.2-SNAPSHOT generated by maven-surefire-plugin:test (default-test): linux-jdk7-m3.6.x_build/archetype-models/archetype-catalog/target/surefire-reports/*.xml
[withMaven] junitPublisher - Archive test results for Maven artifact org.apache.maven.archetype:archetype-descriptor:jar:3.1.2-SNAPSHOT generated by maven-surefire-plugin:test (default-test): linux-jdk7-m3.6.x_build/archetype-models/archetype-descriptor/target/surefire-reports/*.xml
[withMaven] junitPublisher - Archive test results for Maven artifact org.apache.maven.archetype:archetype-common:jar:3.1.2-SNAPSHOT generated by maven-surefire-plugin:test (default-test): linux-jdk7-m3.6.x_build/archetype-common/target/surefire-reports/*.xml
[withMaven] junitPublisher - Archive test results for Maven artifact org.apache.maven.archetype:archetype-packaging:jar:3.1.2-SNAPSHOT generated by maven-surefire-plugin:test (default-test): linux-jdk7-m3.6.x_build/archetype-packaging/target/surefire-reports/*.xml
[withMaven] junitPublisher - Archive test results for Maven artifact org.apache.maven.plugins:maven-archetype-plugin:maven-plugin:3.1.2-SNAPSHOT generated by maven-surefire-plugin:test (default-test): linux-jdk7-m3.6.x_build/maven-archetype-plugin/target/surefire-reports/*.xml
Recording test results
[withMaven] openTasksPublisher - Scan Tasks for Maven artifact org.apache.maven.archetype:archetype-common:jar:3.1.2-SNAPSHOT in source directory linux-jdk7-m3.6.x_build/archetype-common/src/main/java
[withMaven] openTasksPublisher - Scan Tasks for Maven artifact org.apache.maven.plugins:maven-archetype-plugin:maven-plugin:3.1.2-SNAPSHOT in source directory linux-jdk7-m3.6.x_build/maven-archetype-plugin/src/main/java
[TASKS] Scanning folder '/home/jenkins/jenkins-slave/workspace/ven-box_maven-archetype_buildfix@2' for files matching the pattern 'linux-jdk7-m3.6.x_build/archetype-common/src/main/java/**/*,linux-jdk7-m3.6.x_build/maven-archetype-plugin/src/main/java/**/*' - excludes: null
[TASKS] Found 89 files to scan for tasks
[TASKS] Found 26 open tasks.
Skipping warnings blame since pipelines do not have an SCM link.%n
[withMaven] invokerPublisher - Archive invoker results for Maven artifact MavenArtifact{org.apache.maven.plugins:maven-archetype-plugin:maven-plugin:3.1.2-SNAPSHOT(version: 3.1.2-SNAPSHOT, snapshot:false) } generated by PluginInvocation{org.apache.maven.plugins:maven-invoker-plugin:3.1.0@run  integration-test}: linux-jdk7-m3.6.x_build/maven-archetype-plugin/target/invoker-reports/*.xml
[withMaven] Publishers: Generated Artifacts Publisher: 5648 ms, Junit Publisher: 8098 ms, Open Task Scanner Publisher: 3607 ms, Dependencies Fingerprint Publisher: 1555 ms, Invoker Publisher: 25183 ms, Pipeline Graph Publisher: 4 ms
[Pipeline] // withMaven
[Pipeline] cleanWs
[WS-CLEANUP] Deleting project workspace...
[WS-CLEANUP] Deferred wipeout is used...
[WS-CLEANUP] done
[Pipeline] }
[Pipeline] // stage
[Pipeline] }
[Pipeline] // ws
[Pipeline] }
[Pipeline] // node
[Pipeline] }
[Pipeline] // parallel
[Pipeline] stage
[Pipeline] { (Notifications)
[Pipeline] echo
Build result: FAILURE
[Pipeline] jiraIssueSelector
[Pipeline] emailext
Reply | Threaded
Open this post in threaded view
|

Build failed in Jenkins: Maven TLP » maven-archetype » buildfix #5

Apache Jenkins Server-2
See https://builds.apache.org/job/maven-box/job/maven-archetype/job/buildfix/5/

Changes:

* investigating repos
* investigating repos
* investigating repos
* investigating repos
* investigating repos
* investigating repos
* investigating repos
* investigating repos

All tests passed

Build log:
[...truncated 10314 lines...]
[withMaven] junitPublisher - Archive test results for Maven artifact org.apache.maven.archetype:archetype-common:jar:3.1.2-SNAPSHOT generated by maven-surefire-plugin:test (default-test): j7m3.3.xb\archetype-common\target\surefire-reports\*.xml
[withMaven] junitPublisher - Archive test results for Maven artifact org.apache.maven.archetype:archetype-packaging:jar:3.1.2-SNAPSHOT generated by maven-surefire-plugin:test (default-test): j7m3.3.xb\archetype-packaging\target\surefire-reports\*.xml
[withMaven] junitPublisher - Archive test results for Maven artifact org.apache.maven.plugins:maven-archetype-plugin:maven-plugin:3.1.2-SNAPSHOT generated by maven-surefire-plugin:test (default-test): j7m3.3.xb\maven-archetype-plugin\target\surefire-reports\*.xml
Recording test results
[Pipeline] // stage
[Pipeline] }
[Pipeline] // ws
[Pipeline] }
[withMaven] openTasksPublisher - Scan Tasks for Maven artifact org.apache.maven.archetype:archetype-common:jar:3.1.2-SNAPSHOT in source directory j7m3.3.xb\archetype-common\src\main\java
[withMaven] openTasksPublisher - Scan Tasks for Maven artifact org.apache.maven.plugins:maven-archetype-plugin:maven-plugin:3.1.2-SNAPSHOT in source directory j7m3.3.xb\maven-archetype-plugin\src\main\java
[Pipeline] // node
[Pipeline] }
[TASKS] Scanning folder 'F:\short\jenkins-maven-box-maven-archetype-buildfix-5' for files matching the pattern 'j7m3.3.xb\archetype-common\src\main\java\**\*,j7m3.3.xb\maven-archetype-plugin\src\main\java\**\*' - excludes: null
[TASKS] Found 89 files to scan for tasks
[TASKS] Found 26 open tasks.
Skipping warnings blame since pipelines do not have an SCM link.%n
[withMaven] invokerPublisher - Archive invoker results for Maven artifact MavenArtifact{org.apache.maven.plugins:maven-archetype-plugin:maven-plugin:3.1.2-SNAPSHOT(version: 3.1.2-SNAPSHOT, snapshot:false) } generated by PluginInvocation{org.apache.maven.plugins:maven-invoker-plugin:3.1.0@run  integration-test}: j7m3.3.xb\maven-archetype-plugin\target\invoker-reports\*.xml
[withMaven] Publishers: Generated Artifacts Publisher: 5561 ms, Junit Publisher: 7922 ms, Open Task Scanner Publisher: 3518 ms, Dependencies Fingerprint Publisher: 1525 ms, Invoker Publisher: 24907 ms, Pipeline Graph Publisher: 4 ms
[withMaven] Publishers: Generated Artifacts Publisher: 296 ms, Junit Publisher: 341 ms, Open Task Scanner Publisher: 332 ms, Dependencies Fingerprint Publisher: 68 ms, Invoker Publisher: 17749 ms, Pipeline Graph Publisher: 2 ms
[Pipeline] // withMaven
[Pipeline] cleanWs
[WS-CLEANUP] Deleting project workspace...
[WS-CLEANUP] Deferred wipeout is used...
[WS-CLEANUP] done
[Pipeline] }
[Pipeline] // stage
[Pipeline] }
[Pipeline] // ws
[Pipeline] }
[Pipeline] // node
[Pipeline] }
[Pipeline] // withMaven
[Pipeline] cleanWs
[WS-CLEANUP] Deleting project workspace...
[WS-CLEANUP] Deferred wipeout is used...
[WS-CLEANUP] done
[Pipeline] }
[Pipeline] // stage
[Pipeline] }
[Pipeline] // ws
[Pipeline] }
[Pipeline] // node
[Pipeline] }
[INFO] run post-build script verify.groovy
[INFO]           roundtrip-multi\pom.xml .......................... SUCCESS (20.3 s)
[INFO] -------------------------------------------------
[INFO] Build Summary:
[INFO]   Passed: 24, Failed: 1, Errors: 0, Skipped: 0
[INFO] -------------------------------------------------
[ERROR] The following builds failed:
[ERROR] *  ARCHETYPE-241_filter-directory\pom.xml
[INFO] -------------------------------------------------
[INFO] ------------------------------------------------------------------------
[INFO] Reactor Summary for Maven Archetype 3.1.2-SNAPSHOT:
[INFO]
[INFO] Maven Archetype .................................... SUCCESS [  4.747 s]
[INFO] Maven Archetype Models ............................. SUCCESS [  0.413 s]
[INFO] Maven Archetype Catalog Model ...................... SUCCESS [  3.058 s]
[INFO] Maven Archetype Descriptor Model ................... SUCCESS [  1.408 s]
[INFO] Maven Archetype Common ............................. SUCCESS [ 24.935 s]
[INFO] Maven Archetype Packaging .......................... SUCCESS [  0.654 s]
[INFO] Maven Archetype Plugin ............................. FAILURE [05:33 min]
[INFO] ------------------------------------------------------------------------
[INFO] BUILD FAILURE
[INFO] ------------------------------------------------------------------------
[INFO] Total time:  06:09 min
[INFO] Finished at: 2019-07-28T02:06:04-07:00
[INFO] ------------------------------------------------------------------------
[INFO] [jenkins-event-spy] Generated F:\short\jenkins-maven-box-maven-archetype-buildfix-5@2@tmp\withMavenedda04ff\maven-spy-20190728-015954-150488353940946030836.log
[ERROR] Failed to execute goal org.apache.maven.plugins:maven-invoker-plugin:3.1.0:run (integration-test) on project maven-archetype-plugin: 1 build failed. See console output above for details. -> [Help 1]
org.apache.maven.lifecycle.LifecycleExecutionException: Failed to execute goal org.apache.maven.plugins:maven-invoker-plugin:3.1.0:run (integration-test) on project maven-archetype-plugin: 1 build failed. See console output above for details.
    at org.apache.maven.lifecycle.internal.MojoExecutor.execute (MojoExecutor.java:215)
    at org.apache.maven.lifecycle.internal.MojoExecutor.execute (MojoExecutor.java:156)
    at org.apache.maven.lifecycle.internal.MojoExecutor.execute (MojoExecutor.java:148)
    at org.apache.maven.lifecycle.internal.LifecycleModuleBuilder.buildProject (LifecycleModuleBuilder.java:117)
    at org.apache.maven.lifecycle.internal.LifecycleModuleBuilder.buildProject (LifecycleModuleBuilder.java:81)
    at org.apache.maven.lifecycle.internal.builder.singlethreaded.SingleThreadedBuilder.build (SingleThreadedBuilder.java:56)
    at org.apache.maven.lifecycle.internal.LifecycleStarter.execute (LifecycleStarter.java:128)
    at org.apache.maven.DefaultMaven.doExecute (DefaultMaven.java:305)
    at org.apache.maven.DefaultMaven.doExecute (DefaultMaven.java:192)
    at org.apache.maven.DefaultMaven.execute (DefaultMaven.java:105)
    at org.apache.maven.cli.MavenCli.execute (MavenCli.java:956)
    at org.apache.maven.cli.MavenCli.doMain (MavenCli.java:288)
    at org.apache.maven.cli.MavenCli.main (MavenCli.java:192)
    at sun.reflect.NativeMethodAccessorImpl.invoke0 (Native Method)
    at sun.reflect.NativeMethodAccessorImpl.invoke (NativeMethodAccessorImpl.java:57)
    at sun.reflect.DelegatingMethodAccessorImpl.invoke (DelegatingMethodAccessorImpl.java:43)
    at java.lang.reflect.Method.invoke (Method.java:606)
    at org.codehaus.plexus.classworlds.launcher.Launcher.launchEnhanced (Launcher.java:289)
    at org.codehaus.plexus.classworlds.launcher.Launcher.launch (Launcher.java:229)
    at org.codehaus.plexus.classworlds.launcher.Launcher.mainWithExitCode (Launcher.java:415)
    at org.codehaus.plexus.classworlds.launcher.Launcher.main (Launcher.java:356)
Caused by: org.apache.maven.plugin.MojoFailureException: 1 build failed. See console output above for details.
    at org.apache.maven.plugins.invoker.InvokerSession.handleFailures (InvokerSession.java:260)
    at org.apache.maven.plugins.invoker.InvokerMojo.processResults (InvokerMojo.java:68)
    at org.apache.maven.plugins.invoker.AbstractInvokerMojo.execute (AbstractInvokerMojo.java:738)
    at org.apache.maven.plugin.DefaultBuildPluginManager.executeMojo (DefaultBuildPluginManager.java:137)
    at org.apache.maven.lifecycle.internal.MojoExecutor.execute (MojoExecutor.java:210)
    at org.apache.maven.lifecycle.internal.MojoExecutor.execute (MojoExecutor.java:156)
    at org.apache.maven.lifecycle.internal.MojoExecutor.execute (MojoExecutor.java:148)
    at org.apache.maven.lifecycle.internal.LifecycleModuleBuilder.buildProject (LifecycleModuleBuilder.java:117)
    at org.apache.maven.lifecycle.internal.LifecycleModuleBuilder.buildProject (LifecycleModuleBuilder.java:81)
    at org.apache.maven.lifecycle.internal.builder.singlethreaded.SingleThreadedBuilder.build (SingleThreadedBuilder.java:56)
    at org.apache.maven.lifecycle.internal.LifecycleStarter.execute (LifecycleStarter.java:128)
    at org.apache.maven.DefaultMaven.doExecute (DefaultMaven.java:305)
    at org.apache.maven.DefaultMaven.doExecute (DefaultMaven.java:192)
    at org.apache.maven.DefaultMaven.execute (DefaultMaven.java:105)
    at org.apache.maven.cli.MavenCli.execute (MavenCli.java:956)
    at org.apache.maven.cli.MavenCli.doMain (MavenCli.java:288)
    at org.apache.maven.cli.MavenCli.main (MavenCli.java:192)
    at sun.reflect.NativeMethodAccessorImpl.invoke0 (Native Method)
    at sun.reflect.NativeMethodAccessorImpl.invoke (NativeMethodAccessorImpl.java:57)
    at sun.reflect.DelegatingMethodAccessorImpl.invoke (DelegatingMethodAccessorImpl.java:43)
    at java.lang.reflect.Method.invoke (Method.java:606)
    at org.codehaus.plexus.classworlds.launcher.Launcher.launchEnhanced (Launcher.java:289)
    at org.codehaus.plexus.classworlds.launcher.Launcher.launch (Launcher.java:229)
    at org.codehaus.plexus.classworlds.launcher.Launcher.mainWithExitCode (Launcher.java:415)
    at org.codehaus.plexus.classworlds.launcher.Launcher.main (Launcher.java:356)
[ERROR]
[ERROR] Re-run Maven using the -X switch to enable full debug logging.
[ERROR]
[ERROR] For more information about the errors and possible solutions, please read the following articles:
[ERROR] [Help 1] http://cwiki.apache.org/confluence/display/MAVEN/MojoFailureException
[ERROR]
[ERROR] After correcting the problems, you can resume the build with the command
[ERROR]   mvn <goals> -rf :maven-archetype-plugin
Picked up JAVA_TOOL_OPTIONS: -Dmaven.ext.class.path="F:\short\jenkins-maven-box-maven-archetype-buildfix-5@2@tmp\withMavenedda04ff\pipeline-maven-spy.jar" -Dorg.jenkinsci.plugins.pipeline.maven.reportsFolder="F:\short\jenkins-maven-box-maven-archetype-buildfix-5@2@tmp\withMavenedda04ff"
[Pipeline] }
[Pipeline] // dir
[Pipeline] }
[withMaven] artifactsPublisher - Archive artifact j7m3.6.xb\pom.xml under org\apache\maven\archetype\maven-archetype\3.1.2-SNAPSHOT\maven-archetype-3.1.2-SNAPSHOT.pom
[withMaven] artifactsPublisher - Archive artifact j7m3.6.xb\target\maven-archetype-3.1.2-SNAPSHOT-site.xml under org\apache\maven\archetype\maven-archetype\3.1.2-SNAPSHOT\maven-archetype-3.1.2-SNAPSHOT-site.xml
[withMaven] artifactsPublisher - Archive artifact j7m3.6.xb\archetype-models\pom.xml under org\apache\maven\archetype\archetype-models\3.1.2-SNAPSHOT\archetype-models-3.1.2-SNAPSHOT.pom
[withMaven] artifactsPublisher - Archive artifact j7m3.6.xb\archetype-models\target\archetype-models-3.1.2-SNAPSHOT-site.xml under org\apache\maven\archetype\archetype-models\3.1.2-SNAPSHOT\archetype-models-3.1.2-SNAPSHOT-site.xml
[withMaven] artifactsPublisher - Archive artifact j7m3.6.xb\archetype-models\archetype-catalog\pom.xml under org\apache\maven\archetype\archetype-catalog\3.1.2-SNAPSHOT\archetype-catalog-3.1.2-SNAPSHOT.pom
[withMaven] artifactsPublisher - Archive artifact j7m3.6.xb\archetype-models\archetype-catalog\target\archetype-catalog-3.1.2-SNAPSHOT.jar under org\apache\maven\archetype\archetype-catalog\3.1.2-SNAPSHOT\archetype-catalog-3.1.2-SNAPSHOT.jar
[withMaven] artifactsPublisher - Archive artifact j7m3.6.xb\archetype-models\archetype-descriptor\pom.xml under org\apache\maven\archetype\archetype-descriptor\3.1.2-SNAPSHOT\archetype-descriptor-3.1.2-SNAPSHOT.pom
[withMaven] artifactsPublisher - Archive artifact j7m3.6.xb\archetype-models\archetype-descriptor\target\archetype-descriptor-3.1.2-SNAPSHOT.jar under org\apache\maven\archetype\archetype-descriptor\3.1.2-SNAPSHOT\archetype-descriptor-3.1.2-SNAPSHOT.jar
[withMaven] artifactsPublisher - Archive artifact j7m3.6.xb\archetype-common\pom.xml under org\apache\maven\archetype\archetype-common\3.1.2-SNAPSHOT\archetype-common-3.1.2-SNAPSHOT.pom
[withMaven] artifactsPublisher - Archive artifact j7m3.6.xb\archetype-common\target\archetype-common-3.1.2-SNAPSHOT.jar under org\apache\maven\archetype\archetype-common\3.1.2-SNAPSHOT\archetype-common-3.1.2-SNAPSHOT.jar
[withMaven] artifactsPublisher - Archive artifact j7m3.6.xb\archetype-packaging\pom.xml under org\apache\maven\archetype\archetype-packaging\3.1.2-SNAPSHOT\archetype-packaging-3.1.2-SNAPSHOT.pom
[withMaven] artifactsPublisher - Archive artifact j7m3.6.xb\archetype-packaging\target\archetype-packaging-3.1.2-SNAPSHOT.jar under org\apache\maven\archetype\archetype-packaging\3.1.2-SNAPSHOT\archetype-packaging-3.1.2-SNAPSHOT.jar
[Fast Archiver] No prior successful build to compare, so performing full copy of artifacts
[withMaven] junitPublisher - Archive test results for Maven artifact org.apache.maven.archetype:archetype-catalog:jar:3.1.2-SNAPSHOT generated by maven-surefire-plugin:test (default-test): j7m3.6.xb\archetype-models\archetype-catalog\target\surefire-reports\*.xml
[withMaven] junitPublisher - Archive test results for Maven artifact org.apache.maven.archetype:archetype-descriptor:jar:3.1.2-SNAPSHOT generated by maven-surefire-plugin:test (default-test): j7m3.6.xb\archetype-models\archetype-descriptor\target\surefire-reports\*.xml
[withMaven] junitPublisher - Archive test results for Maven artifact org.apache.maven.archetype:archetype-common:jar:3.1.2-SNAPSHOT generated by maven-surefire-plugin:test (default-test): j7m3.6.xb\archetype-common\target\surefire-reports\*.xml
[withMaven] junitPublisher - Archive test results for Maven artifact org.apache.maven.archetype:archetype-packaging:jar:3.1.2-SNAPSHOT generated by maven-surefire-plugin:test (default-test): j7m3.6.xb\archetype-packaging\target\surefire-reports\*.xml
[withMaven] junitPublisher - Archive test results for Maven artifact org.apache.maven.plugins:maven-archetype-plugin:maven-plugin:3.1.2-SNAPSHOT generated by maven-surefire-plugin:test (default-test): j7m3.6.xb\maven-archetype-plugin\target\surefire-reports\*.xml
Recording test results
[withMaven] openTasksPublisher - Scan Tasks for Maven artifact org.apache.maven.archetype:archetype-common:jar:3.1.2-SNAPSHOT in source directory j7m3.6.xb\archetype-common\src\main\java
[withMaven] openTasksPublisher - Scan Tasks for Maven artifact org.apache.maven.plugins:maven-archetype-plugin:maven-plugin:3.1.2-SNAPSHOT in source directory j7m3.6.xb\maven-archetype-plugin\src\main\java
[TASKS] Scanning folder 'F:\short\jenkins-maven-box-maven-archetype-buildfix-5@2' for files matching the pattern 'j7m3.6.xb\archetype-common\src\main\java\**\*,j7m3.6.xb\maven-archetype-plugin\src\main\java\**\*' - excludes: null
[TASKS] Found 89 files to scan for tasks
[TASKS] Found 26 open tasks.
Skipping warnings blame since pipelines do not have an SCM link.%n
[withMaven] invokerPublisher - Archive invoker results for Maven artifact MavenArtifact{org.apache.maven.plugins:maven-archetype-plugin:maven-plugin:3.1.2-SNAPSHOT(version: 3.1.2-SNAPSHOT, snapshot:false) } generated by PluginInvocation{org.apache.maven.plugins:maven-invoker-plugin:3.1.0@run  integration-test}: j7m3.6.xb\maven-archetype-plugin\target\invoker-reports\*.xml
[withMaven] Publishers: Generated Artifacts Publisher: 220 ms, Junit Publisher: 337 ms, Open Task Scanner Publisher: 238 ms, Dependencies Fingerprint Publisher: 68 ms, Invoker Publisher: 18291 ms, Pipeline Graph Publisher: 8 ms
[Pipeline] // withMaven
[Pipeline] dir
Running in F:\short\jenkins-maven-box-maven-archetype-buildfix-5\j7m3.3.xb
[Pipeline] {
[Pipeline] zip
Writing zip file of F:\short\jenkins-maven-box-maven-archetype-buildfix-5\j7m3.3.xb\maven-archetype-plugin\target\it\projects to F:\short\jenkins-maven-box-maven-archetype-buildfix-5\j7m3.3.xb\archetype-plugin-its-j7m3.3.xb.zip
Zipped 2624 entries.
Archiving F:\short\jenkins-maven-box-maven-archetype-buildfix-5\j7m3.3.xb\archetype-plugin-its-j7m3.3.xb.zip
[Fast Archiver] No prior successful build to compare, so performing full copy of artifacts
[Pipeline] zip
Writing zip file of F:\short\jenkins-maven-box-maven-archetype-buildfix-5\j7m3.3.xb\maven-archetype-plugin\target\local-repo to F:\short\jenkins-maven-box-maven-archetype-buildfix-5\j7m3.3.xb\local-repo-j7m3.3.xb.zip
Zipped 411 entries.
Archiving F:\short\jenkins-maven-box-maven-archetype-buildfix-5\j7m3.3.xb\local-repo-j7m3.3.xb.zip
[Fast Archiver] No prior successful build to compare, so performing full copy of artifacts
[Pipeline] zip
Writing zip file of F:\short\jenkins-maven-box-maven-archetype-buildfix-5\j7m3.3.xb\maven-archetype-plugin\target\mock-repo to F:\short\jenkins-maven-box-maven-archetype-buildfix-5\j7m3.3.xb\mock-repo-j7m3.3.xb.zip
Zipped 5 entries.
Archiving F:\short\jenkins-maven-box-maven-archetype-buildfix-5\j7m3.3.xb\mock-repo-j7m3.3.xb.zip
[Fast Archiver] No prior successful build to compare, so performing full copy of artifacts
[Pipeline] zip
Writing zip file of F:\short\jenkins-maven-box-maven-archetype-buildfix-5\j7m3.3.xb\maven-archetype-plugin\target\archetype-repo to F:\short\jenkins-maven-box-maven-archetype-buildfix-5\j7m3.3.xb\archetype-repo-j7m3.3.xb.zip
Zipped 5 entries.
Archiving F:\short\jenkins-maven-box-maven-archetype-buildfix-5\j7m3.3.xb\archetype-repo-j7m3.3.xb.zip
[Fast Archiver] No prior successful build to compare, so performing full copy of artifacts
[Pipeline] }
[Pipeline] // dir
[Pipeline] cleanWs
[WS-CLEANUP] Deleting project workspace...
[WS-CLEANUP] Deferred wipeout is used...
[WS-CLEANUP] done
[Pipeline] cleanWs
[WS-CLEANUP] Deleting project workspace...
[WS-CLEANUP] Deferred wipeout is used...
[WS-CLEANUP] done
[Pipeline] }
[Pipeline] // stage
[Pipeline] }
[Pipeline] // ws
[Pipeline] }
[Pipeline] // node
[Pipeline] }
Failed in branch windows-jdk7-m3.3.x_build
[withMaven] Publishers: Generated Artifacts Publisher: 220 ms, Junit Publisher: 335 ms, Open Task Scanner Publisher: 285 ms, Dependencies Fingerprint Publisher: 694 ms, Invoker Publisher: 16425 ms, Pipeline Graph Publisher: 4 ms
[Pipeline] // withMaven
[Pipeline] dir
Running in F:\short\jenkins-maven-box-maven-archetype-buildfix-5@2\j7m3.6.xb
[Pipeline] {
[Pipeline] zip
Writing zip file of F:\short\jenkins-maven-box-maven-archetype-buildfix-5@2\j7m3.6.xb\maven-archetype-plugin\target\it\projects to F:\short\jenkins-maven-box-maven-archetype-buildfix-5@2\j7m3.6.xb\archetype-plugin-its-j7m3.6.xb.zip
Zipped 2624 entries.
Archiving F:\short\jenkins-maven-box-maven-archetype-buildfix-5@2\j7m3.6.xb\archetype-plugin-its-j7m3.6.xb.zip
[Fast Archiver] No prior successful build to compare, so performing full copy of artifacts
[Pipeline] zip
Writing zip file of F:\short\jenkins-maven-box-maven-archetype-buildfix-5@2\j7m3.6.xb\maven-archetype-plugin\target\local-repo to F:\short\jenkins-maven-box-maven-archetype-buildfix-5@2\j7m3.6.xb\local-repo-j7m3.6.xb.zip
Zipped 411 entries.
Archiving F:\short\jenkins-maven-box-maven-archetype-buildfix-5@2\j7m3.6.xb\local-repo-j7m3.6.xb.zip
[Fast Archiver] No prior successful build to compare, so performing full copy of artifacts
[Pipeline] zip
Writing zip file of F:\short\jenkins-maven-box-maven-archetype-buildfix-5@2\j7m3.6.xb\maven-archetype-plugin\target\mock-repo to F:\short\jenkins-maven-box-maven-archetype-buildfix-5@2\j7m3.6.xb\mock-repo-j7m3.6.xb.zip
Zipped 5 entries.
Archiving F:\short\jenkins-maven-box-maven-archetype-buildfix-5@2\j7m3.6.xb\mock-repo-j7m3.6.xb.zip
[Fast Archiver] No prior successful build to compare, so performing full copy of artifacts
[Pipeline] zip
Writing zip file of F:\short\jenkins-maven-box-maven-archetype-buildfix-5@2\j7m3.6.xb\maven-archetype-plugin\target\archetype-repo to F:\short\jenkins-maven-box-maven-archetype-buildfix-5@2\j7m3.6.xb\archetype-repo-j7m3.6.xb.zip
Zipped 5 entries.
Archiving F:\short\jenkins-maven-box-maven-archetype-buildfix-5@2\j7m3.6.xb\archetype-repo-j7m3.6.xb.zip
[Fast Archiver] No prior successful build to compare, so performing full copy of artifacts
[Pipeline] }
[Pipeline] // dir
[Pipeline] cleanWs
[WS-CLEANUP] Deleting project workspace...
[WS-CLEANUP] Deferred wipeout is used...
[WS-CLEANUP] done
[Pipeline] cleanWs
[WS-CLEANUP] Deleting project workspace...
[WS-CLEANUP] Deferred wipeout is used...
[WS-CLEANUP] done
[Pipeline] }
[Pipeline] // stage
[Pipeline] }
[Pipeline] // ws
[Pipeline] }
[Pipeline] // node
[Pipeline] }
Failed in branch windows-jdk7-m3.6.x_build
[Pipeline] // parallel
[Pipeline] stage
[Pipeline] { (Notifications)
[Pipeline] echo
Build result: FAILURE
[Pipeline] jiraIssueSelector
[Pipeline] emailext
Reply | Threaded
Open this post in threaded view
|

Build failed in Jenkins: Maven TLP » maven-archetype » buildfix #6

Apache Jenkins Server-2
See https://builds.apache.org/job/maven-box/job/maven-archetype/job/buildfix/6/

Changes:

* print disk space usage

All tests passed

Build log:
[...truncated 5283 lines...]
[INFO]
[INFO] Maven Archetype .................................... SUCCESS [  4.415 s]
[INFO] Maven Archetype Models ............................. SUCCESS [  0.407 s]
[INFO] Maven Archetype Catalog Model ...................... SUCCESS [  2.916 s]
[INFO] Maven Archetype Descriptor Model ................... SUCCESS [  1.504 s]
[INFO] Maven Archetype Common ............................. SUCCESS [ 23.464 s]
[INFO] Maven Archetype Packaging .......................... SUCCESS [  0.687 s]
[INFO] Maven Archetype Plugin ............................. SUCCESS [05:06 min]
[INFO] ------------------------------------------------------------------------
[INFO] BUILD SUCCESS
[INFO] ------------------------------------------------------------------------
[INFO] Total time: 05:40 min
[INFO] Finished at: 2019-07-28T02:18:15-07:00
[INFO] Final Memory: 56M/704M
[INFO] ------------------------------------------------------------------------
[INFO] [jenkins-event-spy] Generated F:\short\jenkins-maven-box-maven-archetype-buildfix-6@tmp\withMavenf290eb2b\maven-spy-20190728-021234-8572812415616368192359.log
Picked up JAVA_TOOL_OPTIONS: -Dmaven.ext.class.path="F:\short\jenkins-maven-box-maven-archetype-buildfix-6@tmp\withMavenf290eb2b\pipeline-maven-spy.jar" -Dorg.jenkinsci.plugins.pipeline.maven.reportsFolder="F:\short\jenkins-maven-box-maven-archetype-buildfix-6@tmp\withMavenf290eb2b"
[Pipeline] }
[Pipeline] // dir
[Pipeline] }
[withMaven] artifactsPublisher - Archive artifact j7m3.5.xb\pom.xml under org\apache\maven\archetype\maven-archetype\3.1.2-SNAPSHOT\maven-archetype-3.1.2-SNAPSHOT.pom
[withMaven] artifactsPublisher - Archive artifact j7m3.5.xb\target\maven-archetype-3.1.2-SNAPSHOT-site.xml under org\apache\maven\archetype\maven-archetype\3.1.2-SNAPSHOT\maven-archetype-3.1.2-SNAPSHOT-site.xml
[withMaven] artifactsPublisher - Archive artifact j7m3.5.xb\archetype-models\pom.xml under org\apache\maven\archetype\archetype-models\3.1.2-SNAPSHOT\archetype-models-3.1.2-SNAPSHOT.pom
[withMaven] artifactsPublisher - Archive artifact j7m3.5.xb\archetype-models\target\archetype-models-3.1.2-SNAPSHOT-site.xml under org\apache\maven\archetype\archetype-models\3.1.2-SNAPSHOT\archetype-models-3.1.2-SNAPSHOT-site.xml
[withMaven] artifactsPublisher - Archive artifact j7m3.5.xb\archetype-models\archetype-catalog\pom.xml under org\apache\maven\archetype\archetype-catalog\3.1.2-SNAPSHOT\archetype-catalog-3.1.2-SNAPSHOT.pom
[withMaven] artifactsPublisher - Archive artifact j7m3.5.xb\archetype-models\archetype-catalog\target\archetype-catalog-3.1.2-SNAPSHOT.jar under org\apache\maven\archetype\archetype-catalog\3.1.2-SNAPSHOT\archetype-catalog-3.1.2-SNAPSHOT.jar
[withMaven] artifactsPublisher - Archive artifact j7m3.5.xb\archetype-models\archetype-descriptor\pom.xml under org\apache\maven\archetype\archetype-descriptor\3.1.2-SNAPSHOT\archetype-descriptor-3.1.2-SNAPSHOT.pom
[withMaven] artifactsPublisher - Archive artifact j7m3.5.xb\archetype-models\archetype-descriptor\target\archetype-descriptor-3.1.2-SNAPSHOT.jar under org\apache\maven\archetype\archetype-descriptor\3.1.2-SNAPSHOT\archetype-descriptor-3.1.2-SNAPSHOT.jar
[withMaven] artifactsPublisher - Archive artifact j7m3.5.xb\archetype-common\pom.xml under org\apache\maven\archetype\archetype-common\3.1.2-SNAPSHOT\archetype-common-3.1.2-SNAPSHOT.pom
[withMaven] artifactsPublisher - Archive artifact j7m3.5.xb\archetype-common\target\archetype-common-3.1.2-SNAPSHOT.jar under org\apache\maven\archetype\archetype-common\3.1.2-SNAPSHOT\archetype-common-3.1.2-SNAPSHOT.jar
[withMaven] artifactsPublisher - Archive artifact j7m3.5.xb\archetype-packaging\pom.xml under org\apache\maven\archetype\archetype-packaging\3.1.2-SNAPSHOT\archetype-packaging-3.1.2-SNAPSHOT.pom
[withMaven] artifactsPublisher - Archive artifact j7m3.5.xb\archetype-packaging\target\archetype-packaging-3.1.2-SNAPSHOT.jar under org\apache\maven\archetype\archetype-packaging\3.1.2-SNAPSHOT\archetype-packaging-3.1.2-SNAPSHOT.jar
[withMaven] artifactsPublisher - Archive artifact j7m3.5.xb\maven-archetype-plugin\pom.xml under org\apache\maven\plugins\maven-archetype-plugin\3.1.2-SNAPSHOT\maven-archetype-plugin-3.1.2-SNAPSHOT.pom
[withMaven] artifactsPublisher - Archive artifact j7m3.5.xb\maven-archetype-plugin\target\maven-archetype-plugin-3.1.2-SNAPSHOT.jar under org\apache\maven\plugins\maven-archetype-plugin\3.1.2-SNAPSHOT\maven-archetype-plugin-3.1.2-SNAPSHOT.jar
[Fast Archiver] No prior successful build to compare, so performing full copy of artifacts
[withMaven] junitPublisher - Archive test results for Maven artifact org.apache.maven.archetype:archetype-catalog:jar:3.1.2-SNAPSHOT generated by maven-surefire-plugin:test (default-test): j7m3.5.xb\archetype-models\archetype-catalog\target\surefire-reports\*.xml
[withMaven] junitPublisher - Archive test results for Maven artifact org.apache.maven.archetype:archetype-descriptor:jar:3.1.2-SNAPSHOT generated by maven-surefire-plugin:test (default-test): j7m3.5.xb\archetype-models\archetype-descriptor\target\surefire-reports\*.xml
[withMaven] junitPublisher - Archive test results for Maven artifact org.apache.maven.archetype:archetype-common:jar:3.1.2-SNAPSHOT generated by maven-surefire-plugin:test (default-test): j7m3.5.xb\archetype-common\target\surefire-reports\*.xml
[withMaven] junitPublisher - Archive test results for Maven artifact org.apache.maven.archetype:archetype-packaging:jar:3.1.2-SNAPSHOT generated by maven-surefire-plugin:test (default-test): j7m3.5.xb\archetype-packaging\target\surefire-reports\*.xml
[withMaven] junitPublisher - Archive test results for Maven artifact org.apache.maven.plugins:maven-archetype-plugin:maven-plugin:3.1.2-SNAPSHOT generated by maven-surefire-plugin:test (default-test): j7m3.5.xb\maven-archetype-plugin\target\surefire-reports\*.xml
Recording test results
[withMaven] openTasksPublisher - Scan Tasks for Maven artifact org.apache.maven.archetype:archetype-common:jar:3.1.2-SNAPSHOT in source directory j7m3.5.xb\archetype-common\src\main\java
[withMaven] openTasksPublisher - Scan Tasks for Maven artifact org.apache.maven.plugins:maven-archetype-plugin:maven-plugin:3.1.2-SNAPSHOT in source directory j7m3.5.xb\maven-archetype-plugin\src\main\java
[TASKS] Scanning folder 'F:\short\jenkins-maven-box-maven-archetype-buildfix-6' for files matching the pattern 'j7m3.5.xb\archetype-common\src\main\java\**\*,j7m3.5.xb\maven-archetype-plugin\src\main\java\**\*' - excludes: null
[TASKS] Found 89 files to scan for tasks
[TASKS] Found 26 open tasks.
Skipping warnings blame since pipelines do not have an SCM link.%n
[withMaven] invokerPublisher - Archive invoker results for Maven artifact MavenArtifact{org.apache.maven.plugins:maven-archetype-plugin:maven-plugin:3.1.2-SNAPSHOT(version: 3.1.2-SNAPSHOT, snapshot:false) } generated by PluginInvocation{org.apache.maven.plugins:maven-invoker-plugin:3.1.0@run  integration-test}: j7m3.5.xb\maven-archetype-plugin\target\invoker-reports\*.xml
[withMaven] Publishers: Generated Artifacts Publisher: 313 ms, Junit Publisher: 313 ms, Open Task Scanner Publisher: 299 ms, Dependencies Fingerprint Publisher: 63 ms, Invoker Publisher: 17571 ms, Pipeline Graph Publisher: 25 ms
[Pipeline] // withMaven
[Pipeline] cleanWs
[WS-CLEANUP] Deleting project workspace...
[WS-CLEANUP] Deferred wipeout is used...
[WS-CLEANUP] done
[Pipeline] }
[Pipeline] // stage
[Pipeline] }
[Pipeline] // ws
[Pipeline] }
[Pipeline] // node
[Pipeline] }
[INFO] run post-build script verify.groovy
[INFO]           roundtrip-1-project .............................. SUCCESS (17.7 s)
[INFO] Building: roundtrip-multi\pom.xml
[INFO] run post-build script verify.groovy
[INFO]           roundtrip-multi\pom.xml .......................... SUCCESS (17.9 s)
[INFO] -------------------------------------------------
[INFO] Build Summary:
[INFO]   Passed: 25, Failed: 0, Errors: 0, Skipped: 0
[INFO] -------------------------------------------------
[INFO]
[INFO] --- mrm-maven-plugin:1.1.0:stop (mirror) @ maven-archetype-plugin ---
[INFO] Stopping Mock Repository Manager on http://localhost:50389
[INFO] Stopped SocketConnector@0.0.0.0:50389
[INFO] Mock Repository Manager http://localhost:50389 is stopped.
[INFO]
[INFO] --- mrm-maven-plugin:1.1.0:stop (archetype-repository) @ maven-archetype-plugin ---
[INFO] Stopping Mock Repository Manager on http://localhost:50390
[INFO] Stopped SocketConnector@0.0.0.0:50390
[INFO] Mock Repository Manager http://localhost:50390 is stopped.
[INFO]
[INFO] --- maven-checkstyle-plugin:3.0.0:check (checkstyle-check) @ maven-archetype-plugin ---
[INFO] There are 46 errors reported by Checkstyle 6.18 with config/maven_checks.xml ruleset.
[INFO] Ignored 46 errors, 0 violation remaining.
[INFO] ------------------------------------------------------------------------
[INFO] Reactor Summary:
[INFO]
[INFO] Maven Archetype .................................... SUCCESS [  5.152 s]
[INFO] Maven Archetype Models ............................. SUCCESS [  0.541 s]
[INFO] Maven Archetype Catalog Model ...................... SUCCESS [  3.052 s]
[INFO] Maven Archetype Descriptor Model ................... SUCCESS [  1.450 s]
[INFO] Maven Archetype Common ............................. SUCCESS [ 24.955 s]
[INFO] Maven Archetype Packaging .......................... SUCCESS [  0.563 s]
[INFO] Maven Archetype Plugin ............................. SUCCESS [05:14 min]
[INFO] ------------------------------------------------------------------------
[INFO] BUILD SUCCESS
[INFO] ------------------------------------------------------------------------
[INFO] Total time: 05:50 min
[INFO] Finished at: 2019-07-28T02:18:25-07:00
[INFO] Final Memory: 71M/1056M
[INFO] ------------------------------------------------------------------------
[INFO] [jenkins-event-spy] Generated F:\short\jenkins-maven-box-maven-archetype-buildfix-6@tmp\withMavencefa8ce4\maven-spy-20190728-021234-9753541061625525611175.log
Picked up JAVA_TOOL_OPTIONS: -Dmaven.ext.class.path="F:\short\jenkins-maven-box-maven-archetype-buildfix-6@tmp\withMavencefa8ce4\pipeline-maven-spy.jar" -Dorg.jenkinsci.plugins.pipeline.maven.reportsFolder="F:\short\jenkins-maven-box-maven-archetype-buildfix-6@tmp\withMavencefa8ce4"
[Pipeline] }
[Pipeline] // dir
[Pipeline] }
[withMaven] artifactsPublisher - Archive artifact j7m3.3.xb\pom.xml under org\apache\maven\archetype\maven-archetype\3.1.2-SNAPSHOT\maven-archetype-3.1.2-SNAPSHOT.pom
[withMaven] artifactsPublisher - Archive artifact j7m3.3.xb\target\maven-archetype-3.1.2-SNAPSHOT-site.xml under org\apache\maven\archetype\maven-archetype\3.1.2-SNAPSHOT\maven-archetype-3.1.2-SNAPSHOT-site.xml
[withMaven] artifactsPublisher - Archive artifact j7m3.3.xb\archetype-models\pom.xml under org\apache\maven\archetype\archetype-models\3.1.2-SNAPSHOT\archetype-models-3.1.2-SNAPSHOT.pom
[withMaven] artifactsPublisher - Archive artifact j7m3.3.xb\archetype-models\target\archetype-models-3.1.2-SNAPSHOT-site.xml under org\apache\maven\archetype\archetype-models\3.1.2-SNAPSHOT\archetype-models-3.1.2-SNAPSHOT-site.xml
[withMaven] artifactsPublisher - Archive artifact j7m3.3.xb\archetype-models\archetype-catalog\pom.xml under org\apache\maven\archetype\archetype-catalog\3.1.2-SNAPSHOT\archetype-catalog-3.1.2-SNAPSHOT.pom
[withMaven] artifactsPublisher - Archive artifact j7m3.3.xb\archetype-models\archetype-catalog\target\archetype-catalog-3.1.2-SNAPSHOT.jar under org\apache\maven\archetype\archetype-catalog\3.1.2-SNAPSHOT\archetype-catalog-3.1.2-SNAPSHOT.jar
[withMaven] artifactsPublisher - Archive artifact j7m3.3.xb\archetype-models\archetype-descriptor\pom.xml under org\apache\maven\archetype\archetype-descriptor\3.1.2-SNAPSHOT\archetype-descriptor-3.1.2-SNAPSHOT.pom
[withMaven] artifactsPublisher - Archive artifact j7m3.3.xb\archetype-models\archetype-descriptor\target\archetype-descriptor-3.1.2-SNAPSHOT.jar under org\apache\maven\archetype\archetype-descriptor\3.1.2-SNAPSHOT\archetype-descriptor-3.1.2-SNAPSHOT.jar
[withMaven] artifactsPublisher - Archive artifact j7m3.3.xb\archetype-common\pom.xml under org\apache\maven\archetype\archetype-common\3.1.2-SNAPSHOT\archetype-common-3.1.2-SNAPSHOT.pom
[withMaven] artifactsPublisher - Archive artifact j7m3.3.xb\archetype-common\target\archetype-common-3.1.2-SNAPSHOT.jar under org\apache\maven\archetype\archetype-common\3.1.2-SNAPSHOT\archetype-common-3.1.2-SNAPSHOT.jar
[withMaven] artifactsPublisher - Archive artifact j7m3.3.xb\archetype-packaging\pom.xml under org\apache\maven\archetype\archetype-packaging\3.1.2-SNAPSHOT\archetype-packaging-3.1.2-SNAPSHOT.pom
[withMaven] artifactsPublisher - Archive artifact j7m3.3.xb\archetype-packaging\target\archetype-packaging-3.1.2-SNAPSHOT.jar under org\apache\maven\archetype\archetype-packaging\3.1.2-SNAPSHOT\archetype-packaging-3.1.2-SNAPSHOT.jar
[withMaven] artifactsPublisher - Archive artifact j7m3.3.xb\maven-archetype-plugin\pom.xml under org\apache\maven\plugins\maven-archetype-plugin\3.1.2-SNAPSHOT\maven-archetype-plugin-3.1.2-SNAPSHOT.pom
[withMaven] artifactsPublisher - Archive artifact j7m3.3.xb\maven-archetype-plugin\target\maven-archetype-plugin-3.1.2-SNAPSHOT.jar under org\apache\maven\plugins\maven-archetype-plugin\3.1.2-SNAPSHOT\maven-archetype-plugin-3.1.2-SNAPSHOT.jar
[Fast Archiver] No prior successful build to compare, so performing full copy of artifacts
[withMaven] junitPublisher - Archive test results for Maven artifact org.apache.maven.archetype:archetype-catalog:jar:3.1.2-SNAPSHOT generated by maven-surefire-plugin:test (default-test): j7m3.3.xb\archetype-models\archetype-catalog\target\surefire-reports\*.xml
[withMaven] junitPublisher - Archive test results for Maven artifact org.apache.maven.archetype:archetype-descriptor:jar:3.1.2-SNAPSHOT generated by maven-surefire-plugin:test (default-test): j7m3.3.xb\archetype-models\archetype-descriptor\target\surefire-reports\*.xml
[withMaven] junitPublisher - Archive test results for Maven artifact org.apache.maven.archetype:archetype-common:jar:3.1.2-SNAPSHOT generated by maven-surefire-plugin:test (default-test): j7m3.3.xb\archetype-common\target\surefire-reports\*.xml
[withMaven] junitPublisher - Archive test results for Maven artifact org.apache.maven.archetype:archetype-packaging:jar:3.1.2-SNAPSHOT generated by maven-surefire-plugin:test (default-test): j7m3.3.xb\archetype-packaging\target\surefire-reports\*.xml
[withMaven] junitPublisher - Archive test results for Maven artifact org.apache.maven.plugins:maven-archetype-plugin:maven-plugin:3.1.2-SNAPSHOT generated by maven-surefire-plugin:test (default-test): j7m3.3.xb\maven-archetype-plugin\target\surefire-reports\*.xml
Recording test results
[withMaven] openTasksPublisher - Scan Tasks for Maven artifact org.apache.maven.archetype:archetype-common:jar:3.1.2-SNAPSHOT in source directory j7m3.3.xb\archetype-common\src\main\java
[withMaven] openTasksPublisher - Scan Tasks for Maven artifact org.apache.maven.plugins:maven-archetype-plugin:maven-plugin:3.1.2-SNAPSHOT in source directory j7m3.3.xb\maven-archetype-plugin\src\main\java
[TASKS] Scanning folder 'F:\short\jenkins-maven-box-maven-archetype-buildfix-6' for files matching the pattern 'j7m3.3.xb\archetype-common\src\main\java\**\*,j7m3.3.xb\maven-archetype-plugin\src\main\java\**\*' - excludes: null
[TASKS] Found 89 files to scan for tasks
[TASKS] Found 26 open tasks.
Skipping warnings blame since pipelines do not have an SCM link.%n
[withMaven] invokerPublisher - Archive invoker results for Maven artifact MavenArtifact{org.apache.maven.plugins:maven-archetype-plugin:maven-plugin:3.1.2-SNAPSHOT(version: 3.1.2-SNAPSHOT, snapshot:false) } generated by PluginInvocation{org.apache.maven.plugins:maven-invoker-plugin:3.1.0@run  integration-test}: j7m3.3.xb\maven-archetype-plugin\target\invoker-reports\*.xml
[withMaven] Publishers: Generated Artifacts Publisher: 304 ms, Junit Publisher: 345 ms, Open Task Scanner Publisher: 322 ms, Dependencies Fingerprint Publisher: 67 ms, Invoker Publisher: 17554 ms, Pipeline Graph Publisher: 4 ms
[Pipeline] // withMaven
[Pipeline] cleanWs
[WS-CLEANUP] Deleting project workspace...
[WS-CLEANUP] Deferred wipeout is used...
[WS-CLEANUP] done
[Pipeline] }
[Pipeline] // stage
[Pipeline] }
[Pipeline] // ws
[Pipeline] }
[Pipeline] // node
[Pipeline] }
[INFO] run post-build script verify.groovy
[INFO]           roundtrip-multi\pom.xml .......................... SUCCESS (20.5 s)
[INFO] -------------------------------------------------
[INFO] Build Summary:
[INFO]   Passed: 25, Failed: 0, Errors: 0, Skipped: 0
[INFO] -------------------------------------------------
[INFO]
[INFO] --- mrm-maven-plugin:1.1.0:stop (mirror) @ maven-archetype-plugin ---
[INFO] Stopping Mock Repository Manager on http://localhost:50391
[INFO] Stopped SocketConnector@0.0.0.0:50391
[INFO] Mock Repository Manager http://localhost:50391 is stopped.
[INFO]
[INFO] --- mrm-maven-plugin:1.1.0:stop (archetype-repository) @ maven-archetype-plugin ---
[INFO] Stopping Mock Repository Manager on http://localhost:50392
[INFO] Stopped SocketConnector@0.0.0.0:50392
[INFO] Mock Repository Manager http://localhost:50392 is stopped.
[INFO]
[INFO] --- maven-checkstyle-plugin:3.0.0:check (checkstyle-check) @ maven-archetype-plugin ---
[INFO] There are 46 errors reported by Checkstyle 6.18 with config/maven_checks.xml ruleset.
[INFO] Ignored 46 errors, 0 violation remaining.
[INFO] ------------------------------------------------------------------------
[INFO] Reactor Summary for Maven Archetype 3.1.2-SNAPSHOT:
[INFO]
[INFO] Maven Archetype .................................... SUCCESS [  5.107 s]
[INFO] Maven Archetype Models ............................. SUCCESS [  0.453 s]
[INFO] Maven Archetype Catalog Model ...................... SUCCESS [  3.219 s]
[INFO] Maven Archetype Descriptor Model ................... SUCCESS [  1.307 s]
[INFO] Maven Archetype Common ............................. SUCCESS [ 24.742 s]
[INFO] Maven Archetype Packaging .......................... SUCCESS [  0.624 s]
[INFO] Maven Archetype Plugin ............................. SUCCESS [05:31 min]
[INFO] ------------------------------------------------------------------------
[INFO] BUILD SUCCESS
[INFO] ------------------------------------------------------------------------
[INFO] Total time:  06:07 min
[INFO] Finished at: 2019-07-28T02:18:42-07:00
[INFO] ------------------------------------------------------------------------
[INFO] [jenkins-event-spy] Generated F:\short\jenkins-maven-box-maven-archetype-buildfix-6@2@tmp\withMaven39cd6b15\maven-spy-20190728-021235-3398116162555447585396.log
Picked up JAVA_TOOL_OPTIONS: -Dmaven.ext.class.path="F:\short\jenkins-maven-box-maven-archetype-buildfix-6@2@tmp\withMaven39cd6b15\pipeline-maven-spy.jar" -Dorg.jenkinsci.plugins.pipeline.maven.reportsFolder="F:\short\jenkins-maven-box-maven-archetype-buildfix-6@2@tmp\withMaven39cd6b15"
[Pipeline] }
[Pipeline] // dir
[Pipeline] }
[withMaven] artifactsPublisher - Archive artifact j7m3.6.xb\pom.xml under org\apache\maven\archetype\maven-archetype\3.1.2-SNAPSHOT\maven-archetype-3.1.2-SNAPSHOT.pom
[withMaven] artifactsPublisher - Archive artifact j7m3.6.xb\target\maven-archetype-3.1.2-SNAPSHOT-site.xml under org\apache\maven\archetype\maven-archetype\3.1.2-SNAPSHOT\maven-archetype-3.1.2-SNAPSHOT-site.xml
[withMaven] artifactsPublisher - Archive artifact j7m3.6.xb\archetype-models\pom.xml under org\apache\maven\archetype\archetype-models\3.1.2-SNAPSHOT\archetype-models-3.1.2-SNAPSHOT.pom
[withMaven] artifactsPublisher - Archive artifact j7m3.6.xb\archetype-models\target\archetype-models-3.1.2-SNAPSHOT-site.xml under org\apache\maven\archetype\archetype-models\3.1.2-SNAPSHOT\archetype-models-3.1.2-SNAPSHOT-site.xml
[withMaven] artifactsPublisher - Archive artifact j7m3.6.xb\archetype-models\archetype-catalog\pom.xml under org\apache\maven\archetype\archetype-catalog\3.1.2-SNAPSHOT\archetype-catalog-3.1.2-SNAPSHOT.pom
[withMaven] artifactsPublisher - Archive artifact j7m3.6.xb\archetype-models\archetype-catalog\target\archetype-catalog-3.1.2-SNAPSHOT.jar under org\apache\maven\archetype\archetype-catalog\3.1.2-SNAPSHOT\archetype-catalog-3.1.2-SNAPSHOT.jar
[withMaven] artifactsPublisher - Archive artifact j7m3.6.xb\archetype-models\archetype-descriptor\pom.xml under org\apache\maven\archetype\archetype-descriptor\3.1.2-SNAPSHOT\archetype-descriptor-3.1.2-SNAPSHOT.pom
[withMaven] artifactsPublisher - Archive artifact j7m3.6.xb\archetype-models\archetype-descriptor\target\archetype-descriptor-3.1.2-SNAPSHOT.jar under org\apache\maven\archetype\archetype-descriptor\3.1.2-SNAPSHOT\archetype-descriptor-3.1.2-SNAPSHOT.jar
[withMaven] artifactsPublisher - Archive artifact j7m3.6.xb\archetype-common\pom.xml under org\apache\maven\archetype\archetype-common\3.1.2-SNAPSHOT\archetype-common-3.1.2-SNAPSHOT.pom
[withMaven] artifactsPublisher - Archive artifact j7m3.6.xb\archetype-common\target\archetype-common-3.1.2-SNAPSHOT.jar under org\apache\maven\archetype\archetype-common\3.1.2-SNAPSHOT\archetype-common-3.1.2-SNAPSHOT.jar
[withMaven] artifactsPublisher - Archive artifact j7m3.6.xb\archetype-packaging\pom.xml under org\apache\maven\archetype\archetype-packaging\3.1.2-SNAPSHOT\archetype-packaging-3.1.2-SNAPSHOT.pom
[withMaven] artifactsPublisher - Archive artifact j7m3.6.xb\archetype-packaging\target\archetype-packaging-3.1.2-SNAPSHOT.jar under org\apache\maven\archetype\archetype-packaging\3.1.2-SNAPSHOT\archetype-packaging-3.1.2-SNAPSHOT.jar
[withMaven] artifactsPublisher - Archive artifact j7m3.6.xb\maven-archetype-plugin\pom.xml under org\apache\maven\plugins\maven-archetype-plugin\3.1.2-SNAPSHOT\maven-archetype-plugin-3.1.2-SNAPSHOT.pom
[withMaven] artifactsPublisher - Archive artifact j7m3.6.xb\maven-archetype-plugin\target\maven-archetype-plugin-3.1.2-SNAPSHOT.jar under org\apache\maven\plugins\maven-archetype-plugin\3.1.2-SNAPSHOT\maven-archetype-plugin-3.1.2-SNAPSHOT.jar
[Fast Archiver] No prior successful build to compare, so performing full copy of artifacts
[withMaven] junitPublisher - Archive test results for Maven artifact org.apache.maven.archetype:archetype-catalog:jar:3.1.2-SNAPSHOT generated by maven-surefire-plugin:test (default-test): j7m3.6.xb\archetype-models\archetype-catalog\target\surefire-reports\*.xml
[withMaven] junitPublisher - Archive test results for Maven artifact org.apache.maven.archetype:archetype-descriptor:jar:3.1.2-SNAPSHOT generated by maven-surefire-plugin:test (default-test): j7m3.6.xb\archetype-models\archetype-descriptor\target\surefire-reports\*.xml
[withMaven] junitPublisher - Archive test results for Maven artifact org.apache.maven.archetype:archetype-common:jar:3.1.2-SNAPSHOT generated by maven-surefire-plugin:test (default-test): j7m3.6.xb\archetype-common\target\surefire-reports\*.xml
[withMaven] junitPublisher - Archive test results for Maven artifact org.apache.maven.archetype:archetype-packaging:jar:3.1.2-SNAPSHOT generated by maven-surefire-plugin:test (default-test): j7m3.6.xb\archetype-packaging\target\surefire-reports\*.xml
[withMaven] junitPublisher - Archive test results for Maven artifact org.apache.maven.plugins:maven-archetype-plugin:maven-plugin:3.1.2-SNAPSHOT generated by maven-surefire-plugin:test (default-test): j7m3.6.xb\maven-archetype-plugin\target\surefire-reports\*.xml
Recording test results
[withMaven] openTasksPublisher - Scan Tasks for Maven artifact org.apache.maven.archetype:archetype-common:jar:3.1.2-SNAPSHOT in source directory j7m3.6.xb\archetype-common\src\main\java
[withMaven] openTasksPublisher - Scan Tasks for Maven artifact org.apache.maven.plugins:maven-archetype-plugin:maven-plugin:3.1.2-SNAPSHOT in source directory j7m3.6.xb\maven-archetype-plugin\src\main\java
[TASKS] Scanning folder 'F:\short\jenkins-maven-box-maven-archetype-buildfix-6@2' for files matching the pattern 'j7m3.6.xb\archetype-common\src\main\java\**\*,j7m3.6.xb\maven-archetype-plugin\src\main\java\**\*' - excludes: null
[TASKS] Found 89 files to scan for tasks
[TASKS] Found 26 open tasks.
Skipping warnings blame since pipelines do not have an SCM link.%n
[withMaven] invokerPublisher - Archive invoker results for Maven artifact MavenArtifact{org.apache.maven.plugins:maven-archetype-plugin:maven-plugin:3.1.2-SNAPSHOT(version: 3.1.2-SNAPSHOT, snapshot:false) } generated by PluginInvocation{org.apache.maven.plugins:maven-invoker-plugin:3.1.0@run  integration-test}: j7m3.6.xb\maven-archetype-plugin\target\invoker-reports\*.xml
[withMaven] Publishers: Generated Artifacts Publisher: 236 ms, Junit Publisher: 421 ms, Open Task Scanner Publisher: 285 ms, Dependencies Fingerprint Publisher: 60 ms, Invoker Publisher: 18077 ms, Pipeline Graph Publisher: 23 ms
[Pipeline] // withMaven
[Pipeline] cleanWs
[WS-CLEANUP] Deleting project workspace...
[WS-CLEANUP] Deferred wipeout is used...
[WS-CLEANUP] done
[Pipeline] }
[Pipeline] // stage
[Pipeline] }
[Pipeline] // ws
[Pipeline] }
[Pipeline] // node
[Pipeline] }
[withMaven] Publishers: Generated Artifacts Publisher: 267 ms, Junit Publisher: 331 ms, Open Task Scanner Publisher: 288 ms, Dependencies Fingerprint Publisher: 62 ms, Invoker Publisher: 16768 ms, Pipeline Graph Publisher: 2 ms
[Pipeline] // withMaven
[Pipeline] cleanWs
[WS-CLEANUP] Deleting project workspace...
[WS-CLEANUP] Deferred wipeout is used...
[WS-CLEANUP] done
[Pipeline] }
[Pipeline] // stage
[Pipeline] }
[Pipeline] // ws
[Pipeline] }
[Pipeline] // node
[Pipeline] }
[Pipeline] // parallel
[Pipeline] stage
[Pipeline] { (Notifications)
[Pipeline] echo
Build result: FAILURE
[Pipeline] jiraIssueSelector
[Pipeline] emailext
Reply | Threaded
Open this post in threaded view
|

Build succeeded in Jenkins: Maven TLP » maven-archetype » buildfix #7

Apache Jenkins Server-2
See https://builds.apache.org/job/maven-box/job/maven-archetype/job/buildfix/7/

Changes:

* stop avoiding nodes with MAVEN_OPTS issue
* sh 'df -hT'

All tests passed