Build failed in Jenkins: Maven TLP » maven-antrun-plugin » master #5

classic Classic list List threaded Threaded
2 messages Options
Reply | Threaded
Open this post in threaded view
|

Build failed in Jenkins: Maven TLP » maven-antrun-plugin » master #5

Apache Jenkins Server-2
See https://builds.apache.org/job/maven-box/job/maven-antrun-plugin/job/master/5/

Changes:

* [MANTRUN-211] - Upgrade mave-surefire/failsafe-plugin 2.21.0
* [MANTRUN-211] - Upgrade mave-surefire/failsafe-plugin 2.21.0
* [MANTRUN-211] - Upgrade mave-surefire/failsafe-plugin 2.21.0
* [MANTRUN-211] - Upgrade mave-surefire/failsafe-plugin 2.21.0
* [MANTRUN-211] - Upgrade mave-surefire/failsafe-plugin 2.21.0
* [MANTRUN-211] - Upgrade mave-surefire/failsafe-plugin 2.21.0
* [MANTRUN-211] - Upgrade mave-surefire/failsafe-plugin 2.21.0

No tests ran.

Build log:
[...truncated 182.15 KB...]
[windows-jdk10] [INFO] Downloading: https://repo.maven.apache.org/maven2/org/ow2/asm/asm-parent/6.0_BETA/asm-parent-6.0_BETA.pom
[windows-jdk10] [INFO] Downloaded: https://repo.maven.apache.org/maven2/org/ow2/asm/asm-parent/6.0_BETA/asm-parent-6.0_BETA.pom (5.5 kB at 323 kB/s)
[windows-jdk10] [INFO] Downloading: https://repo.maven.apache.org/maven2/com/thoughtworks/qdox/qdox/2.0-M7/qdox-2.0-M7.pom
[windows-jdk10] [INFO] Downloaded: https://repo.maven.apache.org/maven2/com/thoughtworks/qdox/qdox/2.0-M7/qdox-2.0-M7.pom (16 kB at 1.3 MB/s)
[windows-jdk10] [INFO] Downloading: https://repo.maven.apache.org/maven2/org/sonatype/oss/oss-parent/9/oss-parent-9.pom
[windows-jdk10] [INFO] Downloaded: https://repo.maven.apache.org/maven2/org/sonatype/oss/oss-parent/9/oss-parent-9.pom (6.6 kB at 821 kB/s)
[windows-jdk10] [INFO] Downloading: https://repo.maven.apache.org/maven2/org/apache/maven/surefire/maven-surefire-common/2.21.0/maven-surefire-common-2.21.0.jar
[windows-jdk10] [INFO] Downloading: https://repo.maven.apache.org/maven2/org/apache/maven/surefire/surefire-api/2.21.0/surefire-api-2.21.0.jar
[windows-jdk10] [INFO] Downloading: https://repo.maven.apache.org/maven2/org/apache/maven/surefire/surefire-logger-api/2.21.0/surefire-logger-api-2.21.0.jar
[windows-jdk10] [INFO] Downloading: https://repo.maven.apache.org/maven2/org/apache/maven/plugin-tools/maven-plugin-annotations/3.5/maven-plugin-annotations-3.5.jar
[windows-jdk10] [INFO] Downloading: https://repo.maven.apache.org/maven2/org/apache/maven/surefire/surefire-booter/2.21.0/surefire-booter-2.21.0.jar
[windows-jdk10] [INFO] Downloaded: https://repo.maven.apache.org/maven2/org/apache/maven/surefire/surefire-api/2.21.0/surefire-api-2.21.0.jar (185 kB at 3.8 MB/s)
[windows-jdk10] [INFO] Downloading: https://repo.maven.apache.org/maven2/org/codehaus/plexus/plexus-java/0.9.3/plexus-java-0.9.3.jar
[windows-jdk10] [INFO] Downloaded: https://repo.maven.apache.org/maven2/org/apache/maven/plugin-tools/maven-plugin-annotations/3.5/maven-plugin-annotations-3.5.jar (14 kB at 163 kB/s)
[windows-jdk10] [INFO] Downloading: https://repo.maven.apache.org/maven2/org/ow2/asm/asm/6.0_BETA/asm-6.0_BETA.jar
[windows-jdk10] [INFO] Downloaded: https://repo.maven.apache.org/maven2/org/apache/maven/surefire/surefire-logger-api/2.21.0/surefire-logger-api-2.21.0.jar (13 kB at 151 kB/s)
[windows-jdk10] [INFO] Downloading: https://repo.maven.apache.org/maven2/com/thoughtworks/qdox/qdox/2.0-M7/qdox-2.0-M7.jar
[windows-jdk10] [INFO] Downloaded: https://repo.maven.apache.org/maven2/org/apache/maven/surefire/surefire-booter/2.21.0/surefire-booter-2.21.0.jar (273 kB at 3.0 MB/s)
[windows-jdk10] [INFO] Downloaded: https://repo.maven.apache.org/maven2/org/codehaus/plexus/plexus-java/0.9.3/plexus-java-0.9.3.jar (32 kB at 314 kB/s)
[windows-jdk10] [INFO] Downloaded: https://repo.maven.apache.org/maven2/org/ow2/asm/asm/6.0_BETA/asm-6.0_BETA.jar (56 kB at 491 kB/s)
[windows-jdk10] [INFO] Downloaded: https://repo.maven.apache.org/maven2/com/thoughtworks/qdox/qdox/2.0-M7/qdox-2.0-M7.jar (315 kB at 2.3 MB/s)
[windows-jdk10] [INFO] Downloaded: https://repo.maven.apache.org/maven2/org/apache/maven/surefire/maven-surefire-common/2.21.0/maven-surefire-common-2.21.0.jar (521 kB at 2.6 MB/s)
[windows-jdk10] [INFO] Downloading: https://repo.maven.apache.org/maven2/org/apache/maven/surefire/surefire-junit4/2.21.0/surefire-junit4-2.21.0.pom
[windows-jdk10] [INFO] Downloaded: https://repo.maven.apache.org/maven2/org/apache/maven/surefire/surefire-junit4/2.21.0/surefire-junit4-2.21.0.pom (3.1 kB at 134 kB/s)
[windows-jdk10] [INFO] Downloading: https://repo.maven.apache.org/maven2/org/apache/maven/surefire/surefire-providers/2.21.0/surefire-providers-2.21.0.pom
[windows-jdk10] [INFO] Downloaded: https://repo.maven.apache.org/maven2/org/apache/maven/surefire/surefire-providers/2.21.0/surefire-providers-2.21.0.pom (2.5 kB at 228 kB/s)
[windows-jdk10] [INFO] Downloading: https://repo.maven.apache.org/maven2/org/apache/maven/surefire/surefire-junit4/2.21.0/surefire-junit4-2.21.0.jar
[windows-jdk10] [INFO] Downloaded: https://repo.maven.apache.org/maven2/org/apache/maven/surefire/surefire-junit4/2.21.0/surefire-junit4-2.21.0.jar (85 kB at 2.4 MB/s)
[windows-jdk10] [INFO]
[windows-jdk10] [INFO] -------------------------------------------------------
[windows-jdk10] [INFO]  T E S T S
[windows-jdk10] [INFO] -------------------------------------------------------
[windows-jdk10] [INFO] Running org.apache.maven.plugins.antrun.AntrunXmlPlexusConfigurationWriterTest
[windows-jdk10] [INFO] Tests run: 4, Failures: 0, Errors: 0, Skipped: 0, Time elapsed: 0.319 s - in org.apache.maven.plugins.antrun.AntrunXmlPlexusConfigurationWriterTest
[windows-jdk10] [INFO]
[windows-jdk10] [INFO] Results:
[windows-jdk10] [INFO]
[windows-jdk10] [INFO] Tests run: 4, Failures: 0, Errors: 0, Skipped: 0
[windows-jdk10] [INFO]
[windows-jdk10] [INFO]
[windows-jdk10] [INFO] --- maven-jar-plugin:3.0.0:jar (default-jar) @ maven-antrun-plugin ---
[windows-jdk10] [INFO] Building jar: f:\jenkins\jenkins-slave\workspace\_maven-antrun-plugin_master-CX6PL5TIAWPNVJSC4QU4IGQ7WMNWMQK2YZWFGHUUPG3ESUEOLMGA\m\target\maven-antrun-plugin-3.0.0-SNAPSHOT.jar
[windows-jdk10] [INFO]
[windows-jdk10] [INFO] --- maven-plugin-plugin:3.4:addPluginArtifactMetadata (default-addPluginArtifactMetadata) @ maven-antrun-plugin ---
[windows-jdk10] [INFO]
[windows-jdk10] [INFO] --- maven-site-plugin:3.5.1:attach-descriptor (attach-descriptor) @ maven-antrun-plugin ---
[windows-jdk10] [INFO]
[windows-jdk10] [INFO] --- maven-invoker-plugin:2.0.0:install (integration-test) @ maven-antrun-plugin ---
[windows-jdk7] [INFO] run script verify.bsh
[windows-jdk7] [INFO] ..SUCCESS (10.2 s)
[windows-jdk7] [INFO] Building: antrun-default-test\pom.xml
[windows-jdk10] [INFO] Installing f:\jenkins\jenkins-slave\workspace\_maven-antrun-plugin_master-CX6PL5TIAWPNVJSC4QU4IGQ7WMNWMQK2YZWFGHUUPG3ESUEOLMGA\m\pom.xml to f:\jenkins\jenkins-slave\workspace\_maven-antrun-plugin_master-CX6PL5TIAWPNVJSC4QU4IGQ7WMNWMQK2YZWFGHUUPG3ESUEOLMGA\m\target\local-repo\org\apache\maven\plugins\maven-antrun-plugin\3.0.0-SNAPSHOT\maven-antrun-plugin-3.0.0-SNAPSHOT.pom
[windows-jdk10] [INFO] Installing f:\jenkins\jenkins-slave\workspace\_maven-antrun-plugin_master-CX6PL5TIAWPNVJSC4QU4IGQ7WMNWMQK2YZWFGHUUPG3ESUEOLMGA\m\target\maven-antrun-plugin-3.0.0-SNAPSHOT.jar to f:\jenkins\jenkins-slave\workspace\_maven-antrun-plugin_master-CX6PL5TIAWPNVJSC4QU4IGQ7WMNWMQK2YZWFGHUUPG3ESUEOLMGA\m\target\local-repo\org\apache\maven\plugins\maven-antrun-plugin\3.0.0-SNAPSHOT\maven-antrun-plugin-3.0.0-SNAPSHOT.jar
[windows-jdk10] [INFO]
[windows-jdk10] [INFO] --- maven-invoker-plugin:2.0.0:integration-test (integration-test) @ maven-antrun-plugin ---
[windows-jdk10] [INFO] Building: ant-1.7-features\pom.xml
[windows-jdk8] [INFO] run script verify.bsh
[windows-jdk8] [INFO] ..SUCCESS (8.8 s)
[windows-jdk8] [INFO] Building: antrun-default-test\pom.xml
[windows-jdk7] [INFO] run script verify.bsh
[windows-jdk7] [INFO] ..SUCCESS (2.4 s)
[windows-jdk7] [INFO] Building: attach-artifact-from-ant-task\pom.xml
[linux-jdk10] Cannot contact H34: java.lang.InterruptedException
[linux-jdk10] After 10s process did not stop
[windows-jdk8] [INFO] run script verify.bsh
[windows-jdk8] [INFO] ..SUCCESS (4.4 s)
[windows-jdk8] [INFO] Building: attach-artifact-from-ant-task\pom.xml
[windows-jdk7] [INFO] run script verify.bsh
[windows-jdk7] [INFO] ..SUCCESS (3.8 s)
[windows-jdk7] [INFO] Building: attach-artifact-test\pom.xml
[windows-jdk7] [INFO] run script verify.bsh
[windows-jdk7] [INFO] ..SUCCESS (2.6 s)
[windows-jdk7] [INFO] Building: attach-artifact-test-with-prefix\pom.xml
[windows-jdk7] Sending interrupt signal to process
[windows-jdk10] [INFO] run script verify.bsh
[windows-jdk10] [INFO] ..SUCCESS (8.7 s)
[windows-jdk10] [INFO] Building: antrun-default-test\pom.xml
[linux-jdk10] [INFO]
[linux-jdk10] [INFO] ------------------------------------------------------------------------
[linux-jdk10] [INFO] Building Apache Maven AntRun Plugin 3.0.0-SNAPSHOT
[linux-jdk10] [INFO] ------------------------------------------------------------------------
[linux-jdk10] [INFO] Downloading from central: https://repo.maven.apache.org/maven2/org/apache/maven/plugins/maven-remote-resources-plugin/1.5/maven-remote-resources-plugin-1.5.pom
[linux-jdk10] [INFO] Downloaded from central: https://repo.maven.apache.org/maven2/org/apache/maven/plugins/maven-remote-resources-plugin/1.5/maven-remote-resources-plugin-1.5.pom (13 kB at 703 kB/s)
[linux-jdk10] [INFO] Downloading from central: https://repo.maven.apache.org/maven2/org/apache/maven/plugins/maven-plugins/24/maven-plugins-24.pom
[linux-jdk10] [INFO] Downloaded from central: https://repo.maven.apache.org/maven2/org/apache/maven/plugins/maven-plugins/24/maven-plugins-24.pom (11 kB at 540 kB/s)
[linux-jdk10] [INFO] Downloading from central: https://repo.maven.apache.org/maven2/org/apache/maven/maven-parent/23/maven-parent-23.pom
[linux-jdk10] [INFO] Downloaded from central: https://repo.maven.apache.org/maven2/org/apache/maven/maven-parent/23/maven-parent-23.pom (33 kB at 1.6 MB/s)
[linux-jdk10] [INFO] Downloading from central: https://repo.maven.apache.org/maven2/org/apache/apache/13/apache-13.pom
[linux-jdk10] [INFO] Downloaded from central: https://repo.maven.apache.org/maven2/org/apache/apache/13/apache-13.pom (14 kB at 699 kB/s)
[linux-jdk10] [INFO] Downloading from central: https://repo.maven.apache.org/maven2/org/apache/maven/plugins/maven-remote-resources-plugin/1.5/maven-remote-resources-plugin-1.5.jar
[linux-jdk10] [INFO] Downloaded from central: https://repo.maven.apache.org/maven2/org/apache/maven/plugins/maven-remote-resources-plugin/1.5/maven-remote-resources-plugin-1.5.jar (69 kB at 2.7 MB/s)
[linux-jdk10] [INFO] Downloading from central: https://repo.maven.apache.org/maven2/org/apache/maven/plugins/maven-site-plugin/3.5.1/maven-site-plugin-3.5.1.pom
[linux-jdk10] [INFO] Downloaded from central: https://repo.maven.apache.org/maven2/org/apache/maven/plugins/maven-site-plugin/3.5.1/maven-site-plugin-3.5.1.pom (18 kB at 945 kB/s)
[linux-jdk10] [INFO] Downloading from central: https://repo.maven.apache.org/maven2/org/apache/maven/plugins/maven-plugins/28/maven-plugins-28.pom
[linux-jdk10] [INFO] Downloaded from central: https://repo.maven.apache.org/maven2/org/apache/maven/plugins/maven-plugins/28/maven-plugins-28.pom (12 kB at 708 kB/s)
[linux-jdk10] [INFO] Downloading from central: https://repo.maven.apache.org/maven2/org/apache/maven/maven-parent/27/maven-parent-27.pom
[linux-jdk10] [INFO] Downloaded from central: https://repo.maven.apache.org/maven2/org/apache/maven/maven-parent/27/maven-parent-27.pom (41 kB at 1.9 MB/s)
[linux-jdk10] [INFO] Downloading from central: https://repo.maven.apache.org/maven2/org/apache/apache/17/apache-17.pom
[linux-jdk10] [INFO] Downloaded from central: https://repo.maven.apache.org/maven2/org/apache/apache/17/apache-17.pom (16 kB at 1.0 MB/s)
[linux-jdk10] [INFO] Downloading from central: https://repo.maven.apache.org/maven2/org/apache/maven/plugins/maven-site-plugin/3.5.1/maven-site-plugin-3.5.1.jar
[linux-jdk10] [INFO] Downloaded from central: https://repo.maven.apache.org/maven2/org/apache/maven/plugins/maven-site-plugin/3.5.1/maven-site-plugin-3.5.1.jar (132 kB at 4.0 MB/s)
[linux-jdk10] [INFO] Downloading from central: https://repo.maven.apache.org/maven2/org/apache/maven/plugins/maven-checkstyle-plugin/2.15/maven-checkstyle-plugin-2.15.pom
[linux-jdk10] [INFO] Downloaded from central: https://repo.maven.apache.org/maven2/org/apache/maven/plugins/maven-checkstyle-plugin/2.15/maven-checkstyle-plugin-2.15.pom (14 kB at 908 kB/s)
[linux-jdk10] [INFO] Downloading from central: https://repo.maven.apache.org/maven2/org/apache/maven/plugins/maven-plugins/27/maven-plugins-27.pom
[linux-jdk10] [INFO] Downloaded from central: https://repo.maven.apache.org/maven2/org/apache/maven/plugins/maven-plugins/27/maven-plugins-27.pom (11 kB at 812 kB/s)
[linux-jdk10] [INFO] Downloading from central: https://repo.maven.apache.org/maven2/org/apache/maven/maven-parent/26/maven-parent-26.pom
[linux-jdk10] [INFO] Downloaded from central: https://repo.maven.apache.org/maven2/org/apache/maven/maven-parent/26/maven-parent-26.pom (40 kB at 2.0 MB/s)
[linux-jdk10] [INFO] Downloading from central: https://repo.maven.apache.org/maven2/org/apache/apache/16/apache-16.pom
[linux-jdk10] [INFO] Downloaded from central: https://repo.maven.apache.org/maven2/org/apache/apache/16/apache-16.pom (15 kB at 1.0 MB/s)
[linux-jdk10] [INFO] Downloading from central: https://repo.maven.apache.org/maven2/org/apache/maven/plugins/maven-checkstyle-plugin/2.15/maven-checkstyle-plugin-2.15.jar
[linux-jdk10] [INFO] Downloaded from central: https://repo.maven.apache.org/maven2/org/apache/maven/plugins/maven-checkstyle-plugin/2.15/maven-checkstyle-plugin-2.15.jar (111 kB at 4.3 MB/s)
[linux-jdk10] [INFO] Downloading from central: https://repo.maven.apache.org/maven2/org/apache/maven/plugins/maven-plugin-plugin/3.4/maven-plugin-plugin-3.4.pom
[linux-jdk10] [INFO] Downloaded from central: https://repo.maven.apache.org/maven2/org/apache/maven/plugins/maven-plugin-plugin/3.4/maven-plugin-plugin-3.4.pom (14 kB at 812 kB/s)
[linux-jdk10] [INFO] Downloading from central: https://repo.maven.apache.org/maven2/org/apache/maven/plugin-tools/maven-plugin-tools/3.4/maven-plugin-tools-3.4.pom
[linux-jdk10] [INFO] Downloaded from central: https://repo.maven.apache.org/maven2/org/apache/maven/plugin-tools/maven-plugin-tools/3.4/maven-plugin-tools-3.4.pom (14 kB at 906 kB/s)
[linux-jdk10] [INFO] Downloading from central: https://repo.maven.apache.org/maven2/org/apache/maven/plugins/maven-plugin-plugin/3.4/maven-plugin-plugin-3.4.jar
[linux-jdk10] [INFO] Downloaded from central: https://repo.maven.apache.org/maven2/org/apache/maven/plugins/maven-plugin-plugin/3.4/maven-plugin-plugin-3.4.jar (50 kB at 2.4 MB/s)
[linux-jdk10] [INFO] Downloading from central: https://repo.maven.apache.org/maven2/org/apache/maven/plugins/maven-enforcer-plugin/1.4.1/maven-enforcer-plugin-1.4.1.pom
[linux-jdk10] [INFO] Downloaded from central: https://repo.maven.apache.org/maven2/org/apache/maven/plugins/maven-enforcer-plugin/1.4.1/maven-enforcer-plugin-1.4.1.pom (7.3 kB at 458 kB/s)
[linux-jdk10] [INFO] Downloading from central: https://repo.maven.apache.org/maven2/org/apache/maven/enforcer/enforcer/1.4.1/enforcer-1.4.1.pom
[linux-jdk10] [INFO] Downloaded from central: https://repo.maven.apache.org/maven2/org/apache/maven/enforcer/enforcer/1.4.1/enforcer-1.4.1.pom (7.2 kB at 480 kB/s)
[linux-jdk10] [INFO] Downloading from central: https://repo.maven.apache.org/maven2/org/apache/maven/plugins/maven-enforcer-plugin/1.4.1/maven-enforcer-plugin-1.4.1.jar
[linux-jdk10] [INFO] Downloaded from central: https://repo.maven.apache.org/maven2/org/apache/maven/plugins/maven-enforcer-plugin/1.4.1/maven-enforcer-plugin-1.4.1.jar (27 kB at 1.5 MB/s)
[linux-jdk10] [INFO] Downloading from central: https://repo.maven.apache.org/maven2/org/apache/rat/apache-rat-plugin/0.11/apache-rat-plugin-0.11.pom
[linux-jdk10] [INFO] Downloaded from central: https://repo.maven.apache.org/maven2/org/apache/rat/apache-rat-plugin/0.11/apache-rat-plugin-0.11.pom (9.4 kB at 523 kB/s)
[linux-jdk10] [INFO] Downloading from central: https://repo.maven.apache.org/maven2/org/apache/rat/apache-rat-project/0.11/apache-rat-project-0.11.pom
[linux-jdk10] [INFO] Downloaded from central: https://repo.maven.apache.org/maven2/org/apache/rat/apache-rat-project/0.11/apache-rat-project-0.11.pom (21 kB at 1.3 MB/s)
[linux-jdk10] [INFO] Downloading from central: https://repo.maven.apache.org/maven2/org/apache/apache/14/apache-14.pom
[linux-jdk10] [INFO] Downloaded from central: https://repo.maven.apache.org/maven2/org/apache/apache/14/apache-14.pom (15 kB at 979 kB/s)
[linux-jdk10] [INFO] Downloading from central: https://repo.maven.apache.org/maven2/org/apache/rat/apache-rat-plugin/0.11/apache-rat-plugin-0.11.jar
[linux-jdk10] [INFO] Downloaded from central: https://repo.maven.apache.org/maven2/org/apache/rat/apache-rat-plugin/0.11/apache-rat-plugin-0.11.jar (44 kB at 2.2 MB/s)
[linux-jdk10] [INFO] Downloading from central: https://repo.maven.apache.org/maven2/org/apache/maven/plugins/maven-invoker-plugin/2.0.0/maven-invoker-plugin-2.0.0.pom
[windows-jdk8] Sending interrupt signal to process
[windows-jdk8] [INFO] ..FAILED (5.8 s)
[windows-jdk8] [INFO]   The build exited with code -1. See f:\jenkins\jenkins-slave\workspace\_maven-antrun-plugin_master-CX6PL5TIAWPNVJSC4QU4IGQ7WMNWMQK2YZWFGHUUPG3ESUEOLMGA\m\target\it\attach-artifact-from-ant-task\build.log for details.
[windows-jdk8] [INFO] Building: attach-artifact-test\pom.xml
[windows-jdk7] [INFO] run script verify.bsh
[windows-jdk7] [INFO] ..SUCCESS (2.6 s)
[windows-jdk7] [INFO] Building: attach-artifact-test-with-prefix-unknown\pom.xml
[windows-jdk10] Sending interrupt signal to process
[Pipeline] [windows-jdk8] }
[Pipeline] [linux-jdk8] }
[Pipeline] [linux-jdk9] }
[Pipeline] [linux-jdk7] }
[Pipeline] [linux-jdk10] }
[Pipeline] [windows-jdk8] // dir
[Pipeline] [linux-jdk8] // dir
[Pipeline] [linux-jdk9] // dir
[Pipeline] [linux-jdk7] // dir
[Pipeline] [linux-jdk10] // dir
[Pipeline] [windows-jdk8] }
[windows-jdk8] [withMaven] junitPublisher - Archive test results for Maven artifact org.apache.maven.plugins.antrun:antrun-plugin-test:1.0-SNAPSHOT generated by maven-surefire-plugin:test (default-test): m\target\it\ant-1.7-features\target\surefire-reports\*.xml
[windows-jdk8] [withMaven] junitPublisher - Jenkins JUnit Attachments Plugin not found, can't publish test attachments.Recording test results
[windows-jdk8] None of the test reports contained any result
[windows-jdk8] [withMaven] One or multiple Maven executions have been ignored by the Jenkins Pipeline Maven Plugin because they have been interrupted before completion (2). See Pipeline Maven Plugin FAQ for more details.
[Pipeline] [linux-jdk8] }
[linux-jdk8] [withMaven] One or multiple Maven executions have been ignored by the Jenkins Pipeline Maven Plugin because they have been interrupted before completion (1). See Pipeline Maven Plugin FAQ for more details.
[Pipeline] [linux-jdk9] }
[linux-jdk9] [withMaven] One or multiple Maven executions have been ignored by the Jenkins Pipeline Maven Plugin because they have been interrupted before completion (1). See Pipeline Maven Plugin FAQ for more details.
[Pipeline] [linux-jdk7] }
[linux-jdk7] [withMaven] One or multiple Maven executions have been ignored by the Jenkins Pipeline Maven Plugin because they have been interrupted before completion (1). See Pipeline Maven Plugin FAQ for more details.
[Pipeline] [linux-jdk10] }
[linux-jdk10] [withMaven] One or multiple Maven executions have been ignored by the Jenkins Pipeline Maven Plugin because they have been interrupted before completion (1). See Pipeline Maven Plugin FAQ for more details.
[Pipeline] [windows-jdk8] // withMaven
[Pipeline] [linux-jdk8] // withMaven
[Pipeline] [linux-jdk9] // withMaven
[Pipeline] [linux-jdk7] // withMaven
[Pipeline] [linux-jdk10] // withMaven
[Pipeline] [windows-jdk8] echo
[windows-jdk8] [FAIL FAST] windows-jdk9 had first failure, ignoring script returned exit code -1
[Pipeline] [windows-jdk8] }
[Pipeline] [linux-jdk8] echo
[linux-jdk8] [FAIL FAST] windows-jdk9 had first failure, ignoring script returned exit code 143
[Pipeline] [linux-jdk8] }
[Pipeline] [linux-jdk9] echo
[linux-jdk9] [FAIL FAST] windows-jdk9 had first failure, ignoring script returned exit code 143
[Pipeline] [linux-jdk9] }
[Pipeline] [linux-jdk7] echo
[linux-jdk7] [FAIL FAST] windows-jdk9 had first failure, ignoring script returned exit code 143
[Pipeline] [linux-jdk7] }
[Pipeline] [linux-jdk10] echo
[linux-jdk10] [FAIL FAST] windows-jdk9 had first failure, ignoring null
[Pipeline] [linux-jdk10] }
[Pipeline] [windows-jdk8] // stage
[Pipeline] [linux-jdk8] // stage
[Pipeline] [linux-jdk9] // stage
[Pipeline] [linux-jdk7] // stage
[Pipeline] [linux-jdk10] // stage
[Pipeline] [linux-jdk7] }
[Pipeline] [linux-jdk8] }
[Pipeline] [linux-jdk9] }
[Pipeline] [linux-jdk10] }
[Pipeline] [windows-jdk8] }
[Pipeline] [linux-jdk7] // node
[Pipeline] [linux-jdk8] // node
[Pipeline] [linux-jdk9] // node
[Pipeline] [linux-jdk10] // node
[Pipeline] [windows-jdk8] // node
[Pipeline] [linux-jdk7] }
[Pipeline] [linux-jdk8] }
[Pipeline] [linux-jdk9] }
[Pipeline] [linux-jdk10] }
[Pipeline] [windows-jdk8] }
[windows-jdk7] After 10s process did not stop
[Pipeline] [windows-jdk7] }
[Pipeline] [windows-jdk7] // dir
[windows-jdk10] After 10s process did not stop
[Pipeline] [windows-jdk7] }
[windows-jdk7] [withMaven] junitPublisher - Archive test results for Maven artifact org.apache.maven.plugins.antrun:antrun-plugin-test:1.0-SNAPSHOT generated by maven-surefire-plugin:test (default-test): m\target\it\ant-1.7-features\target\surefire-reports\*.xml
[windows-jdk7] [withMaven] junitPublisher - Jenkins JUnit Attachments Plugin not found, can't publish test attachments.Recording test results
[windows-jdk7] None of the test reports contained any result
[windows-jdk7] [withMaven] One or multiple Maven executions have been ignored by the Jenkins Pipeline Maven Plugin because they have been interrupted before completion (1). See Pipeline Maven Plugin FAQ for more details.
[Pipeline] [windows-jdk7] // withMaven
[Pipeline] [windows-jdk7] echo
[windows-jdk7] [FAIL FAST] windows-jdk9 had first failure, ignoring null
[Pipeline] [windows-jdk7] }
[Pipeline] [windows-jdk10] }
[Pipeline] [windows-jdk7] // stage
[Pipeline] [windows-jdk10] // dir
[Pipeline] [windows-jdk7] }
[Pipeline] [windows-jdk10] }
[windows-jdk10] [withMaven] junitPublisher - Archive test results for Maven artifact org.apache.maven.plugins.antrun:antrun-plugin-test:1.0-SNAPSHOT generated by maven-surefire-plugin:test (default-test): m\target\it\ant-1.7-features\target\surefire-reports\*.xml
[windows-jdk10] [withMaven] junitPublisher - Jenkins JUnit Attachments Plugin not found, can't publish test attachments.Recording test results
[windows-jdk10] None of the test reports contained any result
[windows-jdk10] [withMaven] One or multiple Maven executions have been ignored by the Jenkins Pipeline Maven Plugin because they have been interrupted before completion (2). See Pipeline Maven Plugin FAQ for more details.
[Pipeline] [windows-jdk7] // node
[Pipeline] [windows-jdk10] // withMaven
[Pipeline] [windows-jdk7] }
[Pipeline] [windows-jdk10] echo
[windows-jdk10] [FAIL FAST] windows-jdk9 had first failure, ignoring null
[Pipeline] [windows-jdk10] }
[Pipeline] [windows-jdk10] // stage
[Pipeline] [windows-jdk10] }
[Pipeline] [windows-jdk10] // node
[Pipeline] [windows-jdk10] }
[Pipeline] // parallel
[Pipeline] echo
***** FAST FAILURE *****

Fast failure triggered by windows-jdk9

***** FAST FAILURE *****
[Pipeline] stage
[Pipeline] { (Notifications)
[Pipeline] echo
Build result: FAILURE
[Pipeline] jiraIssueSelector
[Pipeline] jiraComment
[Pipeline] emailext
Reply | Threaded
Open this post in threaded view
|

Build succeeded in Jenkins: Maven TLP » maven-antrun-plugin » master #6

Apache Jenkins Server-2