Build failed in Jenkins: Maven TLP » maven-antrun-plugin » MANTRUN-213 #2

Previous Topic Next Topic
 
classic Classic list List threaded Threaded
2 messages Options
Reply | Threaded
Open this post in threaded view
|

Build failed in Jenkins: Maven TLP » maven-antrun-plugin » MANTRUN-213 #2

Apache Jenkins Server-2
See https://builds.apache.org/job/maven-box/job/maven-antrun-plugin/job/MANTRUN-213/2/

Changes:

* [MANTRUN-210] - Upgrade parent to 31
* [MANTRUN-213] - Upgrade plexus-utils 3.1.0
* [MANTRUN-210] - Upgrade parent to 31
* [MANTRUN-213] - Upgrade plexus-utils 3.1.0
* [MANTRUN-210] - Upgrade parent to 31
* [MANTRUN-213] - Upgrade plexus-utils 3.1.0
* [MANTRUN-210] - Upgrade parent to 31
* [MANTRUN-213] - Upgrade plexus-utils 3.1.0
* [MANTRUN-210] - Upgrade parent to 31
* [MANTRUN-213] - Upgrade plexus-utils 3.1.0

No tests ran.

Build log:
[...truncated 30.32 KB...]
[Pipeline] [linux-jdk7] withMaven
[linux-jdk7] [withMaven] Options: [org.jenkinsci.plugins.pipeline.maven.publishers.GeneratedArtifactsPublisher[disabled=false], org.jenkinsci.plugins.pipeline.maven.publishers.JunitTestsPublisher[disabled=false], org.jenkinsci.plugins.pipeline.maven.publishers.FindbugsAnalysisPublisher[disabled=false], org.jenkinsci.plugins.pipeline.maven.publishers.TasksScannerPublisher[disabled=false], org.jenkinsci.plugins.pipeline.maven.publishers.DependenciesFingerprintPublisher[disabled=false, scopes=[compile, provided, runtime], versions={snapshot:true, release:false}], org.jenkinsci.plugins.pipeline.maven.publishers.InvokerRunsPublisher[disabled=false], org.jenkinsci.plugins.pipeline.maven.publishers.PipelineGraphPublisher[disabled=false, scopes=[compile, provided, runtime], versions={snapshot:true, release:false}, skipDownstreamTriggers=false, lifecycleThreshold=deploy, ignoreUpstreamTriggers=false]]
[linux-jdk7] [withMaven] Available options:
[linux-jdk7] [withMaven] using JDK installation JDK 1.7 (latest)
[linux-jdk7] [withMaven] using Maven installation 'Maven 3.5.2'
[Pipeline] [linux-jdk7] {
[Pipeline] [linux-jdk8] // stage
[Pipeline] [windows-jdk8] // stage
[Pipeline] [linux-jdk8] stage
[Pipeline] [linux-jdk8] { (Build linux-jdk8)
[Pipeline] [windows-jdk8] stage
[Pipeline] [windows-jdk8] { (Build windows-jdk8)
[Pipeline] [linux-jdk7] dir
[linux-jdk7] Running in /home/jenkins/jenkins-slave/workspace/n-antrun-plugin_MANTRUN-213-YLXBHOYMZXFR7AWGDGHUNMCTDJX5GUYAI62MD5CVSNXSDJ6COXCQ/m
[Pipeline] [linux-jdk7] {
[windows-jdk9] Running on windows-2012-1 in f:\jenkins\jenkins-slave\workspace\n-antrun-plugin_MANTRUN-213-YLXBHOYMZXFR7AWGDGHUNMCTDJX5GUYAI62MD5CVSNXSDJ6COXCQ
[Pipeline] [linux-jdk8] withMaven
[linux-jdk8] [withMaven] Options: [org.jenkinsci.plugins.pipeline.maven.publishers.GeneratedArtifactsPublisher[disabled=true], org.jenkinsci.plugins.pipeline.maven.publishers.JunitTestsPublisher[disabled=false], org.jenkinsci.plugins.pipeline.maven.publishers.FindbugsAnalysisPublisher[disabled=true], org.jenkinsci.plugins.pipeline.maven.publishers.TasksScannerPublisher[disabled=true], org.jenkinsci.plugins.pipeline.maven.publishers.DependenciesFingerprintPublisher[disabled=false, scopes=[compile, provided, runtime], versions={snapshot:true, release:false}], org.jenkinsci.plugins.pipeline.maven.publishers.InvokerRunsPublisher[disabled=false], org.jenkinsci.plugins.pipeline.maven.publishers.PipelineGraphPublisher[disabled=false, scopes=[compile, provided, runtime], versions={snapshot:true, release:false}, skipDownstreamTriggers=false, lifecycleThreshold=deploy, ignoreUpstreamTriggers=false]]
[linux-jdk8] [withMaven] Available options:
[linux-jdk8] [withMaven] using JDK installation JDK 1.8 (latest)
[linux-jdk8] [withMaven] using Maven installation 'Maven 3.5.2'
[Pipeline] [linux-jdk8] {
[Pipeline] [windows-jdk8] withMaven
[windows-jdk8] [withMaven] Options: [org.jenkinsci.plugins.pipeline.maven.publishers.GeneratedArtifactsPublisher[disabled=true], org.jenkinsci.plugins.pipeline.maven.publishers.JunitTestsPublisher[disabled=false], org.jenkinsci.plugins.pipeline.maven.publishers.FindbugsAnalysisPublisher[disabled=true], org.jenkinsci.plugins.pipeline.maven.publishers.TasksScannerPublisher[disabled=true], org.jenkinsci.plugins.pipeline.maven.publishers.DependenciesFingerprintPublisher[disabled=false, scopes=[compile, provided, runtime], versions={snapshot:true, release:false}], org.jenkinsci.plugins.pipeline.maven.publishers.InvokerRunsPublisher[disabled=false], org.jenkinsci.plugins.pipeline.maven.publishers.PipelineGraphPublisher[disabled=false, scopes=[compile, provided, runtime], versions={snapshot:true, release:false}, skipDownstreamTriggers=false, lifecycleThreshold=deploy, ignoreUpstreamTriggers=false]]
[windows-jdk8] [withMaven] Available options:
[windows-jdk8] [withMaven] using JDK installation JDK 1.8 (latest)
[windows-jdk8] [withMaven] using Maven installation 'Maven 3.5.0 (Windows)'
[Pipeline] [windows-jdk8] {
[Pipeline] [linux-jdk7] isUnix
[Pipeline] [linux-jdk7] sh
[linux-jdk7] [m] Running shell script
[Pipeline] [linux-jdk8] dir
[linux-jdk8] Running in /home/jenkins/jenkins-slave/workspace/n-antrun-plugin_MANTRUN-213-YLXBHOYMZXFR7AWGDGHUNMCTDJX5GUYAI62MD5CVSNXSDJ6COXCQ/m
[Pipeline] [linux-jdk8] {
[Pipeline] [windows-jdk8] dir
[windows-jdk8] Running in f:\jenkins\jenkins-slave\workspace\n-antrun-plugin_MANTRUN-213-YLXBHOYMZXFR7AWGDGHUNMCTDJX5GUYAI62MD5CVSNXSDJ6COXCQ\m
[Pipeline] [windows-jdk8] {
[windows-jdk10] Running on windows-2016-1 in f:\jenkins\jenkins-slave\workspace\n-antrun-plugin_MANTRUN-213-YLXBHOYMZXFR7AWGDGHUNMCTDJX5GUYAI62MD5CVSNXSDJ6COXCQ@2
[linux-jdk7] + mvn -P+run-its -Dmaven.test.failure.ignore=true -Dfindbugs.failOnError=false clean verify
[linux-jdk7] ----- withMaven Wrapper script -----
[linux-jdk7] Picked up JAVA_TOOL_OPTIONS: -Dmaven.ext.class.path="/home/jenkins/jenkins-slave/workspace/n-antrun-plugin_MANTRUN-213-YLXBHOYMZXFR7AWGDGHUNMCTDJX5GUYAI62MD5CVSNXSDJ6COXCQ@tmp/withMavene2cea9fb/pipeline-maven-spy.jar" -Dorg.jenkinsci.plugins.pipeline.maven.reportsFolder="/home/jenkins/jenkins-slave/workspace/n-antrun-plugin_MANTRUN-213-YLXBHOYMZXFR7AWGDGHUNMCTDJX5GUYAI62MD5CVSNXSDJ6COXCQ@tmp/withMavene2cea9fb"
[linux-jdk7] Apache Maven 3.5.2 (138edd61fd100ec658bfa2d307c43b76940a5d7d; 2017-10-18T07:58:13Z)
[linux-jdk7] Maven home: /home/jenkins/tools/maven/apache-maven-3.5.2
[linux-jdk7] Java version: 1.7.0_80, vendor: Oracle Corporation
[linux-jdk7] Java home: /usr/local/asfpackages/java/jdk1.7.0_80/jre
[linux-jdk7] Default locale: en_US, platform encoding: ISO-8859-1
[linux-jdk7] OS name: "linux", version: "4.4.0-43-generic", arch: "amd64", family: "unix"
[Pipeline] [linux-jdk8] isUnix
[Pipeline] [linux-jdk8] sh
[linux-jdk8] [m] Running shell script
[Pipeline] [windows-jdk8] isUnix
[Pipeline] [windows-jdk8] bat
[windows-jdk8] [m] Running batch script
[Pipeline] [windows-jdk9] {
[Pipeline] [windows-jdk9] stage
[Pipeline] [windows-jdk9] { (Checkout windows-jdk9)
[Pipeline] [windows-jdk9] dir
[windows-jdk9] Running in f:\jenkins\jenkins-slave\workspace\n-antrun-plugin_MANTRUN-213-YLXBHOYMZXFR7AWGDGHUNMCTDJX5GUYAI62MD5CVSNXSDJ6COXCQ\m
[Pipeline] [windows-jdk9] {
[Pipeline] [windows-jdk9] checkout
[Pipeline] [windows-jdk10] {
[Pipeline] [windows-jdk10] stage
[Pipeline] [windows-jdk10] { (Checkout windows-jdk10)
[Pipeline] [windows-jdk10] dir
[windows-jdk10] Running in f:\jenkins\jenkins-slave\workspace\n-antrun-plugin_MANTRUN-213-YLXBHOYMZXFR7AWGDGHUNMCTDJX5GUYAI62MD5CVSNXSDJ6COXCQ@2\m
[Pipeline] [windows-jdk10] {
[Pipeline] [windows-jdk10] checkout
[linux-jdk8] + mvn -P+run-its -Dmaven.test.failure.ignore=true -Dfindbugs.failOnError=false -Dfindbugs.skip=true clean verify
[linux-jdk8] ----- withMaven Wrapper script -----
[linux-jdk8] Picked up JAVA_TOOL_OPTIONS: -Dmaven.ext.class.path="/home/jenkins/jenkins-slave/workspace/n-antrun-plugin_MANTRUN-213-YLXBHOYMZXFR7AWGDGHUNMCTDJX5GUYAI62MD5CVSNXSDJ6COXCQ@tmp/withMaven44644f94/pipeline-maven-spy.jar" -Dorg.jenkinsci.plugins.pipeline.maven.reportsFolder="/home/jenkins/jenkins-slave/workspace/n-antrun-plugin_MANTRUN-213-YLXBHOYMZXFR7AWGDGHUNMCTDJX5GUYAI62MD5CVSNXSDJ6COXCQ@tmp/withMaven44644f94"
[linux-jdk8] Apache Maven 3.5.2 (138edd61fd100ec658bfa2d307c43b76940a5d7d; 2017-10-18T07:58:13Z)
[linux-jdk8] Maven home: /home/jenkins/tools/maven/apache-maven-3.5.2
[linux-jdk8] Java version: 1.8.0_152, vendor: Oracle Corporation
[linux-jdk8] Java home: /usr/local/asfpackages/java/jdk1.8.0_152/jre
[linux-jdk8] Default locale: en_US, platform encoding: ISO-8859-1
[linux-jdk8] OS name: "linux", version: "4.4.0-43-generic", arch: "amd64", family: "unix"
[windows-jdk8]
[windows-jdk8] f:\jenkins\jenkins-slave\workspace\n-antrun-plugin_MANTRUN-213-YLXBHOYMZXFR7AWGDGHUNMCTDJX5GUYAI62MD5CVSNXSDJ6COXCQ\m>mvn -P+run-its -Dmaven.test.failure.ignore=true -Dfindbugs.failOnError=false -Dfindbugs.skip=true clean verify
[windows-jdk8] ----- withMaven Wrapper script -----
[windows-jdk8] Apache Maven 3.5.0 (ff8f5e7444045639af65f6095c62210b5713f426; 2017-04-03T19:39:06Z)
[windows-jdk8] Maven home: F:\jenkins\tools\maven\apache-maven-3.5.0\bin\..
[windows-jdk8] Java version: 1.8.0_152, vendor: Oracle Corporation
[windows-jdk8] Java home: f:\jenkins\tools\java\latest1.8\jre
[windows-jdk8] Default locale: en_US, platform encoding: Cp1252
[windows-jdk8] OS name: "windows server 2012 r2", version: "6.3", arch: "amd64", family: "windows"
[windows-jdk9]  > git rev-parse --is-inside-work-tree # timeout=10
[windows-jdk9] Fetching changes from the remote Git repository
[windows-jdk9]  > git config remote.origin.url https://gitbox.apache.org/repos/asf/maven-antrun-plugin.git # timeout=10
[windows-jdk9] Fetching without tags
[windows-jdk9] Fetching upstream changes from https://gitbox.apache.org/repos/asf/maven-antrun-plugin.git
[windows-jdk9]  > git --version # timeout=10
[windows-jdk9]  > git fetch --no-tags --progress https://gitbox.apache.org/repos/asf/maven-antrun-plugin.git +refs/heads/*:refs/remotes/origin/*
[windows-jdk10]  > git rev-parse --is-inside-work-tree # timeout=10
[windows-jdk10] Fetching changes from the remote Git repository
[Pipeline] [windows-jdk7] }
[Pipeline] [windows-jdk7] // dir
[Pipeline] [windows-jdk7] echo
[windows-jdk7] [FAIL FAST] This is the first failure and likely root cause
[Pipeline] [windows-jdk7] }
[Pipeline] [windows-jdk7] // stage
[windows-jdk10]  > git config remote.origin.url https://gitbox.apache.org/repos/asf/maven-antrun-plugin.git # timeout=10
[Pipeline] [windows-jdk7] }
[Pipeline] [windows-jdk7] // node
[windows-jdk10] Fetching without tags
[Pipeline] [windows-jdk7] }
[windows-jdk10] Fetching upstream changes from https://gitbox.apache.org/repos/asf/maven-antrun-plugin.git
[windows-jdk10]  > git --version # timeout=10
[windows-jdk10]  > git fetch --no-tags --progress https://gitbox.apache.org/repos/asf/maven-antrun-plugin.git +refs/heads/*:refs/remotes/origin/*
[windows-jdk7] Failed in branch windows-jdk7
[linux-jdk7] Sending interrupt signal to process
[windows-jdk9] Checking out Revision bb101a4d407d269b5a1ba8d7dbc7c12221461b98 (MANTRUN-213)
[windows-jdk9]  > git config core.sparsecheckout # timeout=10
[windows-jdk9]  > git checkout -f bb101a4d407d269b5a1ba8d7dbc7c12221461b98
[windows-jdk9] Commit message: "[MANTRUN-213] - Upgrade plexus-utils 3.1.0"
[windows-jdk9] Cleaning workspace
[windows-jdk9]  > git rev-parse --verify HEAD # timeout=10
[windows-jdk9] Resetting working tree
[windows-jdk9]  > git reset --hard # timeout=10
[windows-jdk9]  > git clean -fdx # timeout=10
[windows-jdk10] Checking out Revision bb101a4d407d269b5a1ba8d7dbc7c12221461b98 (MANTRUN-213)
[windows-jdk10]  > git config core.sparsecheckout # timeout=10
[windows-jdk10]  > git checkout -f bb101a4d407d269b5a1ba8d7dbc7c12221461b98
[windows-jdk10] Commit message: "[MANTRUN-213] - Upgrade plexus-utils 3.1.0"
[windows-jdk10] Cleaning workspace
[windows-jdk10]  > git rev-parse --verify HEAD # timeout=10
[windows-jdk10] Resetting working tree
[windows-jdk10]  > git reset --hard # timeout=10
[windows-jdk10]  > git clean -fdx # timeout=10
[linux-jdk7] [INFO] [jenkins-event-spy] Generate /home/jenkins/jenkins-slave/workspace/n-antrun-plugin_MANTRUN-213-YLXBHOYMZXFR7AWGDGHUNMCTDJX5GUYAI62MD5CVSNXSDJ6COXCQ@tmp/withMavene2cea9fb/maven-spy-20180414-134017-7231493924440981647543.log.tmp ...
[linux-jdk7] [INFO] Scanning for projects...
[linux-jdk8] [INFO] [jenkins-event-spy] Generate /home/jenkins/jenkins-slave/workspace/n-antrun-plugin_MANTRUN-213-YLXBHOYMZXFR7AWGDGHUNMCTDJX5GUYAI62MD5CVSNXSDJ6COXCQ@tmp/withMaven44644f94/maven-spy-20180414-134018-5501412355264806865426.log.tmp ...
[linux-jdk8] [INFO] Scanning for projects...
[linux-jdk8] [INFO] Downloading from central: https://repo.maven.apache.org/maven2/org/apache/maven/plugins/maven-plugins/31/maven-plugins-31.pom
[linux-jdk8] Sending interrupt signal to process
[windows-jdk8] [INFO] [jenkins-event-spy] Generate F:\jenkins\jenkins-slave\workspace\n-antrun-plugin_MANTRUN-213-YLXBHOYMZXFR7AWGDGHUNMCTDJX5GUYAI62MD5CVSNXSDJ6COXCQ@tmp\withMaven9d3dbd40\maven-spy-20180414-134019-1710616801712047338.log.tmp ...
[windows-jdk8] [INFO] Scanning for projects...
[linux-jdk8] [INFO] Downloaded from central: https://repo.maven.apache.org/maven2/org/apache/maven/plugins/maven-plugins/31/maven-plugins-31.pom (10 kB at 32 kB/s)
[linux-jdk8] [INFO] Downloading from central: https://repo.maven.apache.org/maven2/org/apache/maven/maven-parent/31/maven-parent-31.pom
[linux-jdk8] [INFO] Downloaded from central: https://repo.maven.apache.org/maven2/org/apache/maven/maven-parent/31/maven-parent-31.pom (43 kB at 1.1 MB/s)
[linux-jdk8] [INFO] Downloading from central: https://repo.maven.apache.org/maven2/org/apache/apache/19/apache-19.pom
[windows-jdk8] Sending interrupt signal to process
[Pipeline] [linux-jdk9] }
[Pipeline] [linux-jdk10] }
[Pipeline] [linux-jdk7] }
[Pipeline] [windows-jdk9] }
[Pipeline] [windows-jdk10] }
[Pipeline] [linux-jdk9] // dir
[Pipeline] [linux-jdk10] // dir
[Pipeline] [linux-jdk7] // dir
[Pipeline] [windows-jdk9] // dir
[Pipeline] [windows-jdk10] // dir
[Pipeline] [linux-jdk9] echo
[linux-jdk9] [FAIL FAST] windows-jdk7 had first failure, ignoring Timeout waiting for task.
[Pipeline] [linux-jdk9] }
[Pipeline] [linux-jdk10] echo
[linux-jdk10] [FAIL FAST] windows-jdk7 had first failure, ignoring Timeout waiting for task.
[Pipeline] [linux-jdk10] }
[Pipeline] [linux-jdk7] }
[linux-jdk7] [withMaven] One or multiple Maven executions have been ignored by the Jenkins Pipeline Maven Plugin because they have been interrupted before completion (1). See Pipeline Maven Plugin FAQ for more details.
[Pipeline] [windows-jdk9] }
[Pipeline] [windows-jdk10] }
[Pipeline] [linux-jdk9] // stage
[Pipeline] [linux-jdk10] // stage
[Pipeline] [linux-jdk7] // withMaven
[Pipeline] [windows-jdk9] // stage
[Pipeline] [windows-jdk10] // stage
[Pipeline] [linux-jdk9] stage
[Pipeline] [linux-jdk9] { (Build linux-jdk9)
[Pipeline] [linux-jdk10] stage
[Pipeline] [linux-jdk10] { (Build linux-jdk10)
[Pipeline] [linux-jdk7] echo
[linux-jdk7] [FAIL FAST] windows-jdk7 had first failure, ignoring script returned exit code 143
[Pipeline] [linux-jdk7] }
[Pipeline] [linux-jdk8] }
[Pipeline] [windows-jdk9] stage
[Pipeline] [windows-jdk9] { (Build windows-jdk9)
[Pipeline] [windows-jdk10] stage
[Pipeline] [windows-jdk10] { (Build windows-jdk10)
[Pipeline] [linux-jdk9] echo
[linux-jdk9] [FAIL FAST] windows-jdk7 has failed. Skipping linux-jdk9.
[Pipeline] [linux-jdk9] }
[Pipeline] [linux-jdk10] echo
[linux-jdk10] [FAIL FAST] windows-jdk7 has failed. Skipping linux-jdk10.
[Pipeline] [linux-jdk10] }
[Pipeline] [windows-jdk9] echo
[windows-jdk9] [FAIL FAST] windows-jdk7 has failed. Skipping windows-jdk9.
[Pipeline] [windows-jdk9] }
[Pipeline] [windows-jdk10] echo
[windows-jdk10] [FAIL FAST] windows-jdk7 has failed. Skipping windows-jdk10.
[Pipeline] [windows-jdk10] }
[Pipeline] [linux-jdk7] // stage
[Pipeline] [linux-jdk8] // dir
[Pipeline] [linux-jdk7] }
[Pipeline] [linux-jdk8] }
[linux-jdk8] [withMaven] One or multiple Maven executions have been ignored by the Jenkins Pipeline Maven Plugin because they have been interrupted before completion (1). See Pipeline Maven Plugin FAQ for more details.
[Pipeline] [linux-jdk9] // stage
[Pipeline] [linux-jdk10] // stage
[Pipeline] [windows-jdk9] // stage
[Pipeline] [windows-jdk10] // stage
[Pipeline] [linux-jdk9] }
[Pipeline] [linux-jdk10] }
[Pipeline] [windows-jdk9] }
[Pipeline] [windows-jdk10] }
[Pipeline] [linux-jdk7] // node
[Pipeline] [linux-jdk8] // withMaven
[Pipeline] [linux-jdk7] }
[Pipeline] [linux-jdk8] echo
[linux-jdk8] [FAIL FAST] windows-jdk7 had first failure, ignoring script returned exit code 143
[Pipeline] [linux-jdk8] }
[Pipeline] [linux-jdk9] // node
[Pipeline] [linux-jdk10] // node
[Pipeline] [windows-jdk9] // node
[Pipeline] [windows-jdk10] // node
[Pipeline] [linux-jdk9] }
[Pipeline] [linux-jdk10] }
[Pipeline] [windows-jdk9] }
[Pipeline] [windows-jdk10] }
[Pipeline] [linux-jdk8] // stage
[Pipeline] [linux-jdk8] }
[Pipeline] [linux-jdk8] // node
[Pipeline] [linux-jdk8] }
[windows-jdk8] After 10s process did not stop
[Pipeline] [windows-jdk8] }
[Pipeline] [windows-jdk8] // dir
[Pipeline] [windows-jdk8] }
[windows-jdk8] [withMaven] One or multiple Maven executions have been ignored by the Jenkins Pipeline Maven Plugin because they have been interrupted before completion (1). See Pipeline Maven Plugin FAQ for more details.
[Pipeline] [windows-jdk8] // withMaven
[Pipeline] [windows-jdk8] echo
[windows-jdk8] [FAIL FAST] windows-jdk7 had first failure, ignoring null
[Pipeline] [windows-jdk8] }
[Pipeline] [windows-jdk8] // stage
[Pipeline] [windows-jdk8] }
[Pipeline] [windows-jdk8] // node
[Pipeline] [windows-jdk8] }
[Pipeline] // parallel
[Pipeline] echo
***** FAST FAILURE *****

Fast failure triggered by windows-jdk7

***** FAST FAILURE *****
[Pipeline] stage
[Pipeline] { (Notifications)
[Pipeline] echo
Build result: FAILURE
[Pipeline] jiraIssueSelector
[Pipeline] jiraComment
[Pipeline] jiraComment
[Pipeline] emailext
Reply | Threaded
Open this post in threaded view
|

Build succeeded in Jenkins: Maven TLP » maven-antrun-plugin » MANTRUN-213 #3

Apache Jenkins Server-2