Build failed in Jenkins: Maven TLP » maven » MNG-6837 #2

classic Classic list List threaded Threaded
2 messages Options
Reply | Threaded
Open this post in threaded view
|

Build failed in Jenkins: Maven TLP » maven » MNG-6837 #2

Apache Jenkins Server-2
See https://builds.apache.org/job/maven-box/job/maven/job/MNG-6837/2/

Changes:

* H30 is having issues

No tests ran.

Build log:
Branch indexing
Obtained Jenkinsfile from 488a555a9796b64e926daf2fde076e6cf4492683
Running in Durability level: MAX_SURVIVABILITY
Loading library jenkins-env@master
Attempting to resolve master from remote references...
 > git --version # timeout=10
 > git ls-remote -h https://gitbox.apache.org/repos/asf/maven-jenkins-env.git # timeout=10
Found match: refs/heads/master revision 7765a90edaad26e06bc4c32b05b561342f8db351
No credentials specified
 > git rev-parse --is-inside-work-tree # timeout=10
Fetching changes from the remote Git repository
 > git config remote.origin.url https://gitbox.apache.org/repos/asf/maven-jenkins-env.git # timeout=10
Fetching without tags
Fetching upstream changes from https://gitbox.apache.org/repos/asf/maven-jenkins-env.git
 > git --version # timeout=10
 > git fetch --no-tags --progress https://gitbox.apache.org/repos/asf/maven-jenkins-env.git +refs/heads/*:refs/remotes/origin/*
Checking out Revision 7765a90edaad26e06bc4c32b05b561342f8db351 (master)
 > git config core.sparsecheckout # timeout=10
 > git checkout -f 7765a90edaad26e06bc4c32b05b561342f8db351
Commit message: "H30 is having issues"
 > git rev-list --no-walk 2ab3c0f8e92b0c40e2e24671ca17a187a8cc4e74 # timeout=10
Loading library jenkins-lib@master
Attempting to resolve master from remote references...
 > git --version # timeout=10
 > git ls-remote -h https://gitbox.apache.org/repos/asf/maven-jenkins-lib.git # timeout=10
Found match: refs/heads/master revision 57fbd117325ce13ef69bd591f457300c75dfc13b
No credentials specified
 > git rev-parse --is-inside-work-tree # timeout=10
Fetching changes from the remote Git repository
 > git config remote.origin.url https://gitbox.apache.org/repos/asf/maven-jenkins-lib.git # timeout=10
Fetching without tags
Fetching upstream changes from https://gitbox.apache.org/repos/asf/maven-jenkins-lib.git
 > git --version # timeout=10
 > git fetch --no-tags --progress https://gitbox.apache.org/repos/asf/maven-jenkins-lib.git +refs/heads/*:refs/remotes/origin/*
Checking out Revision 57fbd117325ce13ef69bd591f457300c75dfc13b (master)
 > git config core.sparsecheckout # timeout=10
 > git checkout -f 57fbd117325ce13ef69bd591f457300c75dfc13b
Commit message: "echo NODE_NAME"
 > git rev-list --no-walk 57fbd117325ce13ef69bd591f457300c75dfc13b # timeout=10
[Pipeline] Start of Pipeline
[Pipeline] properties
[Pipeline] node
Running on H23 in /home/jenkins/jenkins-slave/workspace/maven-box_maven_MNG-6837
[Pipeline] {
[Pipeline] dir
Running in /home/jenkins/jenkins-slave/workspace/maven-box_maven_MNG-6837/build
[Pipeline] {
[Pipeline] stage
[Pipeline] { (Checkout)
[Pipeline] checkout
No credentials specified
Cloning the remote Git repository
Cloning with configured refspecs honoured and without tags
ERROR: Error cloning remote repo 'origin'
hudson.plugins.git.GitException: Could not init /home/jenkins/jenkins-slave/workspace/maven-box_maven_MNG-6837/build
        at org.jenkinsci.plugins.gitclient.CliGitAPIImpl$5.execute(CliGitAPIImpl.java:916)
        at org.jenkinsci.plugins.gitclient.CliGitAPIImpl$2.execute(CliGitAPIImpl.java:708)
        at org.jenkinsci.plugins.gitclient.RemoteGitImpl$CommandInvocationHandler$1.call(RemoteGitImpl.java:153)
        at org.jenkinsci.plugins.gitclient.RemoteGitImpl$CommandInvocationHandler$1.call(RemoteGitImpl.java:146)
        at hudson.remoting.UserRequest.perform(UserRequest.java:212)
        at hudson.remoting.UserRequest.perform(UserRequest.java:54)
        at hudson.remoting.Request$2.run(Request.java:369)
        at hudson.remoting.InterceptingExecutorService$1.call(InterceptingExecutorService.java:72)
        at java.util.concurrent.FutureTask.run(FutureTask.java:266)
        at java.util.concurrent.ThreadPoolExecutor.runWorker(ThreadPoolExecutor.java:1149)
        at java.util.concurrent.ThreadPoolExecutor$Worker.run(ThreadPoolExecutor.java:624)
        at java.lang.Thread.run(Thread.java:748)
        Suppressed: hudson.remoting.Channel$CallSiteStackTrace: Remote call to H23
                at hudson.remoting.Channel.attachCallSiteStackTrace(Channel.java:1743)
                at hudson.remoting.UserRequest$ExceptionResponse.retrieve(UserRequest.java:357)
                at hudson.remoting.Channel.call(Channel.java:957)
                at org.jenkinsci.plugins.gitclient.RemoteGitImpl$CommandInvocationHandler.execute(RemoteGitImpl.java:146)
                at sun.reflect.GeneratedMethodAccessor1015.invoke(Unknown Source)
                at sun.reflect.DelegatingMethodAccessorImpl.invoke(DelegatingMethodAccessorImpl.java:43)
                at java.lang.reflect.Method.invoke(Method.java:498)
                at org.jenkinsci.plugins.gitclient.RemoteGitImpl$CommandInvocationHandler.invoke(RemoteGitImpl.java:132)
                at com.sun.proxy.$Proxy123.execute(Unknown Source)
                at hudson.plugins.git.GitSCM.retrieveChanges(GitSCM.java:1152)
                at hudson.plugins.git.GitSCM.checkout(GitSCM.java:1192)
                at org.jenkinsci.plugins.workflow.steps.scm.SCMStep.checkout(SCMStep.java:124)
                at org.jenkinsci.plugins.workflow.steps.scm.SCMStep$StepExecutionImpl.run(SCMStep.java:93)
                at org.jenkinsci.plugins.workflow.steps.scm.SCMStep$StepExecutionImpl.run(SCMStep.java:80)
                at org.jenkinsci.plugins.workflow.steps.SynchronousNonBlockingStepExecution.lambda$start$0(SynchronousNonBlockingStepExecution.java:47)
                at java.util.concurrent.Executors$RunnableAdapter.call(Executors.java:511)
                ... 4 more
Caused by: hudson.plugins.git.GitException: Error performing git command
        at org.jenkinsci.plugins.gitclient.CliGitAPIImpl.launchCommandIn(CliGitAPIImpl.java:2181)
        at org.jenkinsci.plugins.gitclient.CliGitAPIImpl.launchCommandIn(CliGitAPIImpl.java:2140)
        at org.jenkinsci.plugins.gitclient.CliGitAPIImpl.launchCommandIn(CliGitAPIImpl.java:2136)
        at org.jenkinsci.plugins.gitclient.CliGitAPIImpl.launchCommand(CliGitAPIImpl.java:1741)
        at org.jenkinsci.plugins.gitclient.CliGitAPIImpl$5.execute(CliGitAPIImpl.java:914)
        ... 11 more
Caused by: java.lang.OutOfMemoryError: unable to create new native thread
        at java.lang.Thread.start0(Native Method)
        at java.lang.Thread.start(Thread.java:717)
        at hudson.Proc$LocalProc.<init>(Proc.java:282)
        at hudson.Proc$LocalProc.<init>(Proc.java:219)
        at hudson.Launcher$LocalLauncher.launch(Launcher.java:937)
        at hudson.Launcher$ProcStarter.start(Launcher.java:455)
        at org.jenkinsci.plugins.gitclient.CliGitAPIImpl.launchCommandIn(CliGitAPIImpl.java:2168)
        ... 15 more
[Pipeline] }
[Pipeline] // stage
[Pipeline] }
[Pipeline] // dir
[Pipeline] }
[Pipeline] // node
[Pipeline] echo
[FAILURE-003] AbortException hudson.AbortException: Error cloning remote repo 'origin'
[Pipeline] stage
[Pipeline] { (Notifications)
Cloning repository https://gitbox.apache.org/repos/asf/maven.git
 > git init /home/jenkins/jenkins-slave/workspace/maven-box_maven_MNG-6837/build # timeout=10
[Pipeline] echo
Build result: FAILURE
[Pipeline] jiraIssueSelector
[Pipeline] echo
The authors of changes [rfscholte].
[Pipeline] echo
Sending email ...
[Pipeline] emailext
Reply | Threaded
Open this post in threaded view
|

Build succeeded in Jenkins: Maven TLP » maven » MNG-6837 #3

Apache Jenkins Server-2
See https://builds.apache.org/job/maven-box/job/maven/job/MNG-6837/3/

Changes:

* [MNG-5982] Pass user properties to ModelBuildingRequest
* Revert "[MNG-5982] Pass user properties to ModelBuildingRequest"
* [MNG-6841] update plexus-interpolation to 1.26
* [MNG-6844] Use StandardCharsets and remove outdated @SuppressWarnings
* [MNG-6842] ProjectBuilderTest uses Guava, but Guava is not defined in
* [MNG-6844] Remove outdated TODOs
* [MNG-6847] Explicit type can be replaced by the diamond operator
* [MNG-6837] Simplify detection of the MAVEN_HOME and make it fully

All tests passed