Build failed in Jenkins: Maven TLP » maven » MNG-6012-Missing-Profile-At-End #11

classic Classic list List threaded Threaded
6 messages Options
Reply | Threaded
Open this post in threaded view
|

Build failed in Jenkins: Maven TLP » maven » MNG-6012-Missing-Profile-At-End #11

Apache Jenkins Server-2
See https://builds.apache.org/job/maven-box/job/maven/job/MNG-6012-Missing-Profile-At-End/11/

No changes.

No tests ran.

Build log:
[...truncated 11.23 KB...]
[FATAL] Non-resolvable parent POM for org.apache.maven:maven:3.5.4-SNAPSHOT: Could not transfer artifact org.apache.maven:maven-parent:pom:31 from/to central (https://repo.maven.apache.org/maven2): Received fatal alert: protocol_version and 'parent.relativePath' points at wrong local POM @ line 25, column 11

    at org.apache.maven.project.DefaultProjectBuilder.build (DefaultProjectBuilder.java:383)
    at org.apache.maven.graph.DefaultGraphBuilder.collectProjects (DefaultGraphBuilder.java:414)
    at org.apache.maven.graph.DefaultGraphBuilder.getProjectsForMavenReactor (DefaultGraphBuilder.java:405)
    at org.apache.maven.graph.DefaultGraphBuilder.build (DefaultGraphBuilder.java:82)
    at org.apache.maven.DefaultMaven.buildGraph (DefaultMaven.java:507)
    at org.apache.maven.DefaultMaven.doExecute (DefaultMaven.java:219)
    at org.apache.maven.DefaultMaven.doExecute (DefaultMaven.java:192)
    at org.apache.maven.DefaultMaven.execute (DefaultMaven.java:105)
    at org.apache.maven.cli.MavenCli.execute (MavenCli.java:954)
    at org.apache.maven.cli.MavenCli.doMain (MavenCli.java:288)
    at org.apache.maven.cli.MavenCli.main (MavenCli.java:192)
    at sun.reflect.NativeMethodAccessorImpl.invoke0 (Native Method)
    at sun.reflect.NativeMethodAccessorImpl.invoke (NativeMethodAccessorImpl.java:57)
    at sun.reflect.DelegatingMethodAccessorImpl.invoke (DelegatingMethodAccessorImpl.java:43)
    at java.lang.reflect.Method.invoke (Method.java:606)
    at org.codehaus.plexus.classworlds.launcher.Launcher.launchEnhanced (Launcher.java:289)
    at org.codehaus.plexus.classworlds.launcher.Launcher.launch (Launcher.java:229)
    at org.codehaus.plexus.classworlds.launcher.Launcher.mainWithExitCode (Launcher.java:415)
    at org.codehaus.plexus.classworlds.launcher.Launcher.main (Launcher.java:356)
[ERROR]  
[ERROR]   The project org.apache.maven:maven:3.5.4-SNAPSHOT (/home/jenkins/jenkins-slave/workspace/6012-Missing-Profile-At-End-NV65RIHRGCFERCSO63AAVCWOOI55DEISPSKXXGPL3ZV62GNYNAOQ/build/pom.xml) has 1 error
[ERROR]     Non-resolvable parent POM for org.apache.maven:maven:3.5.4-SNAPSHOT: Could not transfer artifact org.apache.maven:maven-parent:pom:31 from/to central (https://repo.maven.apache.org/maven2): Received fatal alert: protocol_version and 'parent.relativePath' points at wrong local POM @ line 25, column 11 -> [Help 2]
org.apache.maven.model.resolution.UnresolvableModelException: Could not transfer artifact org.apache.maven:maven-parent:pom:31 from/to central (https://repo.maven.apache.org/maven2): Received fatal alert: protocol_version
    at org.apache.maven.project.ProjectModelResolver.resolveModel (ProjectModelResolver.java:197)
    at org.apache.maven.project.ProjectModelResolver.resolveModel (ProjectModelResolver.java:243)
    at org.apache.maven.model.building.DefaultModelBuilder.readParentExternally (DefaultModelBuilder.java:1052)
    at org.apache.maven.model.building.DefaultModelBuilder.readParent (DefaultModelBuilder.java:830)
    at org.apache.maven.model.building.DefaultModelBuilder.build (DefaultModelBuilder.java:332)
    at org.apache.maven.project.DefaultProjectBuilder.build (DefaultProjectBuilder.java:432)
    at org.apache.maven.project.DefaultProjectBuilder.build (DefaultProjectBuilder.java:400)
    at org.apache.maven.project.DefaultProjectBuilder.build (DefaultProjectBuilder.java:363)
    at org.apache.maven.graph.DefaultGraphBuilder.collectProjects (DefaultGraphBuilder.java:414)
    at org.apache.maven.graph.DefaultGraphBuilder.getProjectsForMavenReactor (DefaultGraphBuilder.java:405)
    at org.apache.maven.graph.DefaultGraphBuilder.build (DefaultGraphBuilder.java:82)
    at org.apache.maven.DefaultMaven.buildGraph (DefaultMaven.java:507)
    at org.apache.maven.DefaultMaven.doExecute (DefaultMaven.java:219)
    at org.apache.maven.DefaultMaven.doExecute (DefaultMaven.java:192)
    at org.apache.maven.DefaultMaven.execute (DefaultMaven.java:105)
    at org.apache.maven.cli.MavenCli.execute (MavenCli.java:954)
    at org.apache.maven.cli.MavenCli.doMain (MavenCli.java:288)
    at org.apache.maven.cli.MavenCli.main (MavenCli.java:192)
    at sun.reflect.NativeMethodAccessorImpl.invoke0 (Native Method)
    at sun.reflect.NativeMethodAccessorImpl.invoke (NativeMethodAccessorImpl.java:57)
    at sun.reflect.DelegatingMethodAccessorImpl.invoke (DelegatingMethodAccessorImpl.java:43)
    at java.lang.reflect.Method.invoke (Method.java:606)
    at org.codehaus.plexus.classworlds.launcher.Launcher.launchEnhanced (Launcher.java:289)
    at org.codehaus.plexus.classworlds.launcher.Launcher.launch (Launcher.java:229)
    at org.codehaus.plexus.classworlds.launcher.Launcher.mainWithExitCode (Launcher.java:415)
    at org.codehaus.plexus.classworlds.launcher.Launcher.main (Launcher.java:356)
Caused by: org.eclipse.aether.resolution.ArtifactResolutionException: Could not transfer artifact org.apache.maven:maven-parent:pom:31 from/to central (https://repo.maven.apache.org/maven2): Received fatal alert: protocol_version
    at org.eclipse.aether.internal.impl.DefaultArtifactResolver.resolve (DefaultArtifactResolver.java:422)
    at org.eclipse.aether.internal.impl.DefaultArtifactResolver.resolveArtifacts (DefaultArtifactResolver.java:224)
    at org.eclipse.aether.internal.impl.DefaultArtifactResolver.resolveArtifact (DefaultArtifactResolver.java:201)
    at org.eclipse.aether.internal.impl.DefaultRepositorySystem.resolveArtifact (DefaultRepositorySystem.java:260)
    at org.apache.maven.project.ProjectModelResolver.resolveModel (ProjectModelResolver.java:193)
    at org.apache.maven.project.ProjectModelResolver.resolveModel (ProjectModelResolver.java:243)
    at org.apache.maven.model.building.DefaultModelBuilder.readParentExternally (DefaultModelBuilder.java:1052)
    at org.apache.maven.model.building.DefaultModelBuilder.readParent (DefaultModelBuilder.java:830)
    at org.apache.maven.model.building.DefaultModelBuilder.build (DefaultModelBuilder.java:332)
    at org.apache.maven.project.DefaultProjectBuilder.build (DefaultProjectBuilder.java:432)
    at org.apache.maven.project.DefaultProjectBuilder.build (DefaultProjectBuilder.java:400)
    at org.apache.maven.project.DefaultProjectBuilder.build (DefaultProjectBuilder.java:363)
    at org.apache.maven.graph.DefaultGraphBuilder.collectProjects (DefaultGraphBuilder.java:414)
    at org.apache.maven.graph.DefaultGraphBuilder.getProjectsForMavenReactor (DefaultGraphBuilder.java:405)
    at org.apache.maven.graph.DefaultGraphBuilder.build (DefaultGraphBuilder.java:82)
    at org.apache.maven.DefaultMaven.buildGraph (DefaultMaven.java:507)
    at org.apache.maven.DefaultMaven.doExecute (DefaultMaven.java:219)
    at org.apache.maven.DefaultMaven.doExecute (DefaultMaven.java:192)
    at org.apache.maven.DefaultMaven.execute (DefaultMaven.java:105)
    at org.apache.maven.cli.MavenCli.execute (MavenCli.java:954)
    at org.apache.maven.cli.MavenCli.doMain (MavenCli.java:288)
    at org.apache.maven.cli.MavenCli.main (MavenCli.java:192)
    at sun.reflect.NativeMethodAccessorImpl.invoke0 (Native Method)
    at sun.reflect.NativeMethodAccessorImpl.invoke (NativeMethodAccessorImpl.java:57)
    at sun.reflect.DelegatingMethodAccessorImpl.invoke (DelegatingMethodAccessorImpl.java:43)
    at java.lang.reflect.Method.invoke (Method.java:606)
    at org.codehaus.plexus.classworlds.launcher.Launcher.launchEnhanced (Launcher.java:289)
    at org.codehaus.plexus.classworlds.launcher.Launcher.launch (Launcher.java:229)
    at org.codehaus.plexus.classworlds.launcher.Launcher.mainWithExitCode (Launcher.java:415)
    at org.codehaus.plexus.classworlds.launcher.Launcher.main (Launcher.java:356)
Caused by: org.eclipse.aether.transfer.ArtifactTransferException: Could not transfer artifact org.apache.maven:maven-parent:pom:31 from/to central (https://repo.maven.apache.org/maven2): Received fatal alert: protocol_version
    at org.eclipse.aether.connector.basic.ArtifactTransportListener.transferFailed (ArtifactTransportListener.java:52)
    at org.eclipse.aether.connector.basic.BasicRepositoryConnector$TaskRunner.run (BasicRepositoryConnector.java:365)
    at org.eclipse.aether.util.concurrency.RunnableErrorForwarder$1.run (RunnableErrorForwarder.java:75)
    at org.eclipse.aether.connector.basic.BasicRepositoryConnector$DirectExecutor.execute (BasicRepositoryConnector.java:583)
    at org.eclipse.aether.connector.basic.BasicRepositoryConnector.get (BasicRepositoryConnector.java:259)
    at org.eclipse.aether.internal.impl.DefaultArtifactResolver.performDownloads (DefaultArtifactResolver.java:498)
    at org.eclipse.aether.internal.impl.DefaultArtifactResolver.resolve (DefaultArtifactResolver.java:399)
    at org.eclipse.aether.internal.impl.DefaultArtifactResolver.resolveArtifacts (DefaultArtifactResolver.java:224)
    at org.eclipse.aether.internal.impl.DefaultArtifactResolver.resolveArtifact (DefaultArtifactResolver.java:201)
    at org.eclipse.aether.internal.impl.DefaultRepositorySystem.resolveArtifact (DefaultRepositorySystem.java:260)
    at org.apache.maven.project.ProjectModelResolver.resolveModel (ProjectModelResolver.java:193)
    at org.apache.maven.project.ProjectModelResolver.resolveModel (ProjectModelResolver.java:243)
    at org.apache.maven.model.building.DefaultModelBuilder.readParentExternally (DefaultModelBuilder.java:1052)
    at org.apache.maven.model.building.DefaultModelBuilder.readParent (DefaultModelBuilder.java:830)
    at org.apache.maven.model.building.DefaultModelBuilder.build (DefaultModelBuilder.java:332)
    at org.apache.maven.project.DefaultProjectBuilder.build (DefaultProjectBuilder.java:432)
    at org.apache.maven.project.DefaultProjectBuilder.build (DefaultProjectBuilder.java:400)
    at org.apache.maven.project.DefaultProjectBuilder.build (DefaultProjectBuilder.java:363)
    at org.apache.maven.graph.DefaultGraphBuilder.collectProjects (DefaultGraphBuilder.java:414)
    at org.apache.maven.graph.DefaultGraphBuilder.getProjectsForMavenReactor (DefaultGraphBuilder.java:405)
    at org.apache.maven.graph.DefaultGraphBuilder.build (DefaultGraphBuilder.java:82)
    at org.apache.maven.DefaultMaven.buildGraph (DefaultMaven.java:507)
    at org.apache.maven.DefaultMaven.doExecute (DefaultMaven.java:219)
    at org.apache.maven.DefaultMaven.doExecute (DefaultMaven.java:192)
    at org.apache.maven.DefaultMaven.execute (DefaultMaven.java:105)
    at org.apache.maven.cli.MavenCli.execute (MavenCli.java:954)
    at org.apache.maven.cli.MavenCli.doMain (MavenCli.java:288)
    at org.apache.maven.cli.MavenCli.main (MavenCli.java:192)
    at sun.reflect.NativeMethodAccessorImpl.invoke0 (Native Method)
    at sun.reflect.NativeMethodAccessorImpl.invoke (NativeMethodAccessorImpl.java:57)
    at sun.reflect.DelegatingMethodAccessorImpl.invoke (DelegatingMethodAccessorImpl.java:43)
    at java.lang.reflect.Method.invoke (Method.java:606)
    at org.codehaus.plexus.classworlds.launcher.Launcher.launchEnhanced (Launcher.java:289)
    at org.codehaus.plexus.classworlds.launcher.Launcher.launch (Launcher.java:229)
    at org.codehaus.plexus.classworlds.launcher.Launcher.mainWithExitCode (Launcher.java:415)
    at org.codehaus.plexus.classworlds.launcher.Launcher.main (Launcher.java:356)
Caused by: org.apache.maven.wagon.TransferFailedException: Received fatal alert: protocol_version
    at org.apache.maven.wagon.providers.http.wagon.shared.AbstractHttpClientWagon.fillInputData (AbstractHttpClientWagon.java:1069)
    at org.apache.maven.wagon.providers.http.wagon.shared.AbstractHttpClientWagon.fillInputData (AbstractHttpClientWagon.java:963)
    at org.apache.maven.wagon.StreamWagon.getInputStream (StreamWagon.java:126)
    at org.apache.maven.wagon.StreamWagon.getIfNewer (StreamWagon.java:88)
    at org.apache.maven.wagon.StreamWagon.get (StreamWagon.java:61)
    at org.eclipse.aether.transport.wagon.WagonTransporter$GetTaskRunner.run (WagonTransporter.java:567)
    at org.eclipse.aether.transport.wagon.WagonTransporter.execute (WagonTransporter.java:435)
    at org.eclipse.aether.transport.wagon.WagonTransporter.get (WagonTransporter.java:412)
    at org.eclipse.aether.connector.basic.BasicRepositoryConnector$GetTaskRunner.runTask (BasicRepositoryConnector.java:453)
    at org.eclipse.aether.connector.basic.BasicRepositoryConnector$TaskRunner.run (BasicRepositoryConnector.java:360)
    at org.eclipse.aether.util.concurrency.RunnableErrorForwarder$1.run (RunnableErrorForwarder.java:75)
    at org.eclipse.aether.connector.basic.BasicRepositoryConnector$DirectExecutor.execute (BasicRepositoryConnector.java:583)
    at org.eclipse.aether.connector.basic.BasicRepositoryConnector.get (BasicRepositoryConnector.java:259)
    at org.eclipse.aether.internal.impl.DefaultArtifactResolver.performDownloads (DefaultArtifactResolver.java:498)
    at org.eclipse.aether.internal.impl.DefaultArtifactResolver.resolve (DefaultArtifactResolver.java:399)
    at org.eclipse.aether.internal.impl.DefaultArtifactResolver.resolveArtifacts (DefaultArtifactResolver.java:224)
    at org.eclipse.aether.internal.impl.DefaultArtifactResolver.resolveArtifact (DefaultArtifactResolver.java:201)
    at org.eclipse.aether.internal.impl.DefaultRepositorySystem.resolveArtifact (DefaultRepositorySystem.java:260)
    at org.apache.maven.project.ProjectModelResolver.resolveModel (ProjectModelResolver.java:193)
    at org.apache.maven.project.ProjectModelResolver.resolveModel (ProjectModelResolver.java:243)
    at org.apache.maven.model.building.DefaultModelBuilder.readParentExternally (DefaultModelBuilder.java:1052)
    at org.apache.maven.model.building.DefaultModelBuilder.readParent (DefaultModelBuilder.java:830)
    at org.apache.maven.model.building.DefaultModelBuilder.build (DefaultModelBuilder.java:332)
    at org.apache.maven.project.DefaultProjectBuilder.build (DefaultProjectBuilder.java:432)
    at org.apache.maven.project.DefaultProjectBuilder.build (DefaultProjectBuilder.java:400)
    at org.apache.maven.project.DefaultProjectBuilder.build (DefaultProjectBuilder.java:363)
    at org.apache.maven.graph.DefaultGraphBuilder.collectProjects (DefaultGraphBuilder.java:414)
    at org.apache.maven.graph.DefaultGraphBuilder.getProjectsForMavenReactor (DefaultGraphBuilder.java:405)
    at org.apache.maven.graph.DefaultGraphBuilder.build (DefaultGraphBuilder.java:82)
    at org.apache.maven.DefaultMaven.buildGraph (DefaultMaven.java:507)
    at org.apache.maven.DefaultMaven.doExecute (DefaultMaven.java:219)
    at org.apache.maven.DefaultMaven.doExecute (DefaultMaven.java:192)
    at org.apache.maven.DefaultMaven.execute (DefaultMaven.java:105)
    at org.apache.maven.cli.MavenCli.execute (MavenCli.java:954)
    at org.apache.maven.cli.MavenCli.doMain (MavenCli.java:288)
    at org.apache.maven.cli.MavenCli.main (MavenCli.java:192)
    at sun.reflect.NativeMethodAccessorImpl.invoke0 (Native Method)
    at sun.reflect.NativeMethodAccessorImpl.invoke (NativeMethodAccessorImpl.java:57)
    at sun.reflect.DelegatingMethodAccessorImpl.invoke (DelegatingMethodAccessorImpl.java:43)
    at java.lang.reflect.Method.invoke (Method.java:606)
    at org.codehaus.plexus.classworlds.launcher.Launcher.launchEnhanced (Launcher.java:289)
    at org.codehaus.plexus.classworlds.launcher.Launcher.launch (Launcher.java:229)
    at org.codehaus.plexus.classworlds.launcher.Launcher.mainWithExitCode (Launcher.java:415)
    at org.codehaus.plexus.classworlds.launcher.Launcher.main (Launcher.java:356)
Caused by: javax.net.ssl.SSLException: Received fatal alert: protocol_version
    at sun.security.ssl.Alerts.getSSLException (Alerts.java:208)
    at sun.security.ssl.Alerts.getSSLException (Alerts.java:154)
    at sun.security.ssl.SSLSocketImpl.recvAlert (SSLSocketImpl.java:1979)
    at sun.security.ssl.SSLSocketImpl.readRecord (SSLSocketImpl.java:1086)
    at sun.security.ssl.SSLSocketImpl.performInitialHandshake (SSLSocketImpl.java:1332)
    at sun.security.ssl.SSLSocketImpl.startHandshake (SSLSocketImpl.java:1359)
    at sun.security.ssl.SSLSocketImpl.startHandshake (SSLSocketImpl.java:1343)
    at org.apache.maven.wagon.providers.http.httpclient.conn.ssl.SSLConnectionSocketFactory.createLayeredSocket (SSLConnectionSocketFactory.java:396)
    at org.apache.maven.wagon.providers.http.httpclient.conn.ssl.SSLConnectionSocketFactory.connectSocket (SSLConnectionSocketFactory.java:355)
    at org.apache.maven.wagon.providers.http.httpclient.impl.conn.DefaultHttpClientConnectionOperator.connect (DefaultHttpClientConnectionOperator.java:142)
    at org.apache.maven.wagon.providers.http.httpclient.impl.conn.PoolingHttpClientConnectionManager.connect (PoolingHttpClientConnectionManager.java:373)
    at org.apache.maven.wagon.providers.http.httpclient.impl.execchain.MainClientExec.establishRoute (MainClientExec.java:381)
    at org.apache.maven.wagon.providers.http.httpclient.impl.execchain.MainClientExec.execute (MainClientExec.java:237)
    at org.apache.maven.wagon.providers.http.httpclient.impl.execchain.ProtocolExec.execute (ProtocolExec.java:185)
    at org.apache.maven.wagon.providers.http.httpclient.impl.execchain.RetryExec.execute (RetryExec.java:89)
    at org.apache.maven.wagon.providers.http.httpclient.impl.execchain.RedirectExec.execute (RedirectExec.java:111)
    at org.apache.maven.wagon.providers.http.httpclient.impl.client.InternalHttpClient.doExecute (InternalHttpClient.java:185)
    at org.apache.maven.wagon.providers.http.httpclient.impl.client.CloseableHttpClient.execute (CloseableHttpClient.java:83)
    at org.apache.maven.wagon.providers.http.wagon.shared.AbstractHttpClientWagon.execute (AbstractHttpClientWagon.java:825)
    at org.apache.maven.wagon.providers.http.wagon.shared.AbstractHttpClientWagon.fillInputData (AbstractHttpClientWagon.java:986)
    at org.apache.maven.wagon.providers.http.wagon.shared.AbstractHttpClientWagon.fillInputData (AbstractHttpClientWagon.java:963)
    at org.apache.maven.wagon.StreamWagon.getInputStream (StreamWagon.java:126)
    at org.apache.maven.wagon.StreamWagon.getIfNewer (StreamWagon.java:88)
    at org.apache.maven.wagon.StreamWagon.get (StreamWagon.java:61)
    at org.eclipse.aether.transport.wagon.WagonTransporter$GetTaskRunner.run (WagonTransporter.java:567)
    at org.eclipse.aether.transport.wagon.WagonTransporter.execute (WagonTransporter.java:435)
    at org.eclipse.aether.transport.wagon.WagonTransporter.get (WagonTransporter.java:412)
    at org.eclipse.aether.connector.basic.BasicRepositoryConnector$GetTaskRunner.runTask (BasicRepositoryConnector.java:453)
    at org.eclipse.aether.connector.basic.BasicRepositoryConnector$TaskRunner.run (BasicRepositoryConnector.java:360)
    at org.eclipse.aether.util.concurrency.RunnableErrorForwarder$1.run (RunnableErrorForwarder.java:75)
    at org.eclipse.aether.connector.basic.BasicRepositoryConnector$DirectExecutor.execute (BasicRepositoryConnector.java:583)
    at org.eclipse.aether.connector.basic.BasicRepositoryConnector.get (BasicRepositoryConnector.java:259)
    at org.eclipse.aether.internal.impl.DefaultArtifactResolver.performDownloads (DefaultArtifactResolver.java:498)
    at org.eclipse.aether.internal.impl.DefaultArtifactResolver.resolve (DefaultArtifactResolver.java:399)
    at org.eclipse.aether.internal.impl.DefaultArtifactResolver.resolveArtifacts (DefaultArtifactResolver.java:224)
    at org.eclipse.aether.internal.impl.DefaultArtifactResolver.resolveArtifact (DefaultArtifactResolver.java:201)
    at org.eclipse.aether.internal.impl.DefaultRepositorySystem.resolveArtifact (DefaultRepositorySystem.java:260)
    at org.apache.maven.project.ProjectModelResolver.resolveModel (ProjectModelResolver.java:193)
    at org.apache.maven.project.ProjectModelResolver.resolveModel (ProjectModelResolver.java:243)
    at org.apache.maven.model.building.DefaultModelBuilder.readParentExternally (DefaultModelBuilder.java:1052)
    at org.apache.maven.model.building.DefaultModelBuilder.readParent (DefaultModelBuilder.java:830)
    at org.apache.maven.model.building.DefaultModelBuilder.build (DefaultModelBuilder.java:332)
    at org.apache.maven.project.DefaultProjectBuilder.build (DefaultProjectBuilder.java:432)
    at org.apache.maven.project.DefaultProjectBuilder.build (DefaultProjectBuilder.java:400)
    at org.apache.maven.project.DefaultProjectBuilder.build (DefaultProjectBuilder.java:363)
    at org.apache.maven.graph.DefaultGraphBuilder.collectProjects (DefaultGraphBuilder.java:414)
    at org.apache.maven.graph.DefaultGraphBuilder.getProjectsForMavenReactor (DefaultGraphBuilder.java:405)
    at org.apache.maven.graph.DefaultGraphBuilder.build (DefaultGraphBuilder.java:82)
    at org.apache.maven.DefaultMaven.buildGraph (DefaultMaven.java:507)
    at org.apache.maven.DefaultMaven.doExecute (DefaultMaven.java:219)
    at org.apache.maven.DefaultMaven.doExecute (DefaultMaven.java:192)
    at org.apache.maven.DefaultMaven.execute (DefaultMaven.java:105)
    at org.apache.maven.cli.MavenCli.execute (MavenCli.java:954)
    at org.apache.maven.cli.MavenCli.doMain (MavenCli.java:288)
    at org.apache.maven.cli.MavenCli.main (MavenCli.java:192)
    at sun.reflect.NativeMethodAccessorImpl.invoke0 (Native Method)
    at sun.reflect.NativeMethodAccessorImpl.invoke (NativeMethodAccessorImpl.java:57)
    at sun.reflect.DelegatingMethodAccessorImpl.invoke (DelegatingMethodAccessorImpl.java:43)
    at java.lang.reflect.Method.invoke (Method.java:606)
    at org.codehaus.plexus.classworlds.launcher.Launcher.launchEnhanced (Launcher.java:289)
    at org.codehaus.plexus.classworlds.launcher.Launcher.launch (Launcher.java:229)
    at org.codehaus.plexus.classworlds.launcher.Launcher.mainWithExitCode (Launcher.java:415)
    at org.codehaus.plexus.classworlds.launcher.Launcher.main (Launcher.java:356)
[ERROR]
[ERROR] Re-run Maven using the -X switch to enable full debug logging.
[ERROR]
[ERROR] For more information about the errors and possible solutions, please read the following articles:
[ERROR] [Help 1] http://cwiki.apache.org/confluence/display/MAVEN/ProjectBuildingException
[ERROR] [Help 2] http://cwiki.apache.org/confluence/display/MAVEN/UnresolvableModelException
[Pipeline] }
[Fast Archiver] No prior successful build to compare, so performing full copy of artifacts
[Pipeline] // withMaven
[Pipeline] }
[Pipeline] // stage
[Pipeline] }
[Pipeline] // dir
[Pipeline] }
[Pipeline] // node
[Pipeline] stage
[Pipeline] { (Notifications)
[Pipeline] echo
Build result: FAILURE
[Pipeline] jiraIssueSelector
[Pipeline] emailext
Reply | Threaded
Open this post in threaded view
|

Build failed in Jenkins: Maven TLP » maven » MNG-6012-Missing-Profile-At-End #12

Apache Jenkins Server-2
See https://builds.apache.org/job/maven-box/job/maven/job/MNG-6012-Missing-Profile-At-End/12/

No changes.

No tests ran.

Build log:
Branch indexing
Obtained Jenkinsfile from acd949029960ba12dd287a383b121472728209f0
Running in Durability level: MAX_SURVIVABILITY
Loading library jenkins-env@master
Attempting to resolve master from remote references...
 > git --version # timeout=10
 > git ls-remote -h https://gitbox.apache.org/repos/asf/maven-jenkins-env.git # timeout=10
Found match: refs/heads/master revision 3d06b769e61a13a2a9719212c5c06012f2a55535
 > git rev-parse --is-inside-work-tree # timeout=10
Fetching changes from the remote Git repository
 > git config remote.origin.url https://gitbox.apache.org/repos/asf/maven-jenkins-env.git # timeout=10
Fetching without tags
Fetching upstream changes from https://gitbox.apache.org/repos/asf/maven-jenkins-env.git
 > git --version # timeout=10
 > git fetch --no-tags --progress https://gitbox.apache.org/repos/asf/maven-jenkins-env.git +refs/heads/*:refs/remotes/origin/*
Checking out Revision 3d06b769e61a13a2a9719212c5c06012f2a55535 (master)
 > git config core.sparsecheckout # timeout=10
 > git checkout -f 3d06b769e61a13a2a9719212c5c06012f2a55535
Commit message: "Back to all Windows nodes"
 > git rev-list --no-walk 3d06b769e61a13a2a9719212c5c06012f2a55535 # timeout=10
Loading library jenkins-lib@master
Attempting to resolve master from remote references...
 > git --version # timeout=10
 > git ls-remote -h https://gitbox.apache.org/repos/asf/maven-jenkins-lib.git # timeout=10
Found match: refs/heads/master revision c2152da6e3520c4631ffc32521dcab9ac0f1aea0
 > git rev-parse --is-inside-work-tree # timeout=10
Fetching changes from the remote Git repository
 > git config remote.origin.url https://gitbox.apache.org/repos/asf/maven-jenkins-lib.git # timeout=10
Fetching without tags
Fetching upstream changes from https://gitbox.apache.org/repos/asf/maven-jenkins-lib.git
 > git --version # timeout=10
 > git fetch --no-tags --progress https://gitbox.apache.org/repos/asf/maven-jenkins-lib.git +refs/heads/*:refs/remotes/origin/*
Checking out Revision c2152da6e3520c4631ffc32521dcab9ac0f1aea0 (master)
 > git config core.sparsecheckout # timeout=10
 > git checkout -f c2152da6e3520c4631ffc32521dcab9ac0f1aea0
Commit message: "Try to display PATH value"
 > git rev-list --no-walk c2152da6e3520c4631ffc32521dcab9ac0f1aea0 # timeout=10
[Pipeline] properties
[Pipeline] node
Running on H27 in /home/jenkins/jenkins-slave/workspace/6012-Missing-Profile-At-End-NV65RIHRGCFERCSO63AAVCWOOI55DEISPSKXXGPL3ZV62GNYNAOQ
[Pipeline] {
[Pipeline] dir
Running in /home/jenkins/jenkins-slave/workspace/6012-Missing-Profile-At-End-NV65RIHRGCFERCSO63AAVCWOOI55DEISPSKXXGPL3ZV62GNYNAOQ/build
[Pipeline] {
[Pipeline] stage
[Pipeline] { (Checkout)
[Pipeline] checkout
 > git rev-parse --is-inside-work-tree # timeout=10
Fetching changes from the remote Git repository
 > git config remote.origin.url https://gitbox.apache.org/repos/asf/maven.git # timeout=10
ERROR: Error fetching remote repo 'origin'
hudson.plugins.git.GitException: Failed to fetch from https://gitbox.apache.org/repos/asf/maven.git
        at hudson.plugins.git.GitSCM.fetchFrom(GitSCM.java:888)
        at hudson.plugins.git.GitSCM.retrieveChanges(GitSCM.java:1155)
        at hudson.plugins.git.GitSCM.checkout(GitSCM.java:1186)
        at org.jenkinsci.plugins.workflow.steps.scm.SCMStep.checkout(SCMStep.java:113)
        at org.jenkinsci.plugins.workflow.steps.scm.SCMStep$StepExecutionImpl.run(SCMStep.java:85)
        at org.jenkinsci.plugins.workflow.steps.scm.SCMStep$StepExecutionImpl.run(SCMStep.java:75)
        at org.jenkinsci.plugins.workflow.steps.AbstractSynchronousNonBlockingStepExecution$1$1.call(AbstractSynchronousNonBlockingStepExecution.java:47)
        at hudson.security.ACL.impersonate(ACL.java:290)
        at org.jenkinsci.plugins.workflow.steps.AbstractSynchronousNonBlockingStepExecution$1.run(AbstractSynchronousNonBlockingStepExecution.java:44)
        at java.util.concurrent.Executors$RunnableAdapter.call(Executors.java:511)
        at java.util.concurrent.FutureTask.run(FutureTask.java:266)
        at java.util.concurrent.ThreadPoolExecutor.runWorker(ThreadPoolExecutor.java:1149)
        at java.util.concurrent.ThreadPoolExecutor$Worker.run(ThreadPoolExecutor.java:624)
        at java.lang.Thread.run(Thread.java:748)
Caused by: hudson.plugins.git.GitException: Command "git config remote.origin.url https://gitbox.apache.org/repos/asf/maven.git" returned status code 4:
stdout:
stderr: error: failed to write new configuration file /home/jenkins/jenkins-slave/workspace/6012-Missing-Profile-At-End-NV65RIHRGCFERCSO63AAVCWOOI55DEISPSKXXGPL3ZV62GNYNAOQ/build/.git/config.lock

        at org.jenkinsci.plugins.gitclient.CliGitAPIImpl.launchCommandIn(CliGitAPIImpl.java:2002)
        at org.jenkinsci.plugins.gitclient.CliGitAPIImpl.launchCommandIn(CliGitAPIImpl.java:1970)
        at org.jenkinsci.plugins.gitclient.CliGitAPIImpl.launchCommandIn(CliGitAPIImpl.java:1966)
        at org.jenkinsci.plugins.gitclient.CliGitAPIImpl.launchCommand(CliGitAPIImpl.java:1597)
        at org.jenkinsci.plugins.gitclient.CliGitAPIImpl.launchCommand(CliGitAPIImpl.java:1609)
        at org.jenkinsci.plugins.gitclient.CliGitAPIImpl.setRemoteUrl(CliGitAPIImpl.java:1243)
        at hudson.plugins.git.GitAPI.setRemoteUrl(GitAPI.java:160)
        at sun.reflect.GeneratedMethodAccessor61.invoke(Unknown Source)
        at sun.reflect.DelegatingMethodAccessorImpl.invoke(DelegatingMethodAccessorImpl.java:43)
        at java.lang.reflect.Method.invoke(Method.java:498)
        at hudson.remoting.RemoteInvocationHandler$RPCRequest.perform(RemoteInvocationHandler.java:929)
        at hudson.remoting.RemoteInvocationHandler$RPCRequest.call(RemoteInvocationHandler.java:903)
        at hudson.remoting.RemoteInvocationHandler$RPCRequest.call(RemoteInvocationHandler.java:855)
        at hudson.remoting.UserRequest.perform(UserRequest.java:212)
        at hudson.remoting.UserRequest.perform(UserRequest.java:54)
        at hudson.remoting.Request$2.run(Request.java:369)
        at hudson.remoting.InterceptingExecutorService$1.call(InterceptingExecutorService.java:72)
        at java.util.concurrent.FutureTask.run(FutureTask.java:266)
        at java.util.concurrent.ThreadPoolExecutor.runWorker(ThreadPoolExecutor.java:1142)
        at java.util.concurrent.ThreadPoolExecutor$Worker.run(ThreadPoolExecutor.java:617)
        ... 1 more
        Suppressed: hudson.remoting.Channel$CallSiteStackTrace: Remote call to H27
                at hudson.remoting.Channel.attachCallSiteStackTrace(Channel.java:1741)
                at hudson.remoting.UserRequest$ExceptionResponse.retrieve(UserRequest.java:357)
                at hudson.remoting.Channel.call(Channel.java:955)
                at hudson.remoting.RemoteInvocationHandler.invoke(RemoteInvocationHandler.java:283)
                at com.sun.proxy.$Proxy118.setRemoteUrl(Unknown Source)
                at org.jenkinsci.plugins.gitclient.RemoteGitImpl.setRemoteUrl(RemoteGitImpl.java:295)
                at hudson.plugins.git.GitSCM.fetchFrom(GitSCM.java:876)
                at hudson.plugins.git.GitSCM.retrieveChanges(GitSCM.java:1155)
                at hudson.plugins.git.GitSCM.checkout(GitSCM.java:1186)
                at org.jenkinsci.plugins.workflow.steps.scm.SCMStep.checkout(SCMStep.java:113)
                at org.jenkinsci.plugins.workflow.steps.scm.SCMStep$StepExecutionImpl.run(SCMStep.java:85)
                at org.jenkinsci.plugins.workflow.steps.scm.SCMStep$StepExecutionImpl.run(SCMStep.java:75)
                at org.jenkinsci.plugins.workflow.steps.AbstractSynchronousNonBlockingStepExecution$1$1.call(AbstractSynchronousNonBlockingStepExecution.java:47)
                at hudson.security.ACL.impersonate(ACL.java:290)
                at org.jenkinsci.plugins.workflow.steps.AbstractSynchronousNonBlockingStepExecution$1.run(AbstractSynchronousNonBlockingStepExecution.java:44)
                at java.util.concurrent.Executors$RunnableAdapter.call(Executors.java:511)
                at java.util.concurrent.FutureTask.run(FutureTask.java:266)
                at java.util.concurrent.ThreadPoolExecutor.runWorker(ThreadPoolExecutor.java:1149)
                at java.util.concurrent.ThreadPoolExecutor$Worker.run(ThreadPoolExecutor.java:624)
                ... 1 more
[Pipeline] }
[Pipeline] // stage
[Pipeline] }
[Pipeline] // dir
[Pipeline] }
[Pipeline] // node
[Pipeline] stage
[Pipeline] { (Notifications)
[Pipeline] echo
Build result: FAILURE
[Pipeline] jiraIssueSelector
[Pipeline] emailext
Reply | Threaded
Open this post in threaded view
|

Build failed in Jenkins: Maven TLP » maven » MNG-6012-Missing-Profile-At-End #13

Apache Jenkins Server-2
See https://builds.apache.org/job/maven-box/job/maven/job/MNG-6012-Missing-Profile-At-End/13/

Changes:

* Exclude H25
* Exclude H31 cause master is failing constantly.
* no need to test anymore with '3.0.x'
* Add Java 11 to defaults
* Try to shorten path for Windows by using tempDir
* Fix arguments
* Add option for temp workspace
* disable tmpWs
* enable tmpWs
* Use def
* Try to shorten wsDir

No tests ran.

Build log:
[...truncated 11.17 KB...]
[FATAL] Non-resolvable parent POM for org.apache.maven:maven:3.5.4-SNAPSHOT: Could not transfer artifact org.apache.maven:maven-parent:pom:31 from/to central (https://repo.maven.apache.org/maven2): Received fatal alert: protocol_version and 'parent.relativePath' points at wrong local POM @ line 25, column 11

    at org.apache.maven.project.DefaultProjectBuilder.build (DefaultProjectBuilder.java:383)
    at org.apache.maven.graph.DefaultGraphBuilder.collectProjects (DefaultGraphBuilder.java:414)
    at org.apache.maven.graph.DefaultGraphBuilder.getProjectsForMavenReactor (DefaultGraphBuilder.java:405)
    at org.apache.maven.graph.DefaultGraphBuilder.build (DefaultGraphBuilder.java:82)
    at org.apache.maven.DefaultMaven.buildGraph (DefaultMaven.java:507)
    at org.apache.maven.DefaultMaven.doExecute (DefaultMaven.java:219)
    at org.apache.maven.DefaultMaven.doExecute (DefaultMaven.java:192)
    at org.apache.maven.DefaultMaven.execute (DefaultMaven.java:105)
    at org.apache.maven.cli.MavenCli.execute (MavenCli.java:954)
    at org.apache.maven.cli.MavenCli.doMain (MavenCli.java:288)
    at org.apache.maven.cli.MavenCli.main (MavenCli.java:192)
    at sun.reflect.NativeMethodAccessorImpl.invoke0 (Native Method)
    at sun.reflect.NativeMethodAccessorImpl.invoke (NativeMethodAccessorImpl.java:57)
    at sun.reflect.DelegatingMethodAccessorImpl.invoke (DelegatingMethodAccessorImpl.java:43)
    at java.lang.reflect.Method.invoke (Method.java:606)
    at org.codehaus.plexus.classworlds.launcher.Launcher.launchEnhanced (Launcher.java:289)
    at org.codehaus.plexus.classworlds.launcher.Launcher.launch (Launcher.java:229)
    at org.codehaus.plexus.classworlds.launcher.Launcher.mainWithExitCode (Launcher.java:415)
    at org.codehaus.plexus.classworlds.launcher.Launcher.main (Launcher.java:356)
[ERROR]  
[ERROR]   The project org.apache.maven:maven:3.5.4-SNAPSHOT (/home/jenkins/jenkins-slave/workspace/6012-Missing-Profile-At-End-NV65RIHRGCFERCSO63AAVCWOOI55DEISPSKXXGPL3ZV62GNYNAOQ/build/pom.xml) has 1 error
[ERROR]     Non-resolvable parent POM for org.apache.maven:maven:3.5.4-SNAPSHOT: Could not transfer artifact org.apache.maven:maven-parent:pom:31 from/to central (https://repo.maven.apache.org/maven2): Received fatal alert: protocol_version and 'parent.relativePath' points at wrong local POM @ line 25, column 11 -> [Help 2]
org.apache.maven.model.resolution.UnresolvableModelException: Could not transfer artifact org.apache.maven:maven-parent:pom:31 from/to central (https://repo.maven.apache.org/maven2): Received fatal alert: protocol_version
    at org.apache.maven.project.ProjectModelResolver.resolveModel (ProjectModelResolver.java:197)
    at org.apache.maven.project.ProjectModelResolver.resolveModel (ProjectModelResolver.java:243)
    at org.apache.maven.model.building.DefaultModelBuilder.readParentExternally (DefaultModelBuilder.java:1052)
    at org.apache.maven.model.building.DefaultModelBuilder.readParent (DefaultModelBuilder.java:830)
    at org.apache.maven.model.building.DefaultModelBuilder.build (DefaultModelBuilder.java:332)
    at org.apache.maven.project.DefaultProjectBuilder.build (DefaultProjectBuilder.java:432)
    at org.apache.maven.project.DefaultProjectBuilder.build (DefaultProjectBuilder.java:400)
    at org.apache.maven.project.DefaultProjectBuilder.build (DefaultProjectBuilder.java:363)
    at org.apache.maven.graph.DefaultGraphBuilder.collectProjects (DefaultGraphBuilder.java:414)
    at org.apache.maven.graph.DefaultGraphBuilder.getProjectsForMavenReactor (DefaultGraphBuilder.java:405)
    at org.apache.maven.graph.DefaultGraphBuilder.build (DefaultGraphBuilder.java:82)
    at org.apache.maven.DefaultMaven.buildGraph (DefaultMaven.java:507)
    at org.apache.maven.DefaultMaven.doExecute (DefaultMaven.java:219)
    at org.apache.maven.DefaultMaven.doExecute (DefaultMaven.java:192)
    at org.apache.maven.DefaultMaven.execute (DefaultMaven.java:105)
    at org.apache.maven.cli.MavenCli.execute (MavenCli.java:954)
    at org.apache.maven.cli.MavenCli.doMain (MavenCli.java:288)
    at org.apache.maven.cli.MavenCli.main (MavenCli.java:192)
    at sun.reflect.NativeMethodAccessorImpl.invoke0 (Native Method)
    at sun.reflect.NativeMethodAccessorImpl.invoke (NativeMethodAccessorImpl.java:57)
    at sun.reflect.DelegatingMethodAccessorImpl.invoke (DelegatingMethodAccessorImpl.java:43)
    at java.lang.reflect.Method.invoke (Method.java:606)
    at org.codehaus.plexus.classworlds.launcher.Launcher.launchEnhanced (Launcher.java:289)
    at org.codehaus.plexus.classworlds.launcher.Launcher.launch (Launcher.java:229)
    at org.codehaus.plexus.classworlds.launcher.Launcher.mainWithExitCode (Launcher.java:415)
    at org.codehaus.plexus.classworlds.launcher.Launcher.main (Launcher.java:356)
Caused by: org.eclipse.aether.resolution.ArtifactResolutionException: Could not transfer artifact org.apache.maven:maven-parent:pom:31 from/to central (https://repo.maven.apache.org/maven2): Received fatal alert: protocol_version
    at org.eclipse.aether.internal.impl.DefaultArtifactResolver.resolve (DefaultArtifactResolver.java:422)
    at org.eclipse.aether.internal.impl.DefaultArtifactResolver.resolveArtifacts (DefaultArtifactResolver.java:224)
    at org.eclipse.aether.internal.impl.DefaultArtifactResolver.resolveArtifact (DefaultArtifactResolver.java:201)
    at org.eclipse.aether.internal.impl.DefaultRepositorySystem.resolveArtifact (DefaultRepositorySystem.java:260)
    at org.apache.maven.project.ProjectModelResolver.resolveModel (ProjectModelResolver.java:193)
    at org.apache.maven.project.ProjectModelResolver.resolveModel (ProjectModelResolver.java:243)
    at org.apache.maven.model.building.DefaultModelBuilder.readParentExternally (DefaultModelBuilder.java:1052)
    at org.apache.maven.model.building.DefaultModelBuilder.readParent (DefaultModelBuilder.java:830)
    at org.apache.maven.model.building.DefaultModelBuilder.build (DefaultModelBuilder.java:332)
    at org.apache.maven.project.DefaultProjectBuilder.build (DefaultProjectBuilder.java:432)
    at org.apache.maven.project.DefaultProjectBuilder.build (DefaultProjectBuilder.java:400)
    at org.apache.maven.project.DefaultProjectBuilder.build (DefaultProjectBuilder.java:363)
    at org.apache.maven.graph.DefaultGraphBuilder.collectProjects (DefaultGraphBuilder.java:414)
    at org.apache.maven.graph.DefaultGraphBuilder.getProjectsForMavenReactor (DefaultGraphBuilder.java:405)
    at org.apache.maven.graph.DefaultGraphBuilder.build (DefaultGraphBuilder.java:82)
    at org.apache.maven.DefaultMaven.buildGraph (DefaultMaven.java:507)
    at org.apache.maven.DefaultMaven.doExecute (DefaultMaven.java:219)
    at org.apache.maven.DefaultMaven.doExecute (DefaultMaven.java:192)
    at org.apache.maven.DefaultMaven.execute (DefaultMaven.java:105)
    at org.apache.maven.cli.MavenCli.execute (MavenCli.java:954)
    at org.apache.maven.cli.MavenCli.doMain (MavenCli.java:288)
    at org.apache.maven.cli.MavenCli.main (MavenCli.java:192)
    at sun.reflect.NativeMethodAccessorImpl.invoke0 (Native Method)
    at sun.reflect.NativeMethodAccessorImpl.invoke (NativeMethodAccessorImpl.java:57)
    at sun.reflect.DelegatingMethodAccessorImpl.invoke (DelegatingMethodAccessorImpl.java:43)
    at java.lang.reflect.Method.invoke (Method.java:606)
    at org.codehaus.plexus.classworlds.launcher.Launcher.launchEnhanced (Launcher.java:289)
    at org.codehaus.plexus.classworlds.launcher.Launcher.launch (Launcher.java:229)
    at org.codehaus.plexus.classworlds.launcher.Launcher.mainWithExitCode (Launcher.java:415)
    at org.codehaus.plexus.classworlds.launcher.Launcher.main (Launcher.java:356)
Caused by: org.eclipse.aether.transfer.ArtifactTransferException: Could not transfer artifact org.apache.maven:maven-parent:pom:31 from/to central (https://repo.maven.apache.org/maven2): Received fatal alert: protocol_version
    at org.eclipse.aether.connector.basic.ArtifactTransportListener.transferFailed (ArtifactTransportListener.java:52)
    at org.eclipse.aether.connector.basic.BasicRepositoryConnector$TaskRunner.run (BasicRepositoryConnector.java:365)
    at org.eclipse.aether.util.concurrency.RunnableErrorForwarder$1.run (RunnableErrorForwarder.java:75)
    at org.eclipse.aether.connector.basic.BasicRepositoryConnector$DirectExecutor.execute (BasicRepositoryConnector.java:583)
    at org.eclipse.aether.connector.basic.BasicRepositoryConnector.get (BasicRepositoryConnector.java:259)
    at org.eclipse.aether.internal.impl.DefaultArtifactResolver.performDownloads (DefaultArtifactResolver.java:498)
    at org.eclipse.aether.internal.impl.DefaultArtifactResolver.resolve (DefaultArtifactResolver.java:399)
    at org.eclipse.aether.internal.impl.DefaultArtifactResolver.resolveArtifacts (DefaultArtifactResolver.java:224)
    at org.eclipse.aether.internal.impl.DefaultArtifactResolver.resolveArtifact (DefaultArtifactResolver.java:201)
    at org.eclipse.aether.internal.impl.DefaultRepositorySystem.resolveArtifact (DefaultRepositorySystem.java:260)
    at org.apache.maven.project.ProjectModelResolver.resolveModel (ProjectModelResolver.java:193)
    at org.apache.maven.project.ProjectModelResolver.resolveModel (ProjectModelResolver.java:243)
    at org.apache.maven.model.building.DefaultModelBuilder.readParentExternally (DefaultModelBuilder.java:1052)
    at org.apache.maven.model.building.DefaultModelBuilder.readParent (DefaultModelBuilder.java:830)
    at org.apache.maven.model.building.DefaultModelBuilder.build (DefaultModelBuilder.java:332)
    at org.apache.maven.project.DefaultProjectBuilder.build (DefaultProjectBuilder.java:432)
    at org.apache.maven.project.DefaultProjectBuilder.build (DefaultProjectBuilder.java:400)
    at org.apache.maven.project.DefaultProjectBuilder.build (DefaultProjectBuilder.java:363)
    at org.apache.maven.graph.DefaultGraphBuilder.collectProjects (DefaultGraphBuilder.java:414)
    at org.apache.maven.graph.DefaultGraphBuilder.getProjectsForMavenReactor (DefaultGraphBuilder.java:405)
    at org.apache.maven.graph.DefaultGraphBuilder.build (DefaultGraphBuilder.java:82)
    at org.apache.maven.DefaultMaven.buildGraph (DefaultMaven.java:507)
    at org.apache.maven.DefaultMaven.doExecute (DefaultMaven.java:219)
    at org.apache.maven.DefaultMaven.doExecute (DefaultMaven.java:192)
    at org.apache.maven.DefaultMaven.execute (DefaultMaven.java:105)
    at org.apache.maven.cli.MavenCli.execute (MavenCli.java:954)
    at org.apache.maven.cli.MavenCli.doMain (MavenCli.java:288)
    at org.apache.maven.cli.MavenCli.main (MavenCli.java:192)
    at sun.reflect.NativeMethodAccessorImpl.invoke0 (Native Method)
    at sun.reflect.NativeMethodAccessorImpl.invoke (NativeMethodAccessorImpl.java:57)
    at sun.reflect.DelegatingMethodAccessorImpl.invoke (DelegatingMethodAccessorImpl.java:43)
    at java.lang.reflect.Method.invoke (Method.java:606)
    at org.codehaus.plexus.classworlds.launcher.Launcher.launchEnhanced (Launcher.java:289)
    at org.codehaus.plexus.classworlds.launcher.Launcher.launch (Launcher.java:229)
    at org.codehaus.plexus.classworlds.launcher.Launcher.mainWithExitCode (Launcher.java:415)
    at org.codehaus.plexus.classworlds.launcher.Launcher.main (Launcher.java:356)
Caused by: org.apache.maven.wagon.TransferFailedException: Received fatal alert: protocol_version
    at org.apache.maven.wagon.providers.http.wagon.shared.AbstractHttpClientWagon.fillInputData (AbstractHttpClientWagon.java:1069)
    at org.apache.maven.wagon.providers.http.wagon.shared.AbstractHttpClientWagon.fillInputData (AbstractHttpClientWagon.java:963)
    at org.apache.maven.wagon.StreamWagon.getInputStream (StreamWagon.java:126)
    at org.apache.maven.wagon.StreamWagon.getIfNewer (StreamWagon.java:88)
    at org.apache.maven.wagon.StreamWagon.get (StreamWagon.java:61)
    at org.eclipse.aether.transport.wagon.WagonTransporter$GetTaskRunner.run (WagonTransporter.java:567)
    at org.eclipse.aether.transport.wagon.WagonTransporter.execute (WagonTransporter.java:435)
    at org.eclipse.aether.transport.wagon.WagonTransporter.get (WagonTransporter.java:412)
    at org.eclipse.aether.connector.basic.BasicRepositoryConnector$GetTaskRunner.runTask (BasicRepositoryConnector.java:453)
    at org.eclipse.aether.connector.basic.BasicRepositoryConnector$TaskRunner.run (BasicRepositoryConnector.java:360)
    at org.eclipse.aether.util.concurrency.RunnableErrorForwarder$1.run (RunnableErrorForwarder.java:75)
    at org.eclipse.aether.connector.basic.BasicRepositoryConnector$DirectExecutor.execute (BasicRepositoryConnector.java:583)
    at org.eclipse.aether.connector.basic.BasicRepositoryConnector.get (BasicRepositoryConnector.java:259)
    at org.eclipse.aether.internal.impl.DefaultArtifactResolver.performDownloads (DefaultArtifactResolver.java:498)
    at org.eclipse.aether.internal.impl.DefaultArtifactResolver.resolve (DefaultArtifactResolver.java:399)
    at org.eclipse.aether.internal.impl.DefaultArtifactResolver.resolveArtifacts (DefaultArtifactResolver.java:224)
    at org.eclipse.aether.internal.impl.DefaultArtifactResolver.resolveArtifact (DefaultArtifactResolver.java:201)
    at org.eclipse.aether.internal.impl.DefaultRepositorySystem.resolveArtifact (DefaultRepositorySystem.java:260)
    at org.apache.maven.project.ProjectModelResolver.resolveModel (ProjectModelResolver.java:193)
    at org.apache.maven.project.ProjectModelResolver.resolveModel (ProjectModelResolver.java:243)
    at org.apache.maven.model.building.DefaultModelBuilder.readParentExternally (DefaultModelBuilder.java:1052)
    at org.apache.maven.model.building.DefaultModelBuilder.readParent (DefaultModelBuilder.java:830)
    at org.apache.maven.model.building.DefaultModelBuilder.build (DefaultModelBuilder.java:332)
    at org.apache.maven.project.DefaultProjectBuilder.build (DefaultProjectBuilder.java:432)
    at org.apache.maven.project.DefaultProjectBuilder.build (DefaultProjectBuilder.java:400)
    at org.apache.maven.project.DefaultProjectBuilder.build (DefaultProjectBuilder.java:363)
    at org.apache.maven.graph.DefaultGraphBuilder.collectProjects (DefaultGraphBuilder.java:414)
    at org.apache.maven.graph.DefaultGraphBuilder.getProjectsForMavenReactor (DefaultGraphBuilder.java:405)
    at org.apache.maven.graph.DefaultGraphBuilder.build (DefaultGraphBuilder.java:82)
    at org.apache.maven.DefaultMaven.buildGraph (DefaultMaven.java:507)
    at org.apache.maven.DefaultMaven.doExecute (DefaultMaven.java:219)
    at org.apache.maven.DefaultMaven.doExecute (DefaultMaven.java:192)
    at org.apache.maven.DefaultMaven.execute (DefaultMaven.java:105)
    at org.apache.maven.cli.MavenCli.execute (MavenCli.java:954)
    at org.apache.maven.cli.MavenCli.doMain (MavenCli.java:288)
    at org.apache.maven.cli.MavenCli.main (MavenCli.java:192)
    at sun.reflect.NativeMethodAccessorImpl.invoke0 (Native Method)
    at sun.reflect.NativeMethodAccessorImpl.invoke (NativeMethodAccessorImpl.java:57)
    at sun.reflect.DelegatingMethodAccessorImpl.invoke (DelegatingMethodAccessorImpl.java:43)
    at java.lang.reflect.Method.invoke (Method.java:606)
    at org.codehaus.plexus.classworlds.launcher.Launcher.launchEnhanced (Launcher.java:289)
    at org.codehaus.plexus.classworlds.launcher.Launcher.launch (Launcher.java:229)
    at org.codehaus.plexus.classworlds.launcher.Launcher.mainWithExitCode (Launcher.java:415)
    at org.codehaus.plexus.classworlds.launcher.Launcher.main (Launcher.java:356)
Caused by: javax.net.ssl.SSLException: Received fatal alert: protocol_version
    at sun.security.ssl.Alerts.getSSLException (Alerts.java:208)
    at sun.security.ssl.Alerts.getSSLException (Alerts.java:154)
    at sun.security.ssl.SSLSocketImpl.recvAlert (SSLSocketImpl.java:1979)
    at sun.security.ssl.SSLSocketImpl.readRecord (SSLSocketImpl.java:1086)
    at sun.security.ssl.SSLSocketImpl.performInitialHandshake (SSLSocketImpl.java:1332)
    at sun.security.ssl.SSLSocketImpl.startHandshake (SSLSocketImpl.java:1359)
    at sun.security.ssl.SSLSocketImpl.startHandshake (SSLSocketImpl.java:1343)
    at org.apache.maven.wagon.providers.http.httpclient.conn.ssl.SSLConnectionSocketFactory.createLayeredSocket (SSLConnectionSocketFactory.java:396)
    at org.apache.maven.wagon.providers.http.httpclient.conn.ssl.SSLConnectionSocketFactory.connectSocket (SSLConnectionSocketFactory.java:355)
    at org.apache.maven.wagon.providers.http.httpclient.impl.conn.DefaultHttpClientConnectionOperator.connect (DefaultHttpClientConnectionOperator.java:142)
    at org.apache.maven.wagon.providers.http.httpclient.impl.conn.PoolingHttpClientConnectionManager.connect (PoolingHttpClientConnectionManager.java:373)
    at org.apache.maven.wagon.providers.http.httpclient.impl.execchain.MainClientExec.establishRoute (MainClientExec.java:381)
    at org.apache.maven.wagon.providers.http.httpclient.impl.execchain.MainClientExec.execute (MainClientExec.java:237)
    at org.apache.maven.wagon.providers.http.httpclient.impl.execchain.ProtocolExec.execute (ProtocolExec.java:185)
    at org.apache.maven.wagon.providers.http.httpclient.impl.execchain.RetryExec.execute (RetryExec.java:89)
    at org.apache.maven.wagon.providers.http.httpclient.impl.execchain.RedirectExec.execute (RedirectExec.java:111)
    at org.apache.maven.wagon.providers.http.httpclient.impl.client.InternalHttpClient.doExecute (InternalHttpClient.java:185)
    at org.apache.maven.wagon.providers.http.httpclient.impl.client.CloseableHttpClient.execute (CloseableHttpClient.java:83)
    at org.apache.maven.wagon.providers.http.wagon.shared.AbstractHttpClientWagon.execute (AbstractHttpClientWagon.java:825)
    at org.apache.maven.wagon.providers.http.wagon.shared.AbstractHttpClientWagon.fillInputData (AbstractHttpClientWagon.java:986)
    at org.apache.maven.wagon.providers.http.wagon.shared.AbstractHttpClientWagon.fillInputData (AbstractHttpClientWagon.java:963)
    at org.apache.maven.wagon.StreamWagon.getInputStream (StreamWagon.java:126)
    at org.apache.maven.wagon.StreamWagon.getIfNewer (StreamWagon.java:88)
    at org.apache.maven.wagon.StreamWagon.get (StreamWagon.java:61)
    at org.eclipse.aether.transport.wagon.WagonTransporter$GetTaskRunner.run (WagonTransporter.java:567)
    at org.eclipse.aether.transport.wagon.WagonTransporter.execute (WagonTransporter.java:435)
    at org.eclipse.aether.transport.wagon.WagonTransporter.get (WagonTransporter.java:412)
    at org.eclipse.aether.connector.basic.BasicRepositoryConnector$GetTaskRunner.runTask (BasicRepositoryConnector.java:453)
    at org.eclipse.aether.connector.basic.BasicRepositoryConnector$TaskRunner.run (BasicRepositoryConnector.java:360)
    at org.eclipse.aether.util.concurrency.RunnableErrorForwarder$1.run (RunnableErrorForwarder.java:75)
    at org.eclipse.aether.connector.basic.BasicRepositoryConnector$DirectExecutor.execute (BasicRepositoryConnector.java:583)
    at org.eclipse.aether.connector.basic.BasicRepositoryConnector.get (BasicRepositoryConnector.java:259)
    at org.eclipse.aether.internal.impl.DefaultArtifactResolver.performDownloads (DefaultArtifactResolver.java:498)
    at org.eclipse.aether.internal.impl.DefaultArtifactResolver.resolve (DefaultArtifactResolver.java:399)
    at org.eclipse.aether.internal.impl.DefaultArtifactResolver.resolveArtifacts (DefaultArtifactResolver.java:224)
    at org.eclipse.aether.internal.impl.DefaultArtifactResolver.resolveArtifact (DefaultArtifactResolver.java:201)
    at org.eclipse.aether.internal.impl.DefaultRepositorySystem.resolveArtifact (DefaultRepositorySystem.java:260)
    at org.apache.maven.project.ProjectModelResolver.resolveModel (ProjectModelResolver.java:193)
    at org.apache.maven.project.ProjectModelResolver.resolveModel (ProjectModelResolver.java:243)
    at org.apache.maven.model.building.DefaultModelBuilder.readParentExternally (DefaultModelBuilder.java:1052)
    at org.apache.maven.model.building.DefaultModelBuilder.readParent (DefaultModelBuilder.java:830)
    at org.apache.maven.model.building.DefaultModelBuilder.build (DefaultModelBuilder.java:332)
    at org.apache.maven.project.DefaultProjectBuilder.build (DefaultProjectBuilder.java:432)
    at org.apache.maven.project.DefaultProjectBuilder.build (DefaultProjectBuilder.java:400)
    at org.apache.maven.project.DefaultProjectBuilder.build (DefaultProjectBuilder.java:363)
    at org.apache.maven.graph.DefaultGraphBuilder.collectProjects (DefaultGraphBuilder.java:414)
    at org.apache.maven.graph.DefaultGraphBuilder.getProjectsForMavenReactor (DefaultGraphBuilder.java:405)
    at org.apache.maven.graph.DefaultGraphBuilder.build (DefaultGraphBuilder.java:82)
    at org.apache.maven.DefaultMaven.buildGraph (DefaultMaven.java:507)
    at org.apache.maven.DefaultMaven.doExecute (DefaultMaven.java:219)
    at org.apache.maven.DefaultMaven.doExecute (DefaultMaven.java:192)
    at org.apache.maven.DefaultMaven.execute (DefaultMaven.java:105)
    at org.apache.maven.cli.MavenCli.execute (MavenCli.java:954)
    at org.apache.maven.cli.MavenCli.doMain (MavenCli.java:288)
    at org.apache.maven.cli.MavenCli.main (MavenCli.java:192)
    at sun.reflect.NativeMethodAccessorImpl.invoke0 (Native Method)
    at sun.reflect.NativeMethodAccessorImpl.invoke (NativeMethodAccessorImpl.java:57)
    at sun.reflect.DelegatingMethodAccessorImpl.invoke (DelegatingMethodAccessorImpl.java:43)
    at java.lang.reflect.Method.invoke (Method.java:606)
    at org.codehaus.plexus.classworlds.launcher.Launcher.launchEnhanced (Launcher.java:289)
    at org.codehaus.plexus.classworlds.launcher.Launcher.launch (Launcher.java:229)
    at org.codehaus.plexus.classworlds.launcher.Launcher.mainWithExitCode (Launcher.java:415)
    at org.codehaus.plexus.classworlds.launcher.Launcher.main (Launcher.java:356)
[ERROR]
[ERROR] Re-run Maven using the -X switch to enable full debug logging.
[ERROR]
[ERROR] For more information about the errors and possible solutions, please read the following articles:
[ERROR] [Help 1] http://cwiki.apache.org/confluence/display/MAVEN/ProjectBuildingException
[ERROR] [Help 2] http://cwiki.apache.org/confluence/display/MAVEN/UnresolvableModelException
[Pipeline] }
[Fast Archiver] No prior successful build to compare, so performing full copy of artifacts
[Pipeline] // withMaven
[Pipeline] }
[Pipeline] // stage
[Pipeline] }
[Pipeline] // dir
[Pipeline] }
[Pipeline] // node
[Pipeline] stage
[Pipeline] { (Notifications)
[Pipeline] echo
Build result: FAILURE
[Pipeline] jiraIssueSelector
[Pipeline] emailext
Reply | Threaded
Open this post in threaded view
|

Build failed in Jenkins: Maven TLP » maven » MNG-6012-Missing-Profile-At-End #14

Apache Jenkins Server-2
See https://builds.apache.org/job/maven-box/job/maven/job/MNG-6012-Missing-Profile-At-End/14/

No changes.

No tests ran.

Build log:
[...truncated 11.24 KB...]
[FATAL] Non-resolvable parent POM for org.apache.maven:maven:3.5.4-SNAPSHOT: Could not transfer artifact org.apache.maven:maven-parent:pom:31 from/to central (https://repo.maven.apache.org/maven2): Received fatal alert: protocol_version and 'parent.relativePath' points at wrong local POM @ line 25, column 11

    at org.apache.maven.project.DefaultProjectBuilder.build (DefaultProjectBuilder.java:383)
    at org.apache.maven.graph.DefaultGraphBuilder.collectProjects (DefaultGraphBuilder.java:414)
    at org.apache.maven.graph.DefaultGraphBuilder.getProjectsForMavenReactor (DefaultGraphBuilder.java:405)
    at org.apache.maven.graph.DefaultGraphBuilder.build (DefaultGraphBuilder.java:82)
    at org.apache.maven.DefaultMaven.buildGraph (DefaultMaven.java:507)
    at org.apache.maven.DefaultMaven.doExecute (DefaultMaven.java:219)
    at org.apache.maven.DefaultMaven.doExecute (DefaultMaven.java:192)
    at org.apache.maven.DefaultMaven.execute (DefaultMaven.java:105)
    at org.apache.maven.cli.MavenCli.execute (MavenCli.java:954)
    at org.apache.maven.cli.MavenCli.doMain (MavenCli.java:288)
    at org.apache.maven.cli.MavenCli.main (MavenCli.java:192)
    at sun.reflect.NativeMethodAccessorImpl.invoke0 (Native Method)
    at sun.reflect.NativeMethodAccessorImpl.invoke (NativeMethodAccessorImpl.java:57)
    at sun.reflect.DelegatingMethodAccessorImpl.invoke (DelegatingMethodAccessorImpl.java:43)
    at java.lang.reflect.Method.invoke (Method.java:606)
    at org.codehaus.plexus.classworlds.launcher.Launcher.launchEnhanced (Launcher.java:289)
    at org.codehaus.plexus.classworlds.launcher.Launcher.launch (Launcher.java:229)
    at org.codehaus.plexus.classworlds.launcher.Launcher.mainWithExitCode (Launcher.java:415)
    at org.codehaus.plexus.classworlds.launcher.Launcher.main (Launcher.java:356)
[ERROR]  
[ERROR]   The project org.apache.maven:maven:3.5.4-SNAPSHOT (/home/jenkins/jenkins-slave/workspace/6012-Missing-Profile-At-End-NV65RIHRGCFERCSO63AAVCWOOI55DEISPSKXXGPL3ZV62GNYNAOQ/build/pom.xml) has 1 error
[ERROR]     Non-resolvable parent POM for org.apache.maven:maven:3.5.4-SNAPSHOT: Could not transfer artifact org.apache.maven:maven-parent:pom:31 from/to central (https://repo.maven.apache.org/maven2): Received fatal alert: protocol_version and 'parent.relativePath' points at wrong local POM @ line 25, column 11 -> [Help 2]
org.apache.maven.model.resolution.UnresolvableModelException: Could not transfer artifact org.apache.maven:maven-parent:pom:31 from/to central (https://repo.maven.apache.org/maven2): Received fatal alert: protocol_version
    at org.apache.maven.project.ProjectModelResolver.resolveModel (ProjectModelResolver.java:197)
    at org.apache.maven.project.ProjectModelResolver.resolveModel (ProjectModelResolver.java:243)
    at org.apache.maven.model.building.DefaultModelBuilder.readParentExternally (DefaultModelBuilder.java:1052)
    at org.apache.maven.model.building.DefaultModelBuilder.readParent (DefaultModelBuilder.java:830)
    at org.apache.maven.model.building.DefaultModelBuilder.build (DefaultModelBuilder.java:332)
    at org.apache.maven.project.DefaultProjectBuilder.build (DefaultProjectBuilder.java:432)
    at org.apache.maven.project.DefaultProjectBuilder.build (DefaultProjectBuilder.java:400)
    at org.apache.maven.project.DefaultProjectBuilder.build (DefaultProjectBuilder.java:363)
    at org.apache.maven.graph.DefaultGraphBuilder.collectProjects (DefaultGraphBuilder.java:414)
    at org.apache.maven.graph.DefaultGraphBuilder.getProjectsForMavenReactor (DefaultGraphBuilder.java:405)
    at org.apache.maven.graph.DefaultGraphBuilder.build (DefaultGraphBuilder.java:82)
    at org.apache.maven.DefaultMaven.buildGraph (DefaultMaven.java:507)
    at org.apache.maven.DefaultMaven.doExecute (DefaultMaven.java:219)
    at org.apache.maven.DefaultMaven.doExecute (DefaultMaven.java:192)
    at org.apache.maven.DefaultMaven.execute (DefaultMaven.java:105)
    at org.apache.maven.cli.MavenCli.execute (MavenCli.java:954)
    at org.apache.maven.cli.MavenCli.doMain (MavenCli.java:288)
    at org.apache.maven.cli.MavenCli.main (MavenCli.java:192)
    at sun.reflect.NativeMethodAccessorImpl.invoke0 (Native Method)
    at sun.reflect.NativeMethodAccessorImpl.invoke (NativeMethodAccessorImpl.java:57)
    at sun.reflect.DelegatingMethodAccessorImpl.invoke (DelegatingMethodAccessorImpl.java:43)
    at java.lang.reflect.Method.invoke (Method.java:606)
    at org.codehaus.plexus.classworlds.launcher.Launcher.launchEnhanced (Launcher.java:289)
    at org.codehaus.plexus.classworlds.launcher.Launcher.launch (Launcher.java:229)
    at org.codehaus.plexus.classworlds.launcher.Launcher.mainWithExitCode (Launcher.java:415)
    at org.codehaus.plexus.classworlds.launcher.Launcher.main (Launcher.java:356)
Caused by: org.eclipse.aether.resolution.ArtifactResolutionException: Could not transfer artifact org.apache.maven:maven-parent:pom:31 from/to central (https://repo.maven.apache.org/maven2): Received fatal alert: protocol_version
    at org.eclipse.aether.internal.impl.DefaultArtifactResolver.resolve (DefaultArtifactResolver.java:422)
    at org.eclipse.aether.internal.impl.DefaultArtifactResolver.resolveArtifacts (DefaultArtifactResolver.java:224)
    at org.eclipse.aether.internal.impl.DefaultArtifactResolver.resolveArtifact (DefaultArtifactResolver.java:201)
    at org.eclipse.aether.internal.impl.DefaultRepositorySystem.resolveArtifact (DefaultRepositorySystem.java:260)
    at org.apache.maven.project.ProjectModelResolver.resolveModel (ProjectModelResolver.java:193)
    at org.apache.maven.project.ProjectModelResolver.resolveModel (ProjectModelResolver.java:243)
    at org.apache.maven.model.building.DefaultModelBuilder.readParentExternally (DefaultModelBuilder.java:1052)
    at org.apache.maven.model.building.DefaultModelBuilder.readParent (DefaultModelBuilder.java:830)
    at org.apache.maven.model.building.DefaultModelBuilder.build (DefaultModelBuilder.java:332)
    at org.apache.maven.project.DefaultProjectBuilder.build (DefaultProjectBuilder.java:432)
    at org.apache.maven.project.DefaultProjectBuilder.build (DefaultProjectBuilder.java:400)
    at org.apache.maven.project.DefaultProjectBuilder.build (DefaultProjectBuilder.java:363)
    at org.apache.maven.graph.DefaultGraphBuilder.collectProjects (DefaultGraphBuilder.java:414)
    at org.apache.maven.graph.DefaultGraphBuilder.getProjectsForMavenReactor (DefaultGraphBuilder.java:405)
    at org.apache.maven.graph.DefaultGraphBuilder.build (DefaultGraphBuilder.java:82)
    at org.apache.maven.DefaultMaven.buildGraph (DefaultMaven.java:507)
    at org.apache.maven.DefaultMaven.doExecute (DefaultMaven.java:219)
    at org.apache.maven.DefaultMaven.doExecute (DefaultMaven.java:192)
    at org.apache.maven.DefaultMaven.execute (DefaultMaven.java:105)
    at org.apache.maven.cli.MavenCli.execute (MavenCli.java:954)
    at org.apache.maven.cli.MavenCli.doMain (MavenCli.java:288)
    at org.apache.maven.cli.MavenCli.main (MavenCli.java:192)
    at sun.reflect.NativeMethodAccessorImpl.invoke0 (Native Method)
    at sun.reflect.NativeMethodAccessorImpl.invoke (NativeMethodAccessorImpl.java:57)
    at sun.reflect.DelegatingMethodAccessorImpl.invoke (DelegatingMethodAccessorImpl.java:43)
    at java.lang.reflect.Method.invoke (Method.java:606)
    at org.codehaus.plexus.classworlds.launcher.Launcher.launchEnhanced (Launcher.java:289)
    at org.codehaus.plexus.classworlds.launcher.Launcher.launch (Launcher.java:229)
    at org.codehaus.plexus.classworlds.launcher.Launcher.mainWithExitCode (Launcher.java:415)
    at org.codehaus.plexus.classworlds.launcher.Launcher.main (Launcher.java:356)
Caused by: org.eclipse.aether.transfer.ArtifactTransferException: Could not transfer artifact org.apache.maven:maven-parent:pom:31 from/to central (https://repo.maven.apache.org/maven2): Received fatal alert: protocol_version
    at org.eclipse.aether.connector.basic.ArtifactTransportListener.transferFailed (ArtifactTransportListener.java:52)
    at org.eclipse.aether.connector.basic.BasicRepositoryConnector$TaskRunner.run (BasicRepositoryConnector.java:365)
    at org.eclipse.aether.util.concurrency.RunnableErrorForwarder$1.run (RunnableErrorForwarder.java:75)
    at org.eclipse.aether.connector.basic.BasicRepositoryConnector$DirectExecutor.execute (BasicRepositoryConnector.java:583)
    at org.eclipse.aether.connector.basic.BasicRepositoryConnector.get (BasicRepositoryConnector.java:259)
    at org.eclipse.aether.internal.impl.DefaultArtifactResolver.performDownloads (DefaultArtifactResolver.java:498)
    at org.eclipse.aether.internal.impl.DefaultArtifactResolver.resolve (DefaultArtifactResolver.java:399)
    at org.eclipse.aether.internal.impl.DefaultArtifactResolver.resolveArtifacts (DefaultArtifactResolver.java:224)
    at org.eclipse.aether.internal.impl.DefaultArtifactResolver.resolveArtifact (DefaultArtifactResolver.java:201)
    at org.eclipse.aether.internal.impl.DefaultRepositorySystem.resolveArtifact (DefaultRepositorySystem.java:260)
    at org.apache.maven.project.ProjectModelResolver.resolveModel (ProjectModelResolver.java:193)
    at org.apache.maven.project.ProjectModelResolver.resolveModel (ProjectModelResolver.java:243)
    at org.apache.maven.model.building.DefaultModelBuilder.readParentExternally (DefaultModelBuilder.java:1052)
    at org.apache.maven.model.building.DefaultModelBuilder.readParent (DefaultModelBuilder.java:830)
    at org.apache.maven.model.building.DefaultModelBuilder.build (DefaultModelBuilder.java:332)
    at org.apache.maven.project.DefaultProjectBuilder.build (DefaultProjectBuilder.java:432)
    at org.apache.maven.project.DefaultProjectBuilder.build (DefaultProjectBuilder.java:400)
    at org.apache.maven.project.DefaultProjectBuilder.build (DefaultProjectBuilder.java:363)
    at org.apache.maven.graph.DefaultGraphBuilder.collectProjects (DefaultGraphBuilder.java:414)
    at org.apache.maven.graph.DefaultGraphBuilder.getProjectsForMavenReactor (DefaultGraphBuilder.java:405)
    at org.apache.maven.graph.DefaultGraphBuilder.build (DefaultGraphBuilder.java:82)
    at org.apache.maven.DefaultMaven.buildGraph (DefaultMaven.java:507)
    at org.apache.maven.DefaultMaven.doExecute (DefaultMaven.java:219)
    at org.apache.maven.DefaultMaven.doExecute (DefaultMaven.java:192)
    at org.apache.maven.DefaultMaven.execute (DefaultMaven.java:105)
    at org.apache.maven.cli.MavenCli.execute (MavenCli.java:954)
    at org.apache.maven.cli.MavenCli.doMain (MavenCli.java:288)
    at org.apache.maven.cli.MavenCli.main (MavenCli.java:192)
    at sun.reflect.NativeMethodAccessorImpl.invoke0 (Native Method)
    at sun.reflect.NativeMethodAccessorImpl.invoke (NativeMethodAccessorImpl.java:57)
    at sun.reflect.DelegatingMethodAccessorImpl.invoke (DelegatingMethodAccessorImpl.java:43)
    at java.lang.reflect.Method.invoke (Method.java:606)
    at org.codehaus.plexus.classworlds.launcher.Launcher.launchEnhanced (Launcher.java:289)
    at org.codehaus.plexus.classworlds.launcher.Launcher.launch (Launcher.java:229)
    at org.codehaus.plexus.classworlds.launcher.Launcher.mainWithExitCode (Launcher.java:415)
    at org.codehaus.plexus.classworlds.launcher.Launcher.main (Launcher.java:356)
Caused by: org.apache.maven.wagon.TransferFailedException: Received fatal alert: protocol_version
    at org.apache.maven.wagon.providers.http.wagon.shared.AbstractHttpClientWagon.fillInputData (AbstractHttpClientWagon.java:1069)
    at org.apache.maven.wagon.providers.http.wagon.shared.AbstractHttpClientWagon.fillInputData (AbstractHttpClientWagon.java:963)
    at org.apache.maven.wagon.StreamWagon.getInputStream (StreamWagon.java:126)
    at org.apache.maven.wagon.StreamWagon.getIfNewer (StreamWagon.java:88)
    at org.apache.maven.wagon.StreamWagon.get (StreamWagon.java:61)
    at org.eclipse.aether.transport.wagon.WagonTransporter$GetTaskRunner.run (WagonTransporter.java:567)
    at org.eclipse.aether.transport.wagon.WagonTransporter.execute (WagonTransporter.java:435)
    at org.eclipse.aether.transport.wagon.WagonTransporter.get (WagonTransporter.java:412)
    at org.eclipse.aether.connector.basic.BasicRepositoryConnector$GetTaskRunner.runTask (BasicRepositoryConnector.java:453)
    at org.eclipse.aether.connector.basic.BasicRepositoryConnector$TaskRunner.run (BasicRepositoryConnector.java:360)
    at org.eclipse.aether.util.concurrency.RunnableErrorForwarder$1.run (RunnableErrorForwarder.java:75)
    at org.eclipse.aether.connector.basic.BasicRepositoryConnector$DirectExecutor.execute (BasicRepositoryConnector.java:583)
    at org.eclipse.aether.connector.basic.BasicRepositoryConnector.get (BasicRepositoryConnector.java:259)
    at org.eclipse.aether.internal.impl.DefaultArtifactResolver.performDownloads (DefaultArtifactResolver.java:498)
    at org.eclipse.aether.internal.impl.DefaultArtifactResolver.resolve (DefaultArtifactResolver.java:399)
    at org.eclipse.aether.internal.impl.DefaultArtifactResolver.resolveArtifacts (DefaultArtifactResolver.java:224)
    at org.eclipse.aether.internal.impl.DefaultArtifactResolver.resolveArtifact (DefaultArtifactResolver.java:201)
    at org.eclipse.aether.internal.impl.DefaultRepositorySystem.resolveArtifact (DefaultRepositorySystem.java:260)
    at org.apache.maven.project.ProjectModelResolver.resolveModel (ProjectModelResolver.java:193)
    at org.apache.maven.project.ProjectModelResolver.resolveModel (ProjectModelResolver.java:243)
    at org.apache.maven.model.building.DefaultModelBuilder.readParentExternally (DefaultModelBuilder.java:1052)
    at org.apache.maven.model.building.DefaultModelBuilder.readParent (DefaultModelBuilder.java:830)
    at org.apache.maven.model.building.DefaultModelBuilder.build (DefaultModelBuilder.java:332)
    at org.apache.maven.project.DefaultProjectBuilder.build (DefaultProjectBuilder.java:432)
    at org.apache.maven.project.DefaultProjectBuilder.build (DefaultProjectBuilder.java:400)
    at org.apache.maven.project.DefaultProjectBuilder.build (DefaultProjectBuilder.java:363)
    at org.apache.maven.graph.DefaultGraphBuilder.collectProjects (DefaultGraphBuilder.java:414)
    at org.apache.maven.graph.DefaultGraphBuilder.getProjectsForMavenReactor (DefaultGraphBuilder.java:405)
    at org.apache.maven.graph.DefaultGraphBuilder.build (DefaultGraphBuilder.java:82)
    at org.apache.maven.DefaultMaven.buildGraph (DefaultMaven.java:507)
    at org.apache.maven.DefaultMaven.doExecute (DefaultMaven.java:219)
    at org.apache.maven.DefaultMaven.doExecute (DefaultMaven.java:192)
    at org.apache.maven.DefaultMaven.execute (DefaultMaven.java:105)
    at org.apache.maven.cli.MavenCli.execute (MavenCli.java:954)
    at org.apache.maven.cli.MavenCli.doMain (MavenCli.java:288)
    at org.apache.maven.cli.MavenCli.main (MavenCli.java:192)
    at sun.reflect.NativeMethodAccessorImpl.invoke0 (Native Method)
    at sun.reflect.NativeMethodAccessorImpl.invoke (NativeMethodAccessorImpl.java:57)
    at sun.reflect.DelegatingMethodAccessorImpl.invoke (DelegatingMethodAccessorImpl.java:43)
    at java.lang.reflect.Method.invoke (Method.java:606)
    at org.codehaus.plexus.classworlds.launcher.Launcher.launchEnhanced (Launcher.java:289)
    at org.codehaus.plexus.classworlds.launcher.Launcher.launch (Launcher.java:229)
    at org.codehaus.plexus.classworlds.launcher.Launcher.mainWithExitCode (Launcher.java:415)
    at org.codehaus.plexus.classworlds.launcher.Launcher.main (Launcher.java:356)
Caused by: javax.net.ssl.SSLException: Received fatal alert: protocol_version
    at sun.security.ssl.Alerts.getSSLException (Alerts.java:208)
    at sun.security.ssl.Alerts.getSSLException (Alerts.java:154)
    at sun.security.ssl.SSLSocketImpl.recvAlert (SSLSocketImpl.java:1979)
    at sun.security.ssl.SSLSocketImpl.readRecord (SSLSocketImpl.java:1086)
    at sun.security.ssl.SSLSocketImpl.performInitialHandshake (SSLSocketImpl.java:1332)
    at sun.security.ssl.SSLSocketImpl.startHandshake (SSLSocketImpl.java:1359)
    at sun.security.ssl.SSLSocketImpl.startHandshake (SSLSocketImpl.java:1343)
    at org.apache.maven.wagon.providers.http.httpclient.conn.ssl.SSLConnectionSocketFactory.createLayeredSocket (SSLConnectionSocketFactory.java:396)
    at org.apache.maven.wagon.providers.http.httpclient.conn.ssl.SSLConnectionSocketFactory.connectSocket (SSLConnectionSocketFactory.java:355)
    at org.apache.maven.wagon.providers.http.httpclient.impl.conn.DefaultHttpClientConnectionOperator.connect (DefaultHttpClientConnectionOperator.java:142)
    at org.apache.maven.wagon.providers.http.httpclient.impl.conn.PoolingHttpClientConnectionManager.connect (PoolingHttpClientConnectionManager.java:373)
    at org.apache.maven.wagon.providers.http.httpclient.impl.execchain.MainClientExec.establishRoute (MainClientExec.java:381)
    at org.apache.maven.wagon.providers.http.httpclient.impl.execchain.MainClientExec.execute (MainClientExec.java:237)
    at org.apache.maven.wagon.providers.http.httpclient.impl.execchain.ProtocolExec.execute (ProtocolExec.java:185)
    at org.apache.maven.wagon.providers.http.httpclient.impl.execchain.RetryExec.execute (RetryExec.java:89)
    at org.apache.maven.wagon.providers.http.httpclient.impl.execchain.RedirectExec.execute (RedirectExec.java:111)
    at org.apache.maven.wagon.providers.http.httpclient.impl.client.InternalHttpClient.doExecute (InternalHttpClient.java:185)
    at org.apache.maven.wagon.providers.http.httpclient.impl.client.CloseableHttpClient.execute (CloseableHttpClient.java:83)
    at org.apache.maven.wagon.providers.http.wagon.shared.AbstractHttpClientWagon.execute (AbstractHttpClientWagon.java:825)
    at org.apache.maven.wagon.providers.http.wagon.shared.AbstractHttpClientWagon.fillInputData (AbstractHttpClientWagon.java:986)
    at org.apache.maven.wagon.providers.http.wagon.shared.AbstractHttpClientWagon.fillInputData (AbstractHttpClientWagon.java:963)
    at org.apache.maven.wagon.StreamWagon.getInputStream (StreamWagon.java:126)
    at org.apache.maven.wagon.StreamWagon.getIfNewer (StreamWagon.java:88)
    at org.apache.maven.wagon.StreamWagon.get (StreamWagon.java:61)
    at org.eclipse.aether.transport.wagon.WagonTransporter$GetTaskRunner.run (WagonTransporter.java:567)
    at org.eclipse.aether.transport.wagon.WagonTransporter.execute (WagonTransporter.java:435)
    at org.eclipse.aether.transport.wagon.WagonTransporter.get (WagonTransporter.java:412)
    at org.eclipse.aether.connector.basic.BasicRepositoryConnector$GetTaskRunner.runTask (BasicRepositoryConnector.java:453)
    at org.eclipse.aether.connector.basic.BasicRepositoryConnector$TaskRunner.run (BasicRepositoryConnector.java:360)
    at org.eclipse.aether.util.concurrency.RunnableErrorForwarder$1.run (RunnableErrorForwarder.java:75)
    at org.eclipse.aether.connector.basic.BasicRepositoryConnector$DirectExecutor.execute (BasicRepositoryConnector.java:583)
    at org.eclipse.aether.connector.basic.BasicRepositoryConnector.get (BasicRepositoryConnector.java:259)
    at org.eclipse.aether.internal.impl.DefaultArtifactResolver.performDownloads (DefaultArtifactResolver.java:498)
    at org.eclipse.aether.internal.impl.DefaultArtifactResolver.resolve (DefaultArtifactResolver.java:399)
    at org.eclipse.aether.internal.impl.DefaultArtifactResolver.resolveArtifacts (DefaultArtifactResolver.java:224)
    at org.eclipse.aether.internal.impl.DefaultArtifactResolver.resolveArtifact (DefaultArtifactResolver.java:201)
    at org.eclipse.aether.internal.impl.DefaultRepositorySystem.resolveArtifact (DefaultRepositorySystem.java:260)
    at org.apache.maven.project.ProjectModelResolver.resolveModel (ProjectModelResolver.java:193)
    at org.apache.maven.project.ProjectModelResolver.resolveModel (ProjectModelResolver.java:243)
    at org.apache.maven.model.building.DefaultModelBuilder.readParentExternally (DefaultModelBuilder.java:1052)
    at org.apache.maven.model.building.DefaultModelBuilder.readParent (DefaultModelBuilder.java:830)
    at org.apache.maven.model.building.DefaultModelBuilder.build (DefaultModelBuilder.java:332)
    at org.apache.maven.project.DefaultProjectBuilder.build (DefaultProjectBuilder.java:432)
    at org.apache.maven.project.DefaultProjectBuilder.build (DefaultProjectBuilder.java:400)
    at org.apache.maven.project.DefaultProjectBuilder.build (DefaultProjectBuilder.java:363)
    at org.apache.maven.graph.DefaultGraphBuilder.collectProjects (DefaultGraphBuilder.java:414)
    at org.apache.maven.graph.DefaultGraphBuilder.getProjectsForMavenReactor (DefaultGraphBuilder.java:405)
    at org.apache.maven.graph.DefaultGraphBuilder.build (DefaultGraphBuilder.java:82)
    at org.apache.maven.DefaultMaven.buildGraph (DefaultMaven.java:507)
    at org.apache.maven.DefaultMaven.doExecute (DefaultMaven.java:219)
    at org.apache.maven.DefaultMaven.doExecute (DefaultMaven.java:192)
    at org.apache.maven.DefaultMaven.execute (DefaultMaven.java:105)
    at org.apache.maven.cli.MavenCli.execute (MavenCli.java:954)
    at org.apache.maven.cli.MavenCli.doMain (MavenCli.java:288)
    at org.apache.maven.cli.MavenCli.main (MavenCli.java:192)
    at sun.reflect.NativeMethodAccessorImpl.invoke0 (Native Method)
    at sun.reflect.NativeMethodAccessorImpl.invoke (NativeMethodAccessorImpl.java:57)
    at sun.reflect.DelegatingMethodAccessorImpl.invoke (DelegatingMethodAccessorImpl.java:43)
    at java.lang.reflect.Method.invoke (Method.java:606)
    at org.codehaus.plexus.classworlds.launcher.Launcher.launchEnhanced (Launcher.java:289)
    at org.codehaus.plexus.classworlds.launcher.Launcher.launch (Launcher.java:229)
    at org.codehaus.plexus.classworlds.launcher.Launcher.mainWithExitCode (Launcher.java:415)
    at org.codehaus.plexus.classworlds.launcher.Launcher.main (Launcher.java:356)
[ERROR]
[ERROR] Re-run Maven using the -X switch to enable full debug logging.
[ERROR]
[ERROR] For more information about the errors and possible solutions, please read the following articles:
[ERROR] [Help 1] http://cwiki.apache.org/confluence/display/MAVEN/ProjectBuildingException
[ERROR] [Help 2] http://cwiki.apache.org/confluence/display/MAVEN/UnresolvableModelException
[Pipeline] }
[Fast Archiver] No prior successful build to compare, so performing full copy of artifacts
[Pipeline] // withMaven
[Pipeline] }
[Pipeline] // stage
[Pipeline] }
[Pipeline] // dir
[Pipeline] }
[Pipeline] // node
[Pipeline] stage
[Pipeline] { (Notifications)
[Pipeline] echo
Build result: FAILURE
[Pipeline] jiraIssueSelector
[Pipeline] emailext
Reply | Threaded
Open this post in threaded view
|

Build failed in Jenkins: Maven TLP » maven » MNG-6012-Missing-Profile-At-End #15

Apache Jenkins Server-2
See https://builds.apache.org/job/maven-box/job/maven/job/MNG-6012-Missing-Profile-At-End/15/

No changes.

No tests ran.

Build log:
[...truncated 11.45 KB...]
[FATAL] Non-resolvable parent POM for org.apache.maven:maven:3.5.4-SNAPSHOT: Could not transfer artifact org.apache.maven:maven-parent:pom:31 from/to central (https://repo.maven.apache.org/maven2): Received fatal alert: protocol_version and 'parent.relativePath' points at wrong local POM @ line 25, column 11

    at org.apache.maven.project.DefaultProjectBuilder.build (DefaultProjectBuilder.java:383)
    at org.apache.maven.graph.DefaultGraphBuilder.collectProjects (DefaultGraphBuilder.java:414)
    at org.apache.maven.graph.DefaultGraphBuilder.getProjectsForMavenReactor (DefaultGraphBuilder.java:405)
    at org.apache.maven.graph.DefaultGraphBuilder.build (DefaultGraphBuilder.java:82)
    at org.apache.maven.DefaultMaven.buildGraph (DefaultMaven.java:507)
    at org.apache.maven.DefaultMaven.doExecute (DefaultMaven.java:219)
    at org.apache.maven.DefaultMaven.doExecute (DefaultMaven.java:192)
    at org.apache.maven.DefaultMaven.execute (DefaultMaven.java:105)
    at org.apache.maven.cli.MavenCli.execute (MavenCli.java:954)
    at org.apache.maven.cli.MavenCli.doMain (MavenCli.java:288)
    at org.apache.maven.cli.MavenCli.main (MavenCli.java:192)
    at sun.reflect.NativeMethodAccessorImpl.invoke0 (Native Method)
    at sun.reflect.NativeMethodAccessorImpl.invoke (NativeMethodAccessorImpl.java:57)
    at sun.reflect.DelegatingMethodAccessorImpl.invoke (DelegatingMethodAccessorImpl.java:43)
    at java.lang.reflect.Method.invoke (Method.java:606)
    at org.codehaus.plexus.classworlds.launcher.Launcher.launchEnhanced (Launcher.java:289)
    at org.codehaus.plexus.classworlds.launcher.Launcher.launch (Launcher.java:229)
    at org.codehaus.plexus.classworlds.launcher.Launcher.mainWithExitCode (Launcher.java:415)
    at org.codehaus.plexus.classworlds.launcher.Launcher.main (Launcher.java:356)
[ERROR]  
[ERROR]   The project org.apache.maven:maven:3.5.4-SNAPSHOT (/home/jenkins/jenkins-slave/workspace/6012-Missing-Profile-At-End-NV65RIHRGCFERCSO63AAVCWOOI55DEISPSKXXGPL3ZV62GNYNAOQ/build/pom.xml) has 1 error
[ERROR]     Non-resolvable parent POM for org.apache.maven:maven:3.5.4-SNAPSHOT: Could not transfer artifact org.apache.maven:maven-parent:pom:31 from/to central (https://repo.maven.apache.org/maven2): Received fatal alert: protocol_version and 'parent.relativePath' points at wrong local POM @ line 25, column 11 -> [Help 2]
org.apache.maven.model.resolution.UnresolvableModelException: Could not transfer artifact org.apache.maven:maven-parent:pom:31 from/to central (https://repo.maven.apache.org/maven2): Received fatal alert: protocol_version
    at org.apache.maven.project.ProjectModelResolver.resolveModel (ProjectModelResolver.java:197)
    at org.apache.maven.project.ProjectModelResolver.resolveModel (ProjectModelResolver.java:243)
    at org.apache.maven.model.building.DefaultModelBuilder.readParentExternally (DefaultModelBuilder.java:1052)
    at org.apache.maven.model.building.DefaultModelBuilder.readParent (DefaultModelBuilder.java:830)
    at org.apache.maven.model.building.DefaultModelBuilder.build (DefaultModelBuilder.java:332)
    at org.apache.maven.project.DefaultProjectBuilder.build (DefaultProjectBuilder.java:432)
    at org.apache.maven.project.DefaultProjectBuilder.build (DefaultProjectBuilder.java:400)
    at org.apache.maven.project.DefaultProjectBuilder.build (DefaultProjectBuilder.java:363)
    at org.apache.maven.graph.DefaultGraphBuilder.collectProjects (DefaultGraphBuilder.java:414)
    at org.apache.maven.graph.DefaultGraphBuilder.getProjectsForMavenReactor (DefaultGraphBuilder.java:405)
    at org.apache.maven.graph.DefaultGraphBuilder.build (DefaultGraphBuilder.java:82)
    at org.apache.maven.DefaultMaven.buildGraph (DefaultMaven.java:507)
    at org.apache.maven.DefaultMaven.doExecute (DefaultMaven.java:219)
    at org.apache.maven.DefaultMaven.doExecute (DefaultMaven.java:192)
    at org.apache.maven.DefaultMaven.execute (DefaultMaven.java:105)
    at org.apache.maven.cli.MavenCli.execute (MavenCli.java:954)
    at org.apache.maven.cli.MavenCli.doMain (MavenCli.java:288)
    at org.apache.maven.cli.MavenCli.main (MavenCli.java:192)
    at sun.reflect.NativeMethodAccessorImpl.invoke0 (Native Method)
    at sun.reflect.NativeMethodAccessorImpl.invoke (NativeMethodAccessorImpl.java:57)
    at sun.reflect.DelegatingMethodAccessorImpl.invoke (DelegatingMethodAccessorImpl.java:43)
    at java.lang.reflect.Method.invoke (Method.java:606)
    at org.codehaus.plexus.classworlds.launcher.Launcher.launchEnhanced (Launcher.java:289)
    at org.codehaus.plexus.classworlds.launcher.Launcher.launch (Launcher.java:229)
    at org.codehaus.plexus.classworlds.launcher.Launcher.mainWithExitCode (Launcher.java:415)
    at org.codehaus.plexus.classworlds.launcher.Launcher.main (Launcher.java:356)
Caused by: org.eclipse.aether.resolution.ArtifactResolutionException: Could not transfer artifact org.apache.maven:maven-parent:pom:31 from/to central (https://repo.maven.apache.org/maven2): Received fatal alert: protocol_version
    at org.eclipse.aether.internal.impl.DefaultArtifactResolver.resolve (DefaultArtifactResolver.java:422)
    at org.eclipse.aether.internal.impl.DefaultArtifactResolver.resolveArtifacts (DefaultArtifactResolver.java:224)
    at org.eclipse.aether.internal.impl.DefaultArtifactResolver.resolveArtifact (DefaultArtifactResolver.java:201)
    at org.eclipse.aether.internal.impl.DefaultRepositorySystem.resolveArtifact (DefaultRepositorySystem.java:260)
    at org.apache.maven.project.ProjectModelResolver.resolveModel (ProjectModelResolver.java:193)
    at org.apache.maven.project.ProjectModelResolver.resolveModel (ProjectModelResolver.java:243)
    at org.apache.maven.model.building.DefaultModelBuilder.readParentExternally (DefaultModelBuilder.java:1052)
    at org.apache.maven.model.building.DefaultModelBuilder.readParent (DefaultModelBuilder.java:830)
    at org.apache.maven.model.building.DefaultModelBuilder.build (DefaultModelBuilder.java:332)
    at org.apache.maven.project.DefaultProjectBuilder.build (DefaultProjectBuilder.java:432)
    at org.apache.maven.project.DefaultProjectBuilder.build (DefaultProjectBuilder.java:400)
    at org.apache.maven.project.DefaultProjectBuilder.build (DefaultProjectBuilder.java:363)
    at org.apache.maven.graph.DefaultGraphBuilder.collectProjects (DefaultGraphBuilder.java:414)
    at org.apache.maven.graph.DefaultGraphBuilder.getProjectsForMavenReactor (DefaultGraphBuilder.java:405)
    at org.apache.maven.graph.DefaultGraphBuilder.build (DefaultGraphBuilder.java:82)
    at org.apache.maven.DefaultMaven.buildGraph (DefaultMaven.java:507)
    at org.apache.maven.DefaultMaven.doExecute (DefaultMaven.java:219)
    at org.apache.maven.DefaultMaven.doExecute (DefaultMaven.java:192)
    at org.apache.maven.DefaultMaven.execute (DefaultMaven.java:105)
    at org.apache.maven.cli.MavenCli.execute (MavenCli.java:954)
    at org.apache.maven.cli.MavenCli.doMain (MavenCli.java:288)
    at org.apache.maven.cli.MavenCli.main (MavenCli.java:192)
    at sun.reflect.NativeMethodAccessorImpl.invoke0 (Native Method)
    at sun.reflect.NativeMethodAccessorImpl.invoke (NativeMethodAccessorImpl.java:57)
    at sun.reflect.DelegatingMethodAccessorImpl.invoke (DelegatingMethodAccessorImpl.java:43)
    at java.lang.reflect.Method.invoke (Method.java:606)
    at org.codehaus.plexus.classworlds.launcher.Launcher.launchEnhanced (Launcher.java:289)
    at org.codehaus.plexus.classworlds.launcher.Launcher.launch (Launcher.java:229)
    at org.codehaus.plexus.classworlds.launcher.Launcher.mainWithExitCode (Launcher.java:415)
    at org.codehaus.plexus.classworlds.launcher.Launcher.main (Launcher.java:356)
Caused by: org.eclipse.aether.transfer.ArtifactTransferException: Could not transfer artifact org.apache.maven:maven-parent:pom:31 from/to central (https://repo.maven.apache.org/maven2): Received fatal alert: protocol_version
    at org.eclipse.aether.connector.basic.ArtifactTransportListener.transferFailed (ArtifactTransportListener.java:52)
    at org.eclipse.aether.connector.basic.BasicRepositoryConnector$TaskRunner.run (BasicRepositoryConnector.java:365)
    at org.eclipse.aether.util.concurrency.RunnableErrorForwarder$1.run (RunnableErrorForwarder.java:75)
    at org.eclipse.aether.connector.basic.BasicRepositoryConnector$DirectExecutor.execute (BasicRepositoryConnector.java:583)
    at org.eclipse.aether.connector.basic.BasicRepositoryConnector.get (BasicRepositoryConnector.java:259)
    at org.eclipse.aether.internal.impl.DefaultArtifactResolver.performDownloads (DefaultArtifactResolver.java:498)
    at org.eclipse.aether.internal.impl.DefaultArtifactResolver.resolve (DefaultArtifactResolver.java:399)
    at org.eclipse.aether.internal.impl.DefaultArtifactResolver.resolveArtifacts (DefaultArtifactResolver.java:224)
    at org.eclipse.aether.internal.impl.DefaultArtifactResolver.resolveArtifact (DefaultArtifactResolver.java:201)
    at org.eclipse.aether.internal.impl.DefaultRepositorySystem.resolveArtifact (DefaultRepositorySystem.java:260)
    at org.apache.maven.project.ProjectModelResolver.resolveModel (ProjectModelResolver.java:193)
    at org.apache.maven.project.ProjectModelResolver.resolveModel (ProjectModelResolver.java:243)
    at org.apache.maven.model.building.DefaultModelBuilder.readParentExternally (DefaultModelBuilder.java:1052)
    at org.apache.maven.model.building.DefaultModelBuilder.readParent (DefaultModelBuilder.java:830)
    at org.apache.maven.model.building.DefaultModelBuilder.build (DefaultModelBuilder.java:332)
    at org.apache.maven.project.DefaultProjectBuilder.build (DefaultProjectBuilder.java:432)
    at org.apache.maven.project.DefaultProjectBuilder.build (DefaultProjectBuilder.java:400)
    at org.apache.maven.project.DefaultProjectBuilder.build (DefaultProjectBuilder.java:363)
    at org.apache.maven.graph.DefaultGraphBuilder.collectProjects (DefaultGraphBuilder.java:414)
    at org.apache.maven.graph.DefaultGraphBuilder.getProjectsForMavenReactor (DefaultGraphBuilder.java:405)
    at org.apache.maven.graph.DefaultGraphBuilder.build (DefaultGraphBuilder.java:82)
    at org.apache.maven.DefaultMaven.buildGraph (DefaultMaven.java:507)
    at org.apache.maven.DefaultMaven.doExecute (DefaultMaven.java:219)
    at org.apache.maven.DefaultMaven.doExecute (DefaultMaven.java:192)
    at org.apache.maven.DefaultMaven.execute (DefaultMaven.java:105)
    at org.apache.maven.cli.MavenCli.execute (MavenCli.java:954)
    at org.apache.maven.cli.MavenCli.doMain (MavenCli.java:288)
    at org.apache.maven.cli.MavenCli.main (MavenCli.java:192)
    at sun.reflect.NativeMethodAccessorImpl.invoke0 (Native Method)
    at sun.reflect.NativeMethodAccessorImpl.invoke (NativeMethodAccessorImpl.java:57)
    at sun.reflect.DelegatingMethodAccessorImpl.invoke (DelegatingMethodAccessorImpl.java:43)
    at java.lang.reflect.Method.invoke (Method.java:606)
    at org.codehaus.plexus.classworlds.launcher.Launcher.launchEnhanced (Launcher.java:289)
    at org.codehaus.plexus.classworlds.launcher.Launcher.launch (Launcher.java:229)
    at org.codehaus.plexus.classworlds.launcher.Launcher.mainWithExitCode (Launcher.java:415)
    at org.codehaus.plexus.classworlds.launcher.Launcher.main (Launcher.java:356)
Caused by: org.apache.maven.wagon.TransferFailedException: Received fatal alert: protocol_version
    at org.apache.maven.wagon.providers.http.wagon.shared.AbstractHttpClientWagon.fillInputData (AbstractHttpClientWagon.java:1069)
    at org.apache.maven.wagon.providers.http.wagon.shared.AbstractHttpClientWagon.fillInputData (AbstractHttpClientWagon.java:963)
    at org.apache.maven.wagon.StreamWagon.getInputStream (StreamWagon.java:126)
    at org.apache.maven.wagon.StreamWagon.getIfNewer (StreamWagon.java:88)
    at org.apache.maven.wagon.StreamWagon.get (StreamWagon.java:61)
    at org.eclipse.aether.transport.wagon.WagonTransporter$GetTaskRunner.run (WagonTransporter.java:567)
    at org.eclipse.aether.transport.wagon.WagonTransporter.execute (WagonTransporter.java:435)
    at org.eclipse.aether.transport.wagon.WagonTransporter.get (WagonTransporter.java:412)
    at org.eclipse.aether.connector.basic.BasicRepositoryConnector$GetTaskRunner.runTask (BasicRepositoryConnector.java:453)
    at org.eclipse.aether.connector.basic.BasicRepositoryConnector$TaskRunner.run (BasicRepositoryConnector.java:360)
    at org.eclipse.aether.util.concurrency.RunnableErrorForwarder$1.run (RunnableErrorForwarder.java:75)
    at org.eclipse.aether.connector.basic.BasicRepositoryConnector$DirectExecutor.execute (BasicRepositoryConnector.java:583)
    at org.eclipse.aether.connector.basic.BasicRepositoryConnector.get (BasicRepositoryConnector.java:259)
    at org.eclipse.aether.internal.impl.DefaultArtifactResolver.performDownloads (DefaultArtifactResolver.java:498)
    at org.eclipse.aether.internal.impl.DefaultArtifactResolver.resolve (DefaultArtifactResolver.java:399)
    at org.eclipse.aether.internal.impl.DefaultArtifactResolver.resolveArtifacts (DefaultArtifactResolver.java:224)
    at org.eclipse.aether.internal.impl.DefaultArtifactResolver.resolveArtifact (DefaultArtifactResolver.java:201)
    at org.eclipse.aether.internal.impl.DefaultRepositorySystem.resolveArtifact (DefaultRepositorySystem.java:260)
    at org.apache.maven.project.ProjectModelResolver.resolveModel (ProjectModelResolver.java:193)
    at org.apache.maven.project.ProjectModelResolver.resolveModel (ProjectModelResolver.java:243)
    at org.apache.maven.model.building.DefaultModelBuilder.readParentExternally (DefaultModelBuilder.java:1052)
    at org.apache.maven.model.building.DefaultModelBuilder.readParent (DefaultModelBuilder.java:830)
    at org.apache.maven.model.building.DefaultModelBuilder.build (DefaultModelBuilder.java:332)
    at org.apache.maven.project.DefaultProjectBuilder.build (DefaultProjectBuilder.java:432)
    at org.apache.maven.project.DefaultProjectBuilder.build (DefaultProjectBuilder.java:400)
    at org.apache.maven.project.DefaultProjectBuilder.build (DefaultProjectBuilder.java:363)
    at org.apache.maven.graph.DefaultGraphBuilder.collectProjects (DefaultGraphBuilder.java:414)
    at org.apache.maven.graph.DefaultGraphBuilder.getProjectsForMavenReactor (DefaultGraphBuilder.java:405)
    at org.apache.maven.graph.DefaultGraphBuilder.build (DefaultGraphBuilder.java:82)
    at org.apache.maven.DefaultMaven.buildGraph (DefaultMaven.java:507)
    at org.apache.maven.DefaultMaven.doExecute (DefaultMaven.java:219)
    at org.apache.maven.DefaultMaven.doExecute (DefaultMaven.java:192)
    at org.apache.maven.DefaultMaven.execute (DefaultMaven.java:105)
    at org.apache.maven.cli.MavenCli.execute (MavenCli.java:954)
    at org.apache.maven.cli.MavenCli.doMain (MavenCli.java:288)
    at org.apache.maven.cli.MavenCli.main (MavenCli.java:192)
    at sun.reflect.NativeMethodAccessorImpl.invoke0 (Native Method)
    at sun.reflect.NativeMethodAccessorImpl.invoke (NativeMethodAccessorImpl.java:57)
    at sun.reflect.DelegatingMethodAccessorImpl.invoke (DelegatingMethodAccessorImpl.java:43)
    at java.lang.reflect.Method.invoke (Method.java:606)
    at org.codehaus.plexus.classworlds.launcher.Launcher.launchEnhanced (Launcher.java:289)
    at org.codehaus.plexus.classworlds.launcher.Launcher.launch (Launcher.java:229)
    at org.codehaus.plexus.classworlds.launcher.Launcher.mainWithExitCode (Launcher.java:415)
    at org.codehaus.plexus.classworlds.launcher.Launcher.main (Launcher.java:356)
Caused by: javax.net.ssl.SSLException: Received fatal alert: protocol_version
    at sun.security.ssl.Alerts.getSSLException (Alerts.java:208)
    at sun.security.ssl.Alerts.getSSLException (Alerts.java:154)
    at sun.security.ssl.SSLSocketImpl.recvAlert (SSLSocketImpl.java:1979)
    at sun.security.ssl.SSLSocketImpl.readRecord (SSLSocketImpl.java:1086)
    at sun.security.ssl.SSLSocketImpl.performInitialHandshake (SSLSocketImpl.java:1332)
    at sun.security.ssl.SSLSocketImpl.startHandshake (SSLSocketImpl.java:1359)
    at sun.security.ssl.SSLSocketImpl.startHandshake (SSLSocketImpl.java:1343)
    at org.apache.maven.wagon.providers.http.httpclient.conn.ssl.SSLConnectionSocketFactory.createLayeredSocket (SSLConnectionSocketFactory.java:396)
    at org.apache.maven.wagon.providers.http.httpclient.conn.ssl.SSLConnectionSocketFactory.connectSocket (SSLConnectionSocketFactory.java:355)
    at org.apache.maven.wagon.providers.http.httpclient.impl.conn.DefaultHttpClientConnectionOperator.connect (DefaultHttpClientConnectionOperator.java:142)
    at org.apache.maven.wagon.providers.http.httpclient.impl.conn.PoolingHttpClientConnectionManager.connect (PoolingHttpClientConnectionManager.java:373)
    at org.apache.maven.wagon.providers.http.httpclient.impl.execchain.MainClientExec.establishRoute (MainClientExec.java:381)
    at org.apache.maven.wagon.providers.http.httpclient.impl.execchain.MainClientExec.execute (MainClientExec.java:237)
    at org.apache.maven.wagon.providers.http.httpclient.impl.execchain.ProtocolExec.execute (ProtocolExec.java:185)
    at org.apache.maven.wagon.providers.http.httpclient.impl.execchain.RetryExec.execute (RetryExec.java:89)
    at org.apache.maven.wagon.providers.http.httpclient.impl.execchain.RedirectExec.execute (RedirectExec.java:111)
    at org.apache.maven.wagon.providers.http.httpclient.impl.client.InternalHttpClient.doExecute (InternalHttpClient.java:185)
    at org.apache.maven.wagon.providers.http.httpclient.impl.client.CloseableHttpClient.execute (CloseableHttpClient.java:83)
    at org.apache.maven.wagon.providers.http.wagon.shared.AbstractHttpClientWagon.execute (AbstractHttpClientWagon.java:825)
    at org.apache.maven.wagon.providers.http.wagon.shared.AbstractHttpClientWagon.fillInputData (AbstractHttpClientWagon.java:986)
    at org.apache.maven.wagon.providers.http.wagon.shared.AbstractHttpClientWagon.fillInputData (AbstractHttpClientWagon.java:963)
    at org.apache.maven.wagon.StreamWagon.getInputStream (StreamWagon.java:126)
    at org.apache.maven.wagon.StreamWagon.getIfNewer (StreamWagon.java:88)
    at org.apache.maven.wagon.StreamWagon.get (StreamWagon.java:61)
    at org.eclipse.aether.transport.wagon.WagonTransporter$GetTaskRunner.run (WagonTransporter.java:567)
    at org.eclipse.aether.transport.wagon.WagonTransporter.execute (WagonTransporter.java:435)
    at org.eclipse.aether.transport.wagon.WagonTransporter.get (WagonTransporter.java:412)
    at org.eclipse.aether.connector.basic.BasicRepositoryConnector$GetTaskRunner.runTask (BasicRepositoryConnector.java:453)
    at org.eclipse.aether.connector.basic.BasicRepositoryConnector$TaskRunner.run (BasicRepositoryConnector.java:360)
    at org.eclipse.aether.util.concurrency.RunnableErrorForwarder$1.run (RunnableErrorForwarder.java:75)
    at org.eclipse.aether.connector.basic.BasicRepositoryConnector$DirectExecutor.execute (BasicRepositoryConnector.java:583)
    at org.eclipse.aether.connector.basic.BasicRepositoryConnector.get (BasicRepositoryConnector.java:259)
    at org.eclipse.aether.internal.impl.DefaultArtifactResolver.performDownloads (DefaultArtifactResolver.java:498)
    at org.eclipse.aether.internal.impl.DefaultArtifactResolver.resolve (DefaultArtifactResolver.java:399)
    at org.eclipse.aether.internal.impl.DefaultArtifactResolver.resolveArtifacts (DefaultArtifactResolver.java:224)
    at org.eclipse.aether.internal.impl.DefaultArtifactResolver.resolveArtifact (DefaultArtifactResolver.java:201)
    at org.eclipse.aether.internal.impl.DefaultRepositorySystem.resolveArtifact (DefaultRepositorySystem.java:260)
    at org.apache.maven.project.ProjectModelResolver.resolveModel (ProjectModelResolver.java:193)
    at org.apache.maven.project.ProjectModelResolver.resolveModel (ProjectModelResolver.java:243)
    at org.apache.maven.model.building.DefaultModelBuilder.readParentExternally (DefaultModelBuilder.java:1052)
    at org.apache.maven.model.building.DefaultModelBuilder.readParent (DefaultModelBuilder.java:830)
    at org.apache.maven.model.building.DefaultModelBuilder.build (DefaultModelBuilder.java:332)
    at org.apache.maven.project.DefaultProjectBuilder.build (DefaultProjectBuilder.java:432)
    at org.apache.maven.project.DefaultProjectBuilder.build (DefaultProjectBuilder.java:400)
    at org.apache.maven.project.DefaultProjectBuilder.build (DefaultProjectBuilder.java:363)
    at org.apache.maven.graph.DefaultGraphBuilder.collectProjects (DefaultGraphBuilder.java:414)
    at org.apache.maven.graph.DefaultGraphBuilder.getProjectsForMavenReactor (DefaultGraphBuilder.java:405)
    at org.apache.maven.graph.DefaultGraphBuilder.build (DefaultGraphBuilder.java:82)
    at org.apache.maven.DefaultMaven.buildGraph (DefaultMaven.java:507)
    at org.apache.maven.DefaultMaven.doExecute (DefaultMaven.java:219)
    at org.apache.maven.DefaultMaven.doExecute (DefaultMaven.java:192)
    at org.apache.maven.DefaultMaven.execute (DefaultMaven.java:105)
    at org.apache.maven.cli.MavenCli.execute (MavenCli.java:954)
    at org.apache.maven.cli.MavenCli.doMain (MavenCli.java:288)
    at org.apache.maven.cli.MavenCli.main (MavenCli.java:192)
    at sun.reflect.NativeMethodAccessorImpl.invoke0 (Native Method)
    at sun.reflect.NativeMethodAccessorImpl.invoke (NativeMethodAccessorImpl.java:57)
    at sun.reflect.DelegatingMethodAccessorImpl.invoke (DelegatingMethodAccessorImpl.java:43)
    at java.lang.reflect.Method.invoke (Method.java:606)
    at org.codehaus.plexus.classworlds.launcher.Launcher.launchEnhanced (Launcher.java:289)
    at org.codehaus.plexus.classworlds.launcher.Launcher.launch (Launcher.java:229)
    at org.codehaus.plexus.classworlds.launcher.Launcher.mainWithExitCode (Launcher.java:415)
    at org.codehaus.plexus.classworlds.launcher.Launcher.main (Launcher.java:356)
[ERROR]
[ERROR] Re-run Maven using the -X switch to enable full debug logging.
[ERROR]
[ERROR] For more information about the errors and possible solutions, please read the following articles:
[ERROR] [Help 1] http://cwiki.apache.org/confluence/display/MAVEN/ProjectBuildingException
[ERROR] [Help 2] http://cwiki.apache.org/confluence/display/MAVEN/UnresolvableModelException
[Pipeline] }
[Fast Archiver] No prior successful build to compare, so performing full copy of artifacts
[Pipeline] // withMaven
[Pipeline] }
[Pipeline] // stage
[Pipeline] }
[Pipeline] // dir
[Pipeline] }
[Pipeline] // node
[Pipeline] stage
[Pipeline] { (Notifications)
[Pipeline] echo
Build result: FAILURE
[Pipeline] jiraIssueSelector
[Pipeline] emailext
Reply | Threaded
Open this post in threaded view
|

Build failed in Jenkins: Maven TLP » maven » MNG-6012-Missing-Profile-At-End #16

Apache Jenkins Server-2
See https://builds.apache.org/job/maven-box/job/maven/job/MNG-6012-Missing-Profile-At-End/16/

Changes:

* [MNG-6362] - Adding CONTRIBUTING, README.md pull_request_template for
* Add .factorypath from m2e to .gitignore
* updated model version to latest 1.1.0
* [MNG-6363] - Remove secret thread configuration property from code
* because it is so more convenient to have this quick guide here when you
* Fix missing/improper use of @link
* [MNG-6386] ${project.baseUri} is not a valid URI (according to RFC 3986)
* [MNG-5756] Java home output in mvn -v is misleading
* [MNG-6403] Artifact#VERSION_FILE_PATTERN does not escape period between
* Move ArtifactUtilsTest and friends from maven-compat to maven-artifact
* [MNG-6382][MNG-6372] upgraded Jansi to 1.17.1
* [MNG-6411] Improve readability of project list returned when
* added "Run ITs" prefix to IT stage names
* [MNG-6410] Add groupId to --resume-from suggestion if artifactId is not
* simplified Jenkinsfile: avoid copy/paste
* magnify a bit this line :-)
* Build core with JDK8 due to 'Received fatal alert: protocol_version'
* [MNG-6423] Upgrade to Wagon 3.1.0
* [MNG-6364] run Core ITs also with Java 9
* [MNG-6344] Upgrade Guice to 4.2.0
* [MNG-5940] Change the maven-source-plugin jar goal into jar-no-fork in
* [maven-release-plugin] prepare release maven-3.5.4
* [maven-release-plugin] prepare for next development iteration
* Master is now on 3.6.0-SNAPSHOT
* [INFRA-16467] move components documentation out of CMS space
* update doap
* [MNG-6424] - Upgrade plexus-interpolation to 1.25
* Set https.protocols when running with JDK 7
* Set https.protocols when running with JDK 7
* Set https.protocols when running with JDK 7
* Set https.protocols when running with JDK 7
* reorganised dependency graph: group consumer vs build modules
* Replace org.apache.commons.lang3.Validate#notNull with
* [MNGSITE-339] Broken link: Mailing lists
* minor grammar fixes
* [MNG-6449] - Upgrade parent to 32
* [MGN-6383] - ProjectBuilder unnecessarily rebuilds modules with
* improved documentation
* fixed typo + little javadoc improvements
* fixed dependency schema: model-builder depends on artifact
* [MNG-6467] - Remove plugin definition from pom file which is inherited
* Update Jenkins build to use Maven 3.5.4 (#179)
* [MNG-6473] Update Mockito to 2.21.0 (#181)
* [MNG-6475] Remove unused Guava dependencies
* [MNG-6311] Implement class-level ModelCache in DefaultProjectBuilder to
* [MNG-6478] upgraded parent to 33 for sha512 checksum on release
* [MNG-6414] Add more Apache license header patterns to skip downloading
* [MNG-5951] add an option to avoid path addition to inherited URLs
* [MNG-6358] indented code for better understanding
* [MNG-6358] improved licenses sources for inclusion
* [MNG-6479] Upgrade XMLUnit to 2.2.1 (#183)
* [MNG-6480] get non-Apache license from local resource
* Excluded the license files cause they do not contain a license of
* [MNG-6415] Project Artifacts Cache does not retain the order of
* [MNG-6486] Upgrade to Wagon 3.2.0
* Fixed typo in exception logging LegacyRepositorySystem
* [MNG-6164] Collections inconsistently immutable
* [MNG-6489] Upgrade Maven Resolver to 1.3.0
* [MNG-6491] upgraded commons-lang3 to fix tests failure with JDK 10/11
* [MNG-6496] Upgrade Maven Resolver to 1.3.1
* Repair Jenkins job - add a full path to workspace when run on Windows
* [MNG-6391] - Printout version of last built module in reactor build
* [MNG-6490] Maven shall not fail reporting circular dependency when the
* [MNG-6492] - Minor improvement on Array construction, conversion
* [MNG-6497] - Upgrade guava / guice
* [maven-release-plugin] prepare release maven-3.6.0
* [maven-release-plugin] prepare for next development iteration
* removed extra # in generated content
* Updated DOAP for Maven Core Release 3.6.0
* WIP - [MNG-6012] Missing profile is only notified at the end of a run  o

All tests passed

Build log:
[...truncated 443.42 KB...]
[INFO] Downloaded from central: https://repo.maven.apache.org/maven2/org/apache/maven/shared/maven-artifact-transfer/0.9.1/maven-artifact-transfer-0.9.1.jar (123 kB at 3.3 MB/s)
[INFO] Downloaded from central: https://repo.maven.apache.org/maven2/commons-codec/commons-codec/1.6/commons-codec-1.6.jar (233 kB at 5.4 MB/s)
[INFO] Downloaded from central: https://repo.maven.apache.org/maven2/org/slf4j/slf4j-api/1.7.5/slf4j-api-1.7.5.jar (26 kB at 607 kB/s)
[INFO] Downloaded from central: https://repo.maven.apache.org/maven2/org/apache/commons/commons-compress/1.16.1/commons-compress-1.16.1.jar (560 kB at 13 MB/s)
[INFO] Configured Artifact: org.slf4j:slf4j-simple:sources:1.7.25:jar
[INFO] Downloading from central: https://repo.maven.apache.org/maven2/org/slf4j/slf4j-simple/1.7.25/slf4j-simple-1.7.25-sources.jar
[INFO] Downloaded from central: https://repo.maven.apache.org/maven2/org/slf4j/slf4j-simple/1.7.25/slf4j-simple-1.7.25-sources.jar (14 kB at 987 kB/s)
[INFO] Unpacking /home/jenkins/jenkins-slave/workspace/6012-Missing-Profile-At-End-NV65RIHRGCFERCSO63AAVCWOOI55DEISPSKXXGPL3ZV62GNYNAOQ/build/.repository/org/slf4j/slf4j-simple/1.7.25/slf4j-simple-1.7.25-sources.jar to /home/jenkins/jenkins-slave/workspace/6012-Missing-Profile-At-End-NV65RIHRGCFERCSO63AAVCWOOI55DEISPSKXXGPL3ZV62GNYNAOQ/build/maven-slf4j-provider/target/generated-sources/slf4j-simple with includes "org/slf4j/impl/*.java" and excludes "org/slf4j/impl/StaticLoggerBinder*"
[INFO]
[INFO] --- maven-remote-resources-plugin:1.5:process (process-resource-bundles) @ maven-slf4j-provider ---
[INFO]
[INFO] --- maven-resources-plugin:3.1.0:resources (default-resources) @ maven-slf4j-provider ---
[INFO] Using 'UTF-8' encoding to copy filtered resources.
[INFO] skip non existing resourceDirectory /home/jenkins/jenkins-slave/workspace/6012-Missing-Profile-At-End-NV65RIHRGCFERCSO63AAVCWOOI55DEISPSKXXGPL3ZV62GNYNAOQ/build/maven-slf4j-provider/src/main/resources
[INFO] Copying 3 resources
[INFO]
[INFO] --- maven-compiler-plugin:3.7.0:compile (default-compile) @ maven-slf4j-provider ---
[INFO] Changes detected - recompiling the module!
[INFO] Compiling 9 source files to /home/jenkins/jenkins-slave/workspace/6012-Missing-Profile-At-End-NV65RIHRGCFERCSO63AAVCWOOI55DEISPSKXXGPL3ZV62GNYNAOQ/build/maven-slf4j-provider/target/classes
[INFO]
[INFO] --- animal-sniffer-maven-plugin:1.15:check (check-java-compat) @ maven-slf4j-provider ---
[INFO] Checking unresolved references to org.codehaus.mojo.signature:java17:1.0
[INFO]
[INFO] --- maven-resources-plugin:3.1.0:testResources (default-testResources) @ maven-slf4j-provider ---
[INFO] Using 'UTF-8' encoding to copy filtered resources.
[INFO] skip non existing resourceDirectory /home/jenkins/jenkins-slave/workspace/6012-Missing-Profile-At-End-NV65RIHRGCFERCSO63AAVCWOOI55DEISPSKXXGPL3ZV62GNYNAOQ/build/maven-slf4j-provider/src/test/resources
[INFO] Copying 3 resources
[INFO]
[INFO] --- maven-compiler-plugin:3.7.0:testCompile (default-testCompile) @ maven-slf4j-provider ---
[INFO] No sources to compile
[INFO]
[INFO] --- maven-surefire-plugin:2.22.0:test (default-test) @ maven-slf4j-provider ---
[INFO]
[INFO] --- maven-jar-plugin:3.1.0:jar (default-jar) @ maven-slf4j-provider ---
[INFO] Building jar: /home/jenkins/jenkins-slave/workspace/6012-Missing-Profile-At-End-NV65RIHRGCFERCSO63AAVCWOOI55DEISPSKXXGPL3ZV62GNYNAOQ/build/maven-slf4j-provider/target/maven-slf4j-provider-3.6.1-SNAPSHOT.jar
[INFO]
[INFO] --- maven-site-plugin:3.7.1:attach-descriptor (attach-descriptor) @ maven-slf4j-provider ---
[INFO] Skipping because packaging 'jar' is not pom.
[INFO]
[INFO] --- maven-checkstyle-plugin:3.0.0:check (checkstyle-check) @ maven-slf4j-provider ---
[INFO]
[INFO] ------------------------------------------------------------------------
[INFO] Skipping Maven Embedder
[INFO] This project has been banned from the build due to previous failures.
[INFO] ------------------------------------------------------------------------
[INFO]
[INFO] ------------------------------------------------------------------------
[INFO] Skipping Maven Compat
[INFO] This project has been banned from the build due to previous failures.
[INFO] ------------------------------------------------------------------------
[INFO]
[INFO] ------------------------------------------------------------------------
[INFO] Skipping Apache Maven Distribution
[INFO] This project has been banned from the build due to previous failures.
[INFO] ------------------------------------------------------------------------
[INFO] ------------------------------------------------------------------------
[INFO] Reactor Summary:
[INFO]
[INFO] Apache Maven 3.6.1-SNAPSHOT ........................ SUCCESS [ 13.617 s]
[INFO] Maven Model ........................................ SUCCESS [  6.675 s]
[INFO] Maven Artifact ..................................... SUCCESS [  2.982 s]
[INFO] Maven Plugin API ................................... SUCCESS [  2.196 s]
[INFO] Maven Builder Support .............................. SUCCESS [  1.373 s]
[INFO] Maven Model Builder ................................ SUCCESS [  6.799 s]
[INFO] Maven Settings ..................................... SUCCESS [  0.817 s]
[INFO] Maven Settings Builder ............................. SUCCESS [  1.752 s]
[INFO] Maven Repository Metadata Model .................... SUCCESS [  0.706 s]
[INFO] Maven Artifact Resolver Provider ................... SUCCESS [  9.810 s]
[INFO] Maven Core ......................................... FAILURE [ 26.510 s]
[INFO] Maven SLF4J Simple Provider ........................ SUCCESS [  3.220 s]
[INFO] Maven Embedder ..................................... SKIPPED
[INFO] Maven Compat ....................................... SKIPPED
[INFO] Apache Maven Distribution 3.6.1-SNAPSHOT ........... SKIPPED
[INFO] ------------------------------------------------------------------------
[INFO] BUILD FAILURE
[INFO] ------------------------------------------------------------------------
[INFO] Total time: 01:17 min
[INFO] Finished at: 2018-11-08T19:31:05Z
[INFO] ------------------------------------------------------------------------
[INFO] [jenkins-event-spy] Generated /home/jenkins/jenkins-slave/workspace/6012-Missing-Profile-At-End-NV65RIHRGCFERCSO63AAVCWOOI55DEISPSKXXGPL3ZV62GNYNAOQ/build@tmp/withMaven3c24162e/maven-spy-20181108-192947-9242555021504521581268.log
[ERROR] Failed to execute goal org.apache.maven.plugins:maven-checkstyle-plugin:3.0.0:check (checkstyle-check) on project maven-core: You have 3 Checkstyle violations. -> [Help 1]
org.apache.maven.lifecycle.LifecycleExecutionException: Failed to execute goal org.apache.maven.plugins:maven-checkstyle-plugin:3.0.0:check (checkstyle-check) on project maven-core: You have 3 Checkstyle violations.
    at org.apache.maven.lifecycle.internal.MojoExecutor.execute (MojoExecutor.java:213)
    at org.apache.maven.lifecycle.internal.MojoExecutor.execute (MojoExecutor.java:154)
    at org.apache.maven.lifecycle.internal.MojoExecutor.execute (MojoExecutor.java:146)
    at org.apache.maven.lifecycle.internal.LifecycleModuleBuilder.buildProject (LifecycleModuleBuilder.java:117)
    at org.apache.maven.lifecycle.internal.LifecycleModuleBuilder.buildProject (LifecycleModuleBuilder.java:81)
    at org.apache.maven.lifecycle.internal.builder.singlethreaded.SingleThreadedBuilder.build (SingleThreadedBuilder.java:56)
    at org.apache.maven.lifecycle.internal.LifecycleStarter.execute (LifecycleStarter.java:128)
    at org.apache.maven.DefaultMaven.doExecute (DefaultMaven.java:305)
    at org.apache.maven.DefaultMaven.doExecute (DefaultMaven.java:192)
    at org.apache.maven.DefaultMaven.execute (DefaultMaven.java:105)
    at org.apache.maven.cli.MavenCli.execute (MavenCli.java:954)
    at org.apache.maven.cli.MavenCli.doMain (MavenCli.java:288)
    at org.apache.maven.cli.MavenCli.main (MavenCli.java:192)
    at sun.reflect.NativeMethodAccessorImpl.invoke0 (Native Method)
    at sun.reflect.NativeMethodAccessorImpl.invoke (NativeMethodAccessorImpl.java:62)
    at sun.reflect.DelegatingMethodAccessorImpl.invoke (DelegatingMethodAccessorImpl.java:43)
    at java.lang.reflect.Method.invoke (Method.java:498)
    at org.codehaus.plexus.classworlds.launcher.Launcher.launchEnhanced (Launcher.java:289)
    at org.codehaus.plexus.classworlds.launcher.Launcher.launch (Launcher.java:229)
    at org.codehaus.plexus.classworlds.launcher.Launcher.mainWithExitCode (Launcher.java:415)
    at org.codehaus.plexus.classworlds.launcher.Launcher.main (Launcher.java:356)
Caused by: org.apache.maven.plugin.MojoFailureException: You have 3 Checkstyle violations.
    at org.apache.maven.plugins.checkstyle.CheckstyleViolationCheckMojo.execute (CheckstyleViolationCheckMojo.java:576)
    at org.apache.maven.plugin.DefaultBuildPluginManager.executeMojo (DefaultBuildPluginManager.java:137)
    at org.apache.maven.lifecycle.internal.MojoExecutor.execute (MojoExecutor.java:208)
    at org.apache.maven.lifecycle.internal.MojoExecutor.execute (MojoExecutor.java:154)
    at org.apache.maven.lifecycle.internal.MojoExecutor.execute (MojoExecutor.java:146)
    at org.apache.maven.lifecycle.internal.LifecycleModuleBuilder.buildProject (LifecycleModuleBuilder.java:117)
    at org.apache.maven.lifecycle.internal.LifecycleModuleBuilder.buildProject (LifecycleModuleBuilder.java:81)
    at org.apache.maven.lifecycle.internal.builder.singlethreaded.SingleThreadedBuilder.build (SingleThreadedBuilder.java:56)
    at org.apache.maven.lifecycle.internal.LifecycleStarter.execute (LifecycleStarter.java:128)
    at org.apache.maven.DefaultMaven.doExecute (DefaultMaven.java:305)
    at org.apache.maven.DefaultMaven.doExecute (DefaultMaven.java:192)
    at org.apache.maven.DefaultMaven.execute (DefaultMaven.java:105)
    at org.apache.maven.cli.MavenCli.execute (MavenCli.java:954)
    at org.apache.maven.cli.MavenCli.doMain (MavenCli.java:288)
    at org.apache.maven.cli.MavenCli.main (MavenCli.java:192)
    at sun.reflect.NativeMethodAccessorImpl.invoke0 (Native Method)
    at sun.reflect.NativeMethodAccessorImpl.invoke (NativeMethodAccessorImpl.java:62)
    at sun.reflect.DelegatingMethodAccessorImpl.invoke (DelegatingMethodAccessorImpl.java:43)
    at java.lang.reflect.Method.invoke (Method.java:498)
    at org.codehaus.plexus.classworlds.launcher.Launcher.launchEnhanced (Launcher.java:289)
    at org.codehaus.plexus.classworlds.launcher.Launcher.launch (Launcher.java:229)
    at org.codehaus.plexus.classworlds.launcher.Launcher.mainWithExitCode (Launcher.java:415)
    at org.codehaus.plexus.classworlds.launcher.Launcher.main (Launcher.java:356)
[ERROR]
[ERROR] Re-run Maven using the -X switch to enable full debug logging.
[ERROR]
[ERROR] For more information about the errors and possible solutions, please read the following articles:
[ERROR] [Help 1] http://cwiki.apache.org/confluence/display/MAVEN/MojoFailureException
[ERROR]
[ERROR] After correcting the problems, you can resume the build with the command
[ERROR]   mvn <goals> -rf :maven-core
[Pipeline] }
[withMaven] artifactsPublisher - Archive artifact pom.xml under org/apache/maven/maven/3.6.1-SNAPSHOT/maven-3.6.1-SNAPSHOT.pom
[withMaven] artifactsPublisher - Archive artifact target/maven-3.6.1-SNAPSHOT-site.xml under org/apache/maven/maven/3.6.1-SNAPSHOT/maven-3.6.1-SNAPSHOT-site.xml
[withMaven] artifactsPublisher - Archive artifact maven-model/pom.xml under org/apache/maven/maven-model/3.6.1-SNAPSHOT/maven-model-3.6.1-SNAPSHOT.pom
[withMaven] artifactsPublisher - Archive artifact maven-model/target/maven-model-3.6.1-SNAPSHOT.jar under org/apache/maven/maven-model/3.6.1-SNAPSHOT/maven-model-3.6.1-SNAPSHOT.jar
[withMaven] artifactsPublisher - Archive artifact maven-artifact/pom.xml under org/apache/maven/maven-artifact/3.6.1-SNAPSHOT/maven-artifact-3.6.1-SNAPSHOT.pom
[withMaven] artifactsPublisher - Archive artifact maven-artifact/target/maven-artifact-3.6.1-SNAPSHOT.jar under org/apache/maven/maven-artifact/3.6.1-SNAPSHOT/maven-artifact-3.6.1-SNAPSHOT.jar
[withMaven] artifactsPublisher - Archive artifact maven-plugin-api/pom.xml under org/apache/maven/maven-plugin-api/3.6.1-SNAPSHOT/maven-plugin-api-3.6.1-SNAPSHOT.pom
[withMaven] artifactsPublisher - Archive artifact maven-plugin-api/target/maven-plugin-api-3.6.1-SNAPSHOT.jar under org/apache/maven/maven-plugin-api/3.6.1-SNAPSHOT/maven-plugin-api-3.6.1-SNAPSHOT.jar
[withMaven] artifactsPublisher - Archive artifact maven-builder-support/pom.xml under org/apache/maven/maven-builder-support/3.6.1-SNAPSHOT/maven-builder-support-3.6.1-SNAPSHOT.pom
[withMaven] artifactsPublisher - Archive artifact maven-builder-support/target/maven-builder-support-3.6.1-SNAPSHOT.jar under org/apache/maven/maven-builder-support/3.6.1-SNAPSHOT/maven-builder-support-3.6.1-SNAPSHOT.jar
[withMaven] artifactsPublisher - Archive artifact maven-model-builder/pom.xml under org/apache/maven/maven-model-builder/3.6.1-SNAPSHOT/maven-model-builder-3.6.1-SNAPSHOT.pom
[withMaven] artifactsPublisher - Archive artifact maven-model-builder/target/maven-model-builder-3.6.1-SNAPSHOT.jar under org/apache/maven/maven-model-builder/3.6.1-SNAPSHOT/maven-model-builder-3.6.1-SNAPSHOT.jar
[withMaven] artifactsPublisher - Archive artifact maven-settings/pom.xml under org/apache/maven/maven-settings/3.6.1-SNAPSHOT/maven-settings-3.6.1-SNAPSHOT.pom
[withMaven] artifactsPublisher - Archive artifact maven-settings/target/maven-settings-3.6.1-SNAPSHOT.jar under org/apache/maven/maven-settings/3.6.1-SNAPSHOT/maven-settings-3.6.1-SNAPSHOT.jar
[withMaven] artifactsPublisher - Archive artifact maven-settings-builder/pom.xml under org/apache/maven/maven-settings-builder/3.6.1-SNAPSHOT/maven-settings-builder-3.6.1-SNAPSHOT.pom
[withMaven] artifactsPublisher - Archive artifact maven-settings-builder/target/maven-settings-builder-3.6.1-SNAPSHOT.jar under org/apache/maven/maven-settings-builder/3.6.1-SNAPSHOT/maven-settings-builder-3.6.1-SNAPSHOT.jar
[withMaven] artifactsPublisher - Archive artifact maven-repository-metadata/pom.xml under org/apache/maven/maven-repository-metadata/3.6.1-SNAPSHOT/maven-repository-metadata-3.6.1-SNAPSHOT.pom
[withMaven] artifactsPublisher - Archive artifact maven-repository-metadata/target/maven-repository-metadata-3.6.1-SNAPSHOT.jar under org/apache/maven/maven-repository-metadata/3.6.1-SNAPSHOT/maven-repository-metadata-3.6.1-SNAPSHOT.jar
[withMaven] artifactsPublisher - Archive artifact maven-resolver-provider/pom.xml under org/apache/maven/maven-resolver-provider/3.6.1-SNAPSHOT/maven-resolver-provider-3.6.1-SNAPSHOT.pom
[withMaven] artifactsPublisher - Archive artifact maven-resolver-provider/target/maven-resolver-provider-3.6.1-SNAPSHOT.jar under org/apache/maven/maven-resolver-provider/3.6.1-SNAPSHOT/maven-resolver-provider-3.6.1-SNAPSHOT.jar
[withMaven] artifactsPublisher - Archive artifact maven-slf4j-provider/pom.xml under org/apache/maven/maven-slf4j-provider/3.6.1-SNAPSHOT/maven-slf4j-provider-3.6.1-SNAPSHOT.pom
[withMaven] artifactsPublisher - Archive artifact maven-slf4j-provider/target/maven-slf4j-provider-3.6.1-SNAPSHOT.jar under org/apache/maven/maven-slf4j-provider/3.6.1-SNAPSHOT/maven-slf4j-provider-3.6.1-SNAPSHOT.jar
[Fast Archiver] No prior successful build to compare, so performing full copy of artifacts
[withMaven] junitPublisher - Archive test results for Maven artifact org.apache.maven:maven-model:3.6.1-SNAPSHOT generated by maven-surefire-plugin:test (default-test): maven-model/target/surefire-reports/*.xml
Recording test results
[withMaven] junitPublisher - Archive test results for Maven artifact org.apache.maven:maven-artifact:3.6.1-SNAPSHOT generated by maven-surefire-plugin:test (default-test): maven-artifact/target/surefire-reports/*.xml
Recording test results
[withMaven] junitPublisher - Archive test results for Maven artifact org.apache.maven:maven-plugin-api:3.6.1-SNAPSHOT generated by maven-surefire-plugin:test (default-test): maven-plugin-api/target/surefire-reports/*.xml
Recording test results
[withMaven] junitPublisher - Archive test results for Maven artifact org.apache.maven:maven-builder-support:3.6.1-SNAPSHOT generated by maven-surefire-plugin:test (default-test): maven-builder-support/target/surefire-reports/*.xml
Recording test results
[withMaven] junitPublisher - Archive test results for Maven artifact org.apache.maven:maven-model-builder:3.6.1-SNAPSHOT generated by maven-surefire-plugin:test (default-test): maven-model-builder/target/surefire-reports/*.xml
Recording test results
[withMaven] junitPublisher - Archive test results for Maven artifact org.apache.maven:maven-settings:3.6.1-SNAPSHOT generated by maven-surefire-plugin:test (default-test): maven-settings/target/surefire-reports/*.xml
Recording test results
None of the test reports contained any result
[withMaven] junitPublisher - Archive test results for Maven artifact org.apache.maven:maven-settings-builder:3.6.1-SNAPSHOT generated by maven-surefire-plugin:test (default-test): maven-settings-builder/target/surefire-reports/*.xml
Recording test results
[withMaven] junitPublisher - Archive test results for Maven artifact org.apache.maven:maven-repository-metadata:3.6.1-SNAPSHOT generated by maven-surefire-plugin:test (default-test): maven-repository-metadata/target/surefire-reports/*.xml
Recording test results
None of the test reports contained any result
[withMaven] junitPublisher - Archive test results for Maven artifact org.apache.maven:maven-resolver-provider:3.6.1-SNAPSHOT generated by maven-surefire-plugin:test (default-test): maven-resolver-provider/target/surefire-reports/*.xml
Recording test results
[withMaven] junitPublisher - Archive test results for Maven artifact org.apache.maven:maven-core:3.6.1-SNAPSHOT generated by maven-surefire-plugin:test (default-test): maven-core/target/surefire-reports/*.xml
Recording test results
[withMaven] junitPublisher - Archive test results for Maven artifact org.apache.maven:maven-slf4j-provider:3.6.1-SNAPSHOT generated by maven-surefire-plugin:test (default-test): maven-slf4j-provider/target/surefire-reports/*.xml
Recording test results
None of the test reports contained any result
[withMaven] openTasksPublisher - Scan Tasks for Maven artifact org.apache.maven:maven-model:3.6.1-SNAPSHOT in source directory maven-model/src/main/java
[withMaven] openTasksPublisher - Scan Tasks for Maven artifact org.apache.maven:maven-artifact:3.6.1-SNAPSHOT in source directory maven-artifact/src/main/java
[withMaven] openTasksPublisher - Scan Tasks for Maven artifact org.apache.maven:maven-plugin-api:3.6.1-SNAPSHOT in source directory maven-plugin-api/src/main/java
[withMaven] openTasksPublisher - Scan Tasks for Maven artifact org.apache.maven:maven-builder-support:3.6.1-SNAPSHOT in source directory maven-builder-support/src/main/java
[withMaven] openTasksPublisher - Scan Tasks for Maven artifact org.apache.maven:maven-model-builder:3.6.1-SNAPSHOT in source directory maven-model-builder/src/main/java
[withMaven] openTasksPublisher - Scan Tasks for Maven artifact org.apache.maven:maven-settings:3.6.1-SNAPSHOT in source directory maven-settings/src/main/java
[withMaven] openTasksPublisher - Scan Tasks for Maven artifact org.apache.maven:maven-settings-builder:3.6.1-SNAPSHOT in source directory maven-settings-builder/src/main/java
[withMaven] openTasksPublisher - Scan Tasks for Maven artifact org.apache.maven:maven-resolver-provider:3.6.1-SNAPSHOT in source directory maven-resolver-provider/src/main/java
[withMaven] openTasksPublisher - Scan Tasks for Maven artifact org.apache.maven:maven-core:3.6.1-SNAPSHOT in source directory maven-core/src/main/java
[withMaven] openTasksPublisher - Scan Tasks for Maven artifact org.apache.maven:maven-slf4j-provider:3.6.1-SNAPSHOT in source directory maven-slf4j-provider/src/main/java
[TASKS] Scanning folder '/home/jenkins/jenkins-slave/workspace/6012-Missing-Profile-At-End-NV65RIHRGCFERCSO63AAVCWOOI55DEISPSKXXGPL3ZV62GNYNAOQ/build' for files matching the pattern 'maven-model/src/main/java/**/*,maven-artifact/src/main/java/**/*,maven-plugin-api/src/main/java/**/*,maven-builder-support/src/main/java/**/*,maven-model-builder/src/main/java/**/*,maven-settings/src/main/java/**/*,maven-settings-builder/src/main/java/**/*,maven-resolver-provider/src/main/java/**/*,maven-core/src/main/java/**/*,maven-slf4j-provider/src/main/java/**/*' - excludes: null
[TASKS] Found 542 files to scan for tasks
[TASKS] Found 105 open tasks.
Skipping warnings blame since pipelines do not have an SCM link.%n
[Pipeline] // withMaven
[Pipeline] }
[Pipeline] // stage
[Pipeline] }
[Pipeline] // dir
[Pipeline] }
[Pipeline] // node
[Pipeline] stage
[Pipeline] { (Notifications)
[Pipeline] echo
Build result: FAILURE
[Pipeline] jiraIssueSelector
[Pipeline] jiraComment
[Pipeline] jiraComment
[Pipeline] jiraComment
[Pipeline] jiraComment
[Pipeline] jiraComment
[Pipeline] jiraComment
[Pipeline] jiraComment
[Pipeline] jiraComment
[Pipeline] jiraComment
[Pipeline] jiraComment
[Pipeline] jiraComment
[Pipeline] jiraComment
[Pipeline] jiraComment
[Pipeline] jiraComment
[Pipeline] jiraComment
[Pipeline] jiraComment
[Pipeline] jiraComment
[Pipeline] jiraComment
[Pipeline] jiraComment
[Pipeline] jiraComment
[Pipeline] jiraComment
[Pipeline] jiraComment
[Pipeline] jiraComment
[Pipeline] jiraComment
[Pipeline] jiraComment
[Pipeline] jiraComment
[Pipeline] jiraComment
[Pipeline] jiraComment
[Pipeline] jiraComment
[Pipeline] jiraComment
[Pipeline] jiraComment
[Pipeline] jiraComment
[Pipeline] jiraComment
[Pipeline] jiraComment
[Pipeline] jiraComment
[Pipeline] jiraComment
[Pipeline] jiraComment
[Pipeline] jiraComment
[Pipeline] emailext