Build failed in Jenkins: Maven TLP » maven » MNG-5222 #14

classic Classic list List threaded Threaded
1 message Options
Reply | Threaded
Open this post in threaded view
|

Build failed in Jenkins: Maven TLP » maven » MNG-5222 #14

Apache Jenkins Server-2
See https://builds.apache.org/job/maven-box/job/maven/job/MNG-5222/14/

Changes:

* Use Java 7 JDK for all released Maven versions and 8 for planned 3.7.x
* Exclude H23
* [INFRA-20239] H23 should be ok now
* Revert: Use Java 7 JDK for all released Maven versions (135a0e16) due to
* Update Maven versions
* There's no M3.6.3 for Windows

All tests passed

Build log:
[...truncated 3943 lines...]
[INFO] --- maven-assembly-plugin:3.3.0:single (default) @ apache-maven-wrapper ---
[INFO] Downloading from central: https://repo.maven.apache.org/maven2/org/codehaus/plexus/plexus-component-annotations/2.0.0/plexus-component-annotations-2.0.0.pom
[INFO] Downloaded from central: https://repo.maven.apache.org/maven2/org/codehaus/plexus/plexus-component-annotations/2.0.0/plexus-component-annotations-2.0.0.pom (750 B at 58 kB/s)
[INFO] Downloading from central: https://repo.maven.apache.org/maven2/org/codehaus/plexus/plexus-containers/2.0.0/plexus-containers-2.0.0.pom
[INFO] Downloaded from central: https://repo.maven.apache.org/maven2/org/codehaus/plexus/plexus-containers/2.0.0/plexus-containers-2.0.0.pom (4.8 kB at 400 kB/s)
[INFO] Downloading from central: https://repo.maven.apache.org/maven2/org/apache/maven/shared/maven-common-artifact-filters/3.1.0/maven-common-artifact-filters-3.1.0.pom
[INFO] Downloaded from central: https://repo.maven.apache.org/maven2/org/apache/maven/shared/maven-common-artifact-filters/3.1.0/maven-common-artifact-filters-3.1.0.pom (5.3 kB at 440 kB/s)
[INFO] Downloading from central: https://repo.maven.apache.org/maven2/org/apache/maven/shared/maven-artifact-transfer/0.11.0/maven-artifact-transfer-0.11.0.pom
[INFO] Downloaded from central: https://repo.maven.apache.org/maven2/org/apache/maven/shared/maven-artifact-transfer/0.11.0/maven-artifact-transfer-0.11.0.pom (11 kB at 818 kB/s)
[INFO] Downloading from central: https://repo.maven.apache.org/maven2/org/codehaus/plexus/plexus-component-annotations/2.0.0/plexus-component-annotations-2.0.0.jar
[INFO] Downloading from central: https://repo.maven.apache.org/maven2/org/apache/maven/shared/maven-artifact-transfer/0.11.0/maven-artifact-transfer-0.11.0.jar
[INFO] Downloading from central: https://repo.maven.apache.org/maven2/org/apache/maven/shared/maven-common-artifact-filters/3.1.0/maven-common-artifact-filters-3.1.0.jar
[INFO] Downloaded from central: https://repo.maven.apache.org/maven2/org/codehaus/plexus/plexus-component-annotations/2.0.0/plexus-component-annotations-2.0.0.jar (4.2 kB at 302 kB/s)
[INFO] Downloaded from central: https://repo.maven.apache.org/maven2/org/apache/maven/shared/maven-common-artifact-filters/3.1.0/maven-common-artifact-filters-3.1.0.jar (61 kB at 3.4 MB/s)
[INFO] Downloaded from central: https://repo.maven.apache.org/maven2/org/apache/maven/shared/maven-artifact-transfer/0.11.0/maven-artifact-transfer-0.11.0.jar (128 kB at 6.4 MB/s)
[INFO] Reading assembly descriptor: src/assembly/wrapper/script.xml
[INFO] Reading assembly descriptor: src/assembly/wrapper/bin.xml
[INFO] Reading assembly descriptor: src/assembly/wrapper/source.xml
[INFO] Building tar: /home/jenkins/jenkins-slave/workspace/maven-box_maven_MNG-5222/build/apache-maven/target/apache-maven-wrapper-3.7.0-SNAPSHOT-script.tar.gz
[INFO] Building zip: /home/jenkins/jenkins-slave/workspace/maven-box_maven_MNG-5222/build/apache-maven/target/apache-maven-wrapper-3.7.0-SNAPSHOT-script.zip
[INFO] Building tar: /home/jenkins/jenkins-slave/workspace/maven-box_maven_MNG-5222/build/apache-maven/target/apache-maven-wrapper-3.7.0-SNAPSHOT-bin.tar.gz
[INFO] Building zip: /home/jenkins/jenkins-slave/workspace/maven-box_maven_MNG-5222/build/apache-maven/target/apache-maven-wrapper-3.7.0-SNAPSHOT-bin.zip
[INFO] Building tar: /home/jenkins/jenkins-slave/workspace/maven-box_maven_MNG-5222/build/apache-maven/target/apache-maven-wrapper-3.7.0-SNAPSHOT-source.tar.gz
[INFO] Building zip: /home/jenkins/jenkins-slave/workspace/maven-box_maven_MNG-5222/build/apache-maven/target/apache-maven-wrapper-3.7.0-SNAPSHOT-source.zip
[WARNING] [jenkins-event-spy] Unexpected Maven project file name 'maven-wrapper.pom', problems may occur
[WARNING] [jenkins-event-spy] Unexpected Maven project file name 'maven-wrapper.pom', problems may occur
[INFO]
[INFO] --- maven-checkstyle-plugin:3.0.0:check (checkstyle-check) @ apache-maven-wrapper ---
[WARNING] [jenkins-event-spy] Unexpected Maven project file name 'maven-wrapper.pom', problems may occur
[WARNING] [jenkins-event-spy] Unexpected Maven project file name 'maven-wrapper.pom', problems may occur
[INFO] ------------------------------------------------------------------------
[INFO] Reactor Summary for Apache Maven 3.7.0-SNAPSHOT:
[INFO]
[INFO] Apache Maven ....................................... SUCCESS [ 15.903 s]
[INFO] Maven Model ........................................ SUCCESS [  8.973 s]
[INFO] Maven Artifact ..................................... SUCCESS [  4.367 s]
[INFO] Maven Plugin API ................................... SUCCESS [  3.610 s]
[INFO] Maven Builder Support .............................. SUCCESS [  1.841 s]
[INFO] Maven XML .......................................... SUCCESS [  3.678 s]
[INFO] Maven Model Builder ................................ SUCCESS [  6.593 s]
[INFO] Maven Settings ..................................... SUCCESS [  1.458 s]
[INFO] Maven Settings Builder ............................. SUCCESS [  2.825 s]
[INFO] Maven Repository Metadata Model .................... SUCCESS [  1.308 s]
[INFO] Maven Artifact Resolver Provider ................... SUCCESS [  6.202 s]
[INFO] Maven Core ......................................... FAILURE [ 27.194 s]
[INFO] Maven SLF4J Wrapper ................................ SUCCESS [  1.971 s]
[INFO] Maven SLF4J Simple Provider ........................ SUCCESS [  3.109 s]
[INFO] Maven Embedder ..................................... SKIPPED
[INFO] Maven Compat ....................................... SKIPPED
[INFO] Apache Maven Distribution .......................... SKIPPED
[INFO] Maven Wrapper ...................................... SUCCESS [  3.243 s]
[INFO] Apache Maven Wrapper Distribution .................. SUCCESS [  2.042 s]
[INFO] ------------------------------------------------------------------------
[INFO] BUILD FAILURE
[INFO] ------------------------------------------------------------------------
[INFO] Total time:  01:34 min
[INFO] Finished at: 2020-06-28T15:37:22Z
[INFO] ------------------------------------------------------------------------
[WARNING] [jenkins-event-spy] Unexpected Maven project file name 'maven-wrapper.pom', problems may occur
[INFO] [jenkins-event-spy] Generated /home/jenkins/jenkins-slave/workspace/maven-box_maven_MNG-5222/build@tmp/withMavenc391e9a1/maven-spy-20200628-153547-1522854256359376060383.log
[ERROR] Failed to execute goal org.apache.maven.plugins:maven-checkstyle-plugin:3.0.0:check (checkstyle-check) on project maven-core: You have 1 Checkstyle violation. -> [Help 1]
org.apache.maven.lifecycle.LifecycleExecutionException: Failed to execute goal org.apache.maven.plugins:maven-checkstyle-plugin:3.0.0:check (checkstyle-check) on project maven-core: You have 1 Checkstyle violation.
    at org.apache.maven.lifecycle.internal.MojoExecutor.execute (MojoExecutor.java:215)
    at org.apache.maven.lifecycle.internal.MojoExecutor.execute (MojoExecutor.java:156)
    at org.apache.maven.lifecycle.internal.MojoExecutor.execute (MojoExecutor.java:148)
    at org.apache.maven.lifecycle.internal.LifecycleModuleBuilder.buildProject (LifecycleModuleBuilder.java:117)
    at org.apache.maven.lifecycle.internal.LifecycleModuleBuilder.buildProject (LifecycleModuleBuilder.java:81)
    at org.apache.maven.lifecycle.internal.builder.singlethreaded.SingleThreadedBuilder.build (SingleThreadedBuilder.java:56)
    at org.apache.maven.lifecycle.internal.LifecycleStarter.execute (LifecycleStarter.java:128)
    at org.apache.maven.DefaultMaven.doExecute (DefaultMaven.java:305)
    at org.apache.maven.DefaultMaven.doExecute (DefaultMaven.java:192)
    at org.apache.maven.DefaultMaven.execute (DefaultMaven.java:105)
    at org.apache.maven.cli.MavenCli.execute (MavenCli.java:957)
    at org.apache.maven.cli.MavenCli.doMain (MavenCli.java:289)
    at org.apache.maven.cli.MavenCli.main (MavenCli.java:193)
    at sun.reflect.NativeMethodAccessorImpl.invoke0 (Native Method)
    at sun.reflect.NativeMethodAccessorImpl.invoke (NativeMethodAccessorImpl.java:62)
    at sun.reflect.DelegatingMethodAccessorImpl.invoke (DelegatingMethodAccessorImpl.java:43)
    at java.lang.reflect.Method.invoke (Method.java:498)
    at org.codehaus.plexus.classworlds.launcher.Launcher.launchEnhanced (Launcher.java:282)
    at org.codehaus.plexus.classworlds.launcher.Launcher.launch (Launcher.java:225)
    at org.codehaus.plexus.classworlds.launcher.Launcher.mainWithExitCode (Launcher.java:406)
    at org.codehaus.plexus.classworlds.launcher.Launcher.main (Launcher.java:347)
Caused by: org.apache.maven.plugin.MojoFailureException: You have 1 Checkstyle violation.
    at org.apache.maven.plugins.checkstyle.CheckstyleViolationCheckMojo.execute (CheckstyleViolationCheckMojo.java:576)
    at org.apache.maven.plugin.DefaultBuildPluginManager.executeMojo (DefaultBuildPluginManager.java:137)
    at org.apache.maven.lifecycle.internal.MojoExecutor.execute (MojoExecutor.java:210)
    at org.apache.maven.lifecycle.internal.MojoExecutor.execute (MojoExecutor.java:156)
    at org.apache.maven.lifecycle.internal.MojoExecutor.execute (MojoExecutor.java:148)
    at org.apache.maven.lifecycle.internal.LifecycleModuleBuilder.buildProject (LifecycleModuleBuilder.java:117)
    at org.apache.maven.lifecycle.internal.LifecycleModuleBuilder.buildProject (LifecycleModuleBuilder.java:81)
    at org.apache.maven.lifecycle.internal.builder.singlethreaded.SingleThreadedBuilder.build (SingleThreadedBuilder.java:56)
    at org.apache.maven.lifecycle.internal.LifecycleStarter.execute (LifecycleStarter.java:128)
    at org.apache.maven.DefaultMaven.doExecute (DefaultMaven.java:305)
    at org.apache.maven.DefaultMaven.doExecute (DefaultMaven.java:192)
    at org.apache.maven.DefaultMaven.execute (DefaultMaven.java:105)
    at org.apache.maven.cli.MavenCli.execute (MavenCli.java:957)
    at org.apache.maven.cli.MavenCli.doMain (MavenCli.java:289)
    at org.apache.maven.cli.MavenCli.main (MavenCli.java:193)
    at sun.reflect.NativeMethodAccessorImpl.invoke0 (Native Method)
    at sun.reflect.NativeMethodAccessorImpl.invoke (NativeMethodAccessorImpl.java:62)
    at sun.reflect.DelegatingMethodAccessorImpl.invoke (DelegatingMethodAccessorImpl.java:43)
    at java.lang.reflect.Method.invoke (Method.java:498)
    at org.codehaus.plexus.classworlds.launcher.Launcher.launchEnhanced (Launcher.java:282)
    at org.codehaus.plexus.classworlds.launcher.Launcher.launch (Launcher.java:225)
    at org.codehaus.plexus.classworlds.launcher.Launcher.mainWithExitCode (Launcher.java:406)
    at org.codehaus.plexus.classworlds.launcher.Launcher.main (Launcher.java:347)
[ERROR]
[ERROR] Re-run Maven using the -X switch to enable full debug logging.
[ERROR]
[ERROR] For more information about the errors and possible solutions, please read the following articles:
[ERROR] [Help 1] http://cwiki.apache.org/confluence/display/MAVEN/MojoFailureException
[ERROR]
[ERROR] After correcting the problems, you can resume the build with the command
[ERROR]   mvn <args> -rf :maven-core
[Pipeline] }
[withMaven] artifactsPublisher - Archive artifact pom.xml under org/apache/maven/maven/3.7.0-SNAPSHOT/maven-3.7.0-SNAPSHOT.pom
[withMaven] artifactsPublisher - Archive artifact maven-model/pom.xml under org/apache/maven/maven-model/3.7.0-SNAPSHOT/maven-model-3.7.0-SNAPSHOT.pom
[withMaven] artifactsPublisher - Archive artifact maven-artifact/pom.xml under org/apache/maven/maven-artifact/3.7.0-SNAPSHOT/maven-artifact-3.7.0-SNAPSHOT.pom
[withMaven] artifactsPublisher - Archive artifact maven-plugin-api/pom.xml under org/apache/maven/maven-plugin-api/3.7.0-SNAPSHOT/maven-plugin-api-3.7.0-SNAPSHOT.pom
[withMaven] artifactsPublisher - Archive artifact maven-builder-support/pom.xml under org/apache/maven/maven-builder-support/3.7.0-SNAPSHOT/maven-builder-support-3.7.0-SNAPSHOT.pom
[withMaven] artifactsPublisher - Archive artifact maven-xml/pom.xml under org/apache/maven/maven-xml/3.7.0-SNAPSHOT/maven-xml-3.7.0-SNAPSHOT.pom
[withMaven] artifactsPublisher - Archive artifact maven-model-builder/pom.xml under org/apache/maven/maven-model-builder/3.7.0-SNAPSHOT/maven-model-builder-3.7.0-SNAPSHOT.pom
[withMaven] artifactsPublisher - Archive artifact maven-settings/pom.xml under org/apache/maven/maven-settings/3.7.0-SNAPSHOT/maven-settings-3.7.0-SNAPSHOT.pom
[withMaven] artifactsPublisher - Archive artifact maven-settings-builder/pom.xml under org/apache/maven/maven-settings-builder/3.7.0-SNAPSHOT/maven-settings-builder-3.7.0-SNAPSHOT.pom
[withMaven] artifactsPublisher - Archive artifact maven-repository-metadata/pom.xml under org/apache/maven/maven-repository-metadata/3.7.0-SNAPSHOT/maven-repository-metadata-3.7.0-SNAPSHOT.pom
[withMaven] artifactsPublisher - Archive artifact maven-resolver-provider/pom.xml under org/apache/maven/maven-resolver-provider/3.7.0-SNAPSHOT/maven-resolver-provider-3.7.0-SNAPSHOT.pom
[withMaven] artifactsPublisher - Archive artifact maven-core/pom.xml under org/apache/maven/maven-core/3.7.0-SNAPSHOT/maven-core-3.7.0-SNAPSHOT.pom
[withMaven] artifactsPublisher - Archive artifact maven-slf4j-wrapper/pom.xml under org/apache/maven/maven-slf4j-wrapper/3.7.0-SNAPSHOT/maven-slf4j-wrapper-3.7.0-SNAPSHOT.pom
[withMaven] artifactsPublisher - Archive artifact maven-slf4j-provider/pom.xml under org/apache/maven/maven-slf4j-provider/3.7.0-SNAPSHOT/maven-slf4j-provider-3.7.0-SNAPSHOT.pom
[withMaven] artifactsPublisher - Archive artifact maven-embedder/pom.xml under org/apache/maven/maven-embedder/3.7.0-SNAPSHOT/maven-embedder-3.7.0-SNAPSHOT.pom
[withMaven] artifactsPublisher - Archive artifact maven-compat/pom.xml under org/apache/maven/maven-compat/3.7.0-SNAPSHOT/maven-compat-3.7.0-SNAPSHOT.pom
[withMaven] artifactsPublisher - Archive artifact apache-maven/pom.xml under org/apache/maven/apache-maven/3.7.0-SNAPSHOT/apache-maven-3.7.0-SNAPSHOT.pom
[withMaven] artifactsPublisher - Archive artifact maven-wrapper/pom.xml under org/apache/maven/maven-wrapper/3.7.0-SNAPSHOT/maven-wrapper-3.7.0-SNAPSHOT.pom
[withMaven] artifactsPublisher - Archive artifact apache-maven/maven-wrapper.pom under org/apache/maven/apache-maven-wrapper/3.7.0-SNAPSHOT/apache-maven-wrapper-3.7.0-SNAPSHOT.pom
[withMaven] openTasksPublisher - Scan Tasks for Maven artifact org.apache.maven:maven-model:jar:3.7.0-SNAPSHOT in source directory maven-model/src/main/java
[withMaven] openTasksPublisher - Scan Tasks for Maven artifact org.apache.maven:maven-artifact:jar:3.7.0-SNAPSHOT in source directory maven-artifact/src/main/java
[withMaven] openTasksPublisher - Scan Tasks for Maven artifact org.apache.maven:maven-plugin-api:jar:3.7.0-SNAPSHOT in source directory maven-plugin-api/src/main/java
[withMaven] openTasksPublisher - Scan Tasks for Maven artifact org.apache.maven:maven-builder-support:jar:3.7.0-SNAPSHOT in source directory maven-builder-support/src/main/java
[withMaven] openTasksPublisher - Scan Tasks for Maven artifact org.apache.maven:maven-xml:jar:3.7.0-SNAPSHOT in source directory maven-xml/src/main/java
[withMaven] openTasksPublisher - Scan Tasks for Maven artifact org.apache.maven:maven-model-builder:jar:3.7.0-SNAPSHOT in source directory maven-model-builder/src/main/java
[withMaven] openTasksPublisher - Scan Tasks for Maven artifact org.apache.maven:maven-settings:jar:3.7.0-SNAPSHOT in source directory maven-settings/src/main/java
[withMaven] openTasksPublisher - Scan Tasks for Maven artifact org.apache.maven:maven-settings-builder:jar:3.7.0-SNAPSHOT in source directory maven-settings-builder/src/main/java
[withMaven] openTasksPublisher - Scan Tasks for Maven artifact org.apache.maven:maven-resolver-provider:jar:3.7.0-SNAPSHOT in source directory maven-resolver-provider/src/main/java
[withMaven] openTasksPublisher - Scan Tasks for Maven artifact org.apache.maven:maven-core:jar:3.7.0-SNAPSHOT in source directory maven-core/src/main/java
[withMaven] openTasksPublisher - Scan Tasks for Maven artifact org.apache.maven:maven-slf4j-wrapper:jar:3.7.0-SNAPSHOT in source directory maven-slf4j-wrapper/src/main/java
[withMaven] openTasksPublisher - Scan Tasks for Maven artifact org.apache.maven:maven-slf4j-provider:jar:3.7.0-SNAPSHOT in source directory maven-slf4j-provider/src/main/java
[withMaven] openTasksPublisher - Scan Tasks for Maven artifact org.apache.maven:maven-embedder:jar:3.7.0-SNAPSHOT in source directory maven-embedder/src/main/java
[withMaven] openTasksPublisher - Scan Tasks for Maven artifact org.apache.maven:maven-compat:jar:3.7.0-SNAPSHOT in source directory maven-compat/src/main/java
[withMaven] openTasksPublisher - Scan Tasks for Maven artifact org.apache.maven:maven-wrapper:jar:3.7.0-SNAPSHOT in source directory maven-wrapper/src/main/java
[TASKS] Scanning folder '/home/jenkins/jenkins-slave/workspace/maven-box_maven_MNG-5222/build' for files matching the pattern 'maven-model/src/main/java/**/*,maven-artifact/src/main/java/**/*,maven-plugin-api/src/main/java/**/*,maven-builder-support/src/main/java/**/*,maven-xml/src/main/java/**/*,maven-model-builder/src/main/java/**/*,maven-settings/src/main/java/**/*,maven-settings-builder/src/main/java/**/*,maven-resolver-provider/src/main/java/**/*,maven-core/src/main/java/**/*,maven-slf4j-wrapper/src/main/java/**/*,maven-slf4j-provider/src/main/java/**/*,maven-embedder/src/main/java/**/*,maven-compat/src/main/java/**/*,maven-wrapper/src/main/java/**/*' - excludes: null
[TASKS] Found 754 files to scan for tasks
[TASKS] Found 159 open tasks.
Skipping warnings blame since pipelines do not have an SCM link.%n
[TASKS] Computing warning deltas based on reference build #13
[withMaven] Publishers: Pipeline Graph Publisher: 12 ms, Generated Artifacts Publisher: 9921 ms, Open Task Scanner Publisher: 18334 ms
[withMaven] artifactsPublisher - Archive artifact pom.xml under org/apache/maven/maven/3.7.0-SNAPSHOT/maven-3.7.0-SNAPSHOT.pom
[withMaven] artifactsPublisher - Archive artifact target/maven-3.7.0-SNAPSHOT-site.xml under org/apache/maven/maven/3.7.0-SNAPSHOT/maven-3.7.0-SNAPSHOT-site.xml
[withMaven] artifactsPublisher - Archive artifact maven-model/pom.xml under org/apache/maven/maven-model/3.7.0-SNAPSHOT/maven-model-3.7.0-SNAPSHOT.pom
[withMaven] artifactsPublisher - Archive artifact maven-model/target/maven-model-3.7.0-SNAPSHOT.jar under org/apache/maven/maven-model/3.7.0-SNAPSHOT/maven-model-3.7.0-SNAPSHOT.jar
[withMaven] artifactsPublisher - Archive artifact maven-artifact/pom.xml under org/apache/maven/maven-artifact/3.7.0-SNAPSHOT/maven-artifact-3.7.0-SNAPSHOT.pom
[withMaven] artifactsPublisher - Archive artifact maven-artifact/target/maven-artifact-3.7.0-SNAPSHOT.jar under org/apache/maven/maven-artifact/3.7.0-SNAPSHOT/maven-artifact-3.7.0-SNAPSHOT.jar
[withMaven] artifactsPublisher - Archive artifact maven-plugin-api/pom.xml under org/apache/maven/maven-plugin-api/3.7.0-SNAPSHOT/maven-plugin-api-3.7.0-SNAPSHOT.pom
[withMaven] artifactsPublisher - Archive artifact maven-plugin-api/target/maven-plugin-api-3.7.0-SNAPSHOT.jar under org/apache/maven/maven-plugin-api/3.7.0-SNAPSHOT/maven-plugin-api-3.7.0-SNAPSHOT.jar
[withMaven] artifactsPublisher - Archive artifact maven-builder-support/pom.xml under org/apache/maven/maven-builder-support/3.7.0-SNAPSHOT/maven-builder-support-3.7.0-SNAPSHOT.pom
[withMaven] artifactsPublisher - Archive artifact maven-builder-support/target/maven-builder-support-3.7.0-SNAPSHOT.jar under org/apache/maven/maven-builder-support/3.7.0-SNAPSHOT/maven-builder-support-3.7.0-SNAPSHOT.jar
[withMaven] artifactsPublisher - Archive artifact maven-xml/pom.xml under org/apache/maven/maven-xml/3.7.0-SNAPSHOT/maven-xml-3.7.0-SNAPSHOT.pom
[withMaven] artifactsPublisher - Archive artifact maven-xml/target/maven-xml-3.7.0-SNAPSHOT.jar under org/apache/maven/maven-xml/3.7.0-SNAPSHOT/maven-xml-3.7.0-SNAPSHOT.jar
[withMaven] artifactsPublisher - Archive artifact maven-model-builder/pom.xml under org/apache/maven/maven-model-builder/3.7.0-SNAPSHOT/maven-model-builder-3.7.0-SNAPSHOT.pom
[withMaven] artifactsPublisher - Archive artifact maven-model-builder/target/maven-model-builder-3.7.0-SNAPSHOT.jar under org/apache/maven/maven-model-builder/3.7.0-SNAPSHOT/maven-model-builder-3.7.0-SNAPSHOT.jar
[withMaven] artifactsPublisher - Archive artifact maven-settings/pom.xml under org/apache/maven/maven-settings/3.7.0-SNAPSHOT/maven-settings-3.7.0-SNAPSHOT.pom
[withMaven] artifactsPublisher - Archive artifact maven-settings/target/maven-settings-3.7.0-SNAPSHOT.jar under org/apache/maven/maven-settings/3.7.0-SNAPSHOT/maven-settings-3.7.0-SNAPSHOT.jar
[withMaven] artifactsPublisher - Archive artifact maven-settings-builder/pom.xml under org/apache/maven/maven-settings-builder/3.7.0-SNAPSHOT/maven-settings-builder-3.7.0-SNAPSHOT.pom
[withMaven] artifactsPublisher - Archive artifact maven-settings-builder/target/maven-settings-builder-3.7.0-SNAPSHOT.jar under org/apache/maven/maven-settings-builder/3.7.0-SNAPSHOT/maven-settings-builder-3.7.0-SNAPSHOT.jar
[withMaven] artifactsPublisher - Archive artifact maven-repository-metadata/pom.xml under org/apache/maven/maven-repository-metadata/3.7.0-SNAPSHOT/maven-repository-metadata-3.7.0-SNAPSHOT.pom
[withMaven] artifactsPublisher - Archive artifact maven-repository-metadata/target/maven-repository-metadata-3.7.0-SNAPSHOT.jar under org/apache/maven/maven-repository-metadata/3.7.0-SNAPSHOT/maven-repository-metadata-3.7.0-SNAPSHOT.jar
[withMaven] artifactsPublisher - Archive artifact maven-resolver-provider/pom.xml under org/apache/maven/maven-resolver-provider/3.7.0-SNAPSHOT/maven-resolver-provider-3.7.0-SNAPSHOT.pom
[withMaven] artifactsPublisher - Archive artifact maven-resolver-provider/target/maven-resolver-provider-3.7.0-SNAPSHOT.jar under org/apache/maven/maven-resolver-provider/3.7.0-SNAPSHOT/maven-resolver-provider-3.7.0-SNAPSHOT.jar
[withMaven] artifactsPublisher - Archive artifact maven-slf4j-wrapper/pom.xml under org/apache/maven/maven-slf4j-wrapper/3.7.0-SNAPSHOT/maven-slf4j-wrapper-3.7.0-SNAPSHOT.pom
[withMaven] artifactsPublisher - Archive artifact maven-slf4j-wrapper/target/maven-slf4j-wrapper-3.7.0-SNAPSHOT.jar under org/apache/maven/maven-slf4j-wrapper/3.7.0-SNAPSHOT/maven-slf4j-wrapper-3.7.0-SNAPSHOT.jar
[withMaven] artifactsPublisher - Archive artifact maven-slf4j-provider/pom.xml under org/apache/maven/maven-slf4j-provider/3.7.0-SNAPSHOT/maven-slf4j-provider-3.7.0-SNAPSHOT.pom
[withMaven] artifactsPublisher - Archive artifact maven-slf4j-provider/target/maven-slf4j-provider-3.7.0-SNAPSHOT.jar under org/apache/maven/maven-slf4j-provider/3.7.0-SNAPSHOT/maven-slf4j-provider-3.7.0-SNAPSHOT.jar
[withMaven] artifactsPublisher - Archive artifact maven-wrapper/pom.xml under org/apache/maven/maven-wrapper/3.7.0-SNAPSHOT/maven-wrapper-3.7.0-SNAPSHOT.pom
[withMaven] artifactsPublisher - Archive artifact maven-wrapper/target/maven-wrapper.jar under org/apache/maven/maven-wrapper/3.7.0-SNAPSHOT/maven-wrapper-3.7.0-SNAPSHOT.jar
[withMaven] artifactsPublisher - Archive artifact apache-maven/maven-wrapper.pom under org/apache/maven/apache-maven-wrapper/3.7.0-SNAPSHOT/apache-maven-wrapper-3.7.0-SNAPSHOT.pom
[withMaven] artifactsPublisher - Archive artifact apache-maven/target/apache-maven-wrapper-3.7.0-SNAPSHOT-site.xml under org/apache/maven/apache-maven-wrapper/3.7.0-SNAPSHOT/apache-maven-wrapper-3.7.0-SNAPSHOT-site.xml
[withMaven] artifactsPublisher - Archive artifact apache-maven/target/apache-maven-wrapper-3.7.0-SNAPSHOT-script.tar.gz under org/apache/maven/apache-maven-wrapper/3.7.0-SNAPSHOT/apache-maven-wrapper-3.7.0-SNAPSHOT-script.tar.gz
[withMaven] artifactsPublisher - Archive artifact apache-maven/target/apache-maven-wrapper-3.7.0-SNAPSHOT-script.zip under org/apache/maven/apache-maven-wrapper/3.7.0-SNAPSHOT/apache-maven-wrapper-3.7.0-SNAPSHOT-script.zip
[withMaven] artifactsPublisher - Archive artifact apache-maven/target/apache-maven-wrapper-3.7.0-SNAPSHOT-bin.tar.gz under org/apache/maven/apache-maven-wrapper/3.7.0-SNAPSHOT/apache-maven-wrapper-3.7.0-SNAPSHOT-bin.tar.gz
[withMaven] artifactsPublisher - Archive artifact apache-maven/target/apache-maven-wrapper-3.7.0-SNAPSHOT-bin.zip under org/apache/maven/apache-maven-wrapper/3.7.0-SNAPSHOT/apache-maven-wrapper-3.7.0-SNAPSHOT-bin.zip
[withMaven] artifactsPublisher - Archive artifact apache-maven/target/apache-maven-wrapper-3.7.0-SNAPSHOT-source.tar.gz under org/apache/maven/apache-maven-wrapper/3.7.0-SNAPSHOT/apache-maven-wrapper-3.7.0-SNAPSHOT-source.tar.gz
[withMaven] artifactsPublisher - Archive artifact apache-maven/target/apache-maven-wrapper-3.7.0-SNAPSHOT-source.zip under org/apache/maven/apache-maven-wrapper/3.7.0-SNAPSHOT/apache-maven-wrapper-3.7.0-SNAPSHOT-source.zip
[Fast Archiver] Compressed 953.96 KB of artifacts by 36.9% relative to #13
[withMaven] junitPublisher - Archive test results for Maven artifact org.apache.maven:maven-model:jar:3.7.0-SNAPSHOT generated by maven-surefire-plugin:test (default-test): maven-model/target/surefire-reports/*.xml
[withMaven] junitPublisher - Archive test results for Maven artifact org.apache.maven:maven-artifact:jar:3.7.0-SNAPSHOT generated by maven-surefire-plugin:test (default-test): maven-artifact/target/surefire-reports/*.xml
[withMaven] junitPublisher - Archive test results for Maven artifact org.apache.maven:maven-plugin-api:jar:3.7.0-SNAPSHOT generated by maven-surefire-plugin:test (default-test): maven-plugin-api/target/surefire-reports/*.xml
[withMaven] junitPublisher - Archive test results for Maven artifact org.apache.maven:maven-builder-support:jar:3.7.0-SNAPSHOT generated by maven-surefire-plugin:test (default-test): maven-builder-support/target/surefire-reports/*.xml
[withMaven] junitPublisher - Archive test results for Maven artifact org.apache.maven:maven-xml:jar:3.7.0-SNAPSHOT generated by maven-surefire-plugin:test (default-test): maven-xml/target/surefire-reports/*.xml
[withMaven] junitPublisher - Archive test results for Maven artifact org.apache.maven:maven-model-builder:jar:3.7.0-SNAPSHOT generated by maven-surefire-plugin:test (default-test): maven-model-builder/target/surefire-reports/*.xml
[withMaven] junitPublisher - Archive test results for Maven artifact org.apache.maven:maven-settings:jar:3.7.0-SNAPSHOT generated by maven-surefire-plugin:test (default-test): maven-settings/target/surefire-reports/*.xml
[withMaven] junitPublisher - Archive test results for Maven artifact org.apache.maven:maven-settings-builder:jar:3.7.0-SNAPSHOT generated by maven-surefire-plugin:test (default-test): maven-settings-builder/target/surefire-reports/*.xml
[withMaven] junitPublisher - Archive test results for Maven artifact org.apache.maven:maven-repository-metadata:jar:3.7.0-SNAPSHOT generated by maven-surefire-plugin:test (default-test): maven-repository-metadata/target/surefire-reports/*.xml
[withMaven] junitPublisher - Archive test results for Maven artifact org.apache.maven:maven-resolver-provider:jar:3.7.0-SNAPSHOT generated by maven-surefire-plugin:test (default-test): maven-resolver-provider/target/surefire-reports/*.xml
[withMaven] junitPublisher - Archive test results for Maven artifact org.apache.maven:maven-core:jar:3.7.0-SNAPSHOT generated by maven-surefire-plugin:test (default-test): maven-core/target/surefire-reports/*.xml
[withMaven] junitPublisher - Archive test results for Maven artifact org.apache.maven:maven-slf4j-wrapper:jar:3.7.0-SNAPSHOT generated by maven-surefire-plugin:test (default-test): maven-slf4j-wrapper/target/surefire-reports/*.xml
[withMaven] junitPublisher - Archive test results for Maven artifact org.apache.maven:maven-slf4j-provider:jar:3.7.0-SNAPSHOT generated by maven-surefire-plugin:test (default-test): maven-slf4j-provider/target/surefire-reports/*.xml
[withMaven] junitPublisher - Archive test results for Maven artifact org.apache.maven:maven-wrapper:jar:3.7.0-SNAPSHOT generated by maven-surefire-plugin:test (default-test): maven-wrapper/target/surefire-reports/*.xml
Recording test results
[withMaven] junitPublisher - Archive test results for Maven artifact org.apache.maven:maven-artifact:jar:3.7.0-SNAPSHOT generated by maven-failsafe-plugin:integration-test (default): maven-artifact/target/failsafe-reports/*.xml
[withMaven] junitPublisher - Archive test results for Maven artifact org.apache.maven:maven-core:jar:3.7.0-SNAPSHOT generated by maven-failsafe-plugin:integration-test (default): maven-core/target/failsafe-reports/*.xml
Recording test results
[withMaven] openTasksPublisher - Scan Tasks for Maven artifact org.apache.maven:maven-model:jar:3.7.0-SNAPSHOT in source directory maven-model/src/main/java
[withMaven] openTasksPublisher - Scan Tasks for Maven artifact org.apache.maven:maven-artifact:jar:3.7.0-SNAPSHOT in source directory maven-artifact/src/main/java
[withMaven] openTasksPublisher - Scan Tasks for Maven artifact org.apache.maven:maven-plugin-api:jar:3.7.0-SNAPSHOT in source directory maven-plugin-api/src/main/java
[withMaven] openTasksPublisher - Scan Tasks for Maven artifact org.apache.maven:maven-builder-support:jar:3.7.0-SNAPSHOT in source directory maven-builder-support/src/main/java
[withMaven] openTasksPublisher - Scan Tasks for Maven artifact org.apache.maven:maven-xml:jar:3.7.0-SNAPSHOT in source directory maven-xml/src/main/java
[withMaven] openTasksPublisher - Scan Tasks for Maven artifact org.apache.maven:maven-model-builder:jar:3.7.0-SNAPSHOT in source directory maven-model-builder/src/main/java
[withMaven] openTasksPublisher - Scan Tasks for Maven artifact org.apache.maven:maven-settings:jar:3.7.0-SNAPSHOT in source directory maven-settings/src/main/java
[withMaven] openTasksPublisher - Scan Tasks for Maven artifact org.apache.maven:maven-settings-builder:jar:3.7.0-SNAPSHOT in source directory maven-settings-builder/src/main/java
[withMaven] openTasksPublisher - Scan Tasks for Maven artifact org.apache.maven:maven-resolver-provider:jar:3.7.0-SNAPSHOT in source directory maven-resolver-provider/src/main/java
[withMaven] openTasksPublisher - Scan Tasks for Maven artifact org.apache.maven:maven-core:jar:3.7.0-SNAPSHOT in source directory maven-core/src/main/java
[withMaven] openTasksPublisher - Scan Tasks for Maven artifact org.apache.maven:maven-slf4j-wrapper:jar:3.7.0-SNAPSHOT in source directory maven-slf4j-wrapper/src/main/java
[withMaven] openTasksPublisher - Scan Tasks for Maven artifact org.apache.maven:maven-slf4j-provider:jar:3.7.0-SNAPSHOT in source directory maven-slf4j-provider/src/main/java
[withMaven] openTasksPublisher - Scan Tasks for Maven artifact org.apache.maven:maven-wrapper:jar:3.7.0-SNAPSHOT in source directory maven-wrapper/src/main/java
[TASKS] Scanning folder '/home/jenkins/jenkins-slave/workspace/maven-box_maven_MNG-5222/build' for files matching the pattern 'maven-model/src/main/java/**/*,maven-artifact/src/main/java/**/*,maven-plugin-api/src/main/java/**/*,maven-builder-support/src/main/java/**/*,maven-xml/src/main/java/**/*,maven-model-builder/src/main/java/**/*,maven-settings/src/main/java/**/*,maven-settings-builder/src/main/java/**/*,maven-resolver-provider/src/main/java/**/*,maven-core/src/main/java/**/*,maven-slf4j-wrapper/src/main/java/**/*,maven-slf4j-provider/src/main/java/**/*,maven-wrapper/src/main/java/**/*' - excludes: null
[TASKS] Found 595 files to scan for tasks
[TASKS] Found 103 open tasks.
Skipping warnings blame since pipelines do not have an SCM link.%n
[TASKS] Computing warning deltas based on reference build #13
[withMaven] Publishers: Pipeline Graph Publisher: 17 ms, Generated Artifacts Publisher: 19341 ms, Invoker Publisher: 5 ms, Junit Publisher: 76361 ms, Concordion Publisher: 1 ms, Dependencies Fingerprint Publisher: 8083 ms, JGiven Publisher: 1 ms, Open Task Scanner Publisher: 3160 ms
[Pipeline] // withMaven
[Pipeline] }
[Pipeline] // stage
[Pipeline] }
[Pipeline] // dir
[Pipeline] }
[Pipeline] // node
[Pipeline] echo
[FAILURE-003] AbortException hudson.AbortException: script returned exit code 1
[Pipeline] stage
[Pipeline] { (Notifications)
[Pipeline] echo
Build result: FAILURE
[Pipeline] jiraIssueSelector
[Pipeline] echo
The authors of changes [slachiewicz, rfscholte, hboutemy].
[Pipeline] echo
Sending email ...
[Pipeline] emailext