Build failed in Jenkins: Maven » Maven TLP » maven-surefire » master #46

Previous Topic Next Topic
 
classic Classic list List threaded Threaded
2 messages Options
Reply | Threaded
Open this post in threaded view
|

Build failed in Jenkins: Maven » Maven TLP » maven-surefire » master #46

Apache Jenkins Server-2
See https://ci-builds.apache.org/job/Maven/job/maven-box/job/maven-surefire/job/master/46/

Changes:

* Refer to correct property in skipping-tests doc

All tests passed

Build log:
[...truncated 56267 lines...]
[2020-12-24T10:06:44.927Z] [INFO] SureFire Providers ................................. SUCCESS [  0.785 s]
[2020-12-24T10:06:44.927Z] [INFO] Shared JUnit3 Provider Code ........................ SUCCESS [  4.295 s]
[2020-12-24T10:06:44.927Z] [INFO] Shared Java 5 Provider Base ........................ SUCCESS [  5.055 s]
[2020-12-24T10:06:44.927Z] [INFO] Shared JUnit4 Provider Code ........................ SUCCESS [  5.721 s]
[2020-12-24T10:06:44.927Z] [INFO] Shared JUnit48 Provider Code ....................... SUCCESS [  9.204 s]
[2020-12-24T10:06:44.927Z] [INFO] SureFire JUnit Runner .............................. SUCCESS [  4.834 s]
[2020-12-24T10:06:44.927Z] [INFO] SureFire JUnit4 Runner ............................. SUCCESS [  4.465 s]
[2020-12-24T10:06:44.927Z] [INFO] Maven Surefire Common .............................. SUCCESS [01:13 min]
[2020-12-24T10:06:44.927Z] [INFO] SureFire JUnitCore Runner .......................... SUCCESS [02:17 min]
[2020-12-24T10:06:44.927Z] [INFO] SureFire JUnit Platform Runner ..................... SUCCESS [ 11.830 s]
[2020-12-24T10:06:44.927Z] [INFO] SureFire TestNG Utils .............................. SUCCESS [  4.666 s]
[2020-12-24T10:06:44.927Z] [INFO] SureFire TestNG Runner ............................. SUCCESS [  7.193 s]
[2020-12-24T10:06:44.927Z] [INFO] ShadeFire JUnit3 Provider .......................... SUCCESS [  2.475 s]
[2020-12-24T10:06:44.927Z] [INFO] Surefire Report Parser ............................. SUCCESS [  7.072 s]
[2020-12-24T10:06:44.927Z] [INFO] Maven Surefire Plugin .............................. SUCCESS [ 10.805 s]
[2020-12-24T10:06:44.927Z] [INFO] Maven Failsafe Plugin .............................. SUCCESS [01:03 min]
[2020-12-24T10:06:44.927Z] [INFO] Maven Surefire Report Plugin ....................... SUCCESS [ 19.368 s]
[2020-12-24T10:06:44.927Z] [INFO] Maven Surefire Integration Tests ................... SUCCESS [  01:09 h]
[2020-12-24T10:06:44.927Z] [INFO] Surefire Shared Utils .............................. SUCCESS [  2.182 s]
[2020-12-24T10:06:44.927Z] [INFO] ------------------------------------------------------------------------
[2020-12-24T10:06:44.927Z] [INFO] BUILD SUCCESS
[2020-12-24T10:06:44.927Z] [INFO] ------------------------------------------------------------------------
[2020-12-24T10:06:44.927Z] [INFO] Total time: 01:17 h
[2020-12-24T10:06:44.927Z] [INFO] Finished at: 2020-12-24T02:06:44-08:00
[2020-12-24T10:06:45.330Z] [INFO] Final Memory: 56M/217M
[2020-12-24T10:06:45.330Z] [INFO] ------------------------------------------------------------------------
[Pipeline] }
[Pipeline] // withEnv
[Pipeline] }
[Pipeline] // stage
[Pipeline] fileExists
[Pipeline] zip
[2020-12-24T10:06:45.648Z] Writing zip file of C:\Users\jenkins\AppData\Local\Temp\jenkins-Maven-maven-box-maven-surefire-master-46\maven-failsafe-plugin\target\it to C:\Users\jenkins\AppData\Local\Temp\jenkins-Maven-maven-box-maven-surefire-master-46\maven-failsafe-plugin--windows-jdk8-maven3.2.x.zip
[2020-12-24T10:06:45.800Z] Zipped 78 entries.
[2020-12-24T10:06:45.800Z] Archiving C:\Users\jenkins\AppData\Local\Temp\jenkins-Maven-maven-box-maven-surefire-master-46\maven-failsafe-plugin--windows-jdk8-maven3.2.x.zip
[2020-12-24T10:06:45.801Z] [Fast Archiver] No artifacts from Maven » Maven TLP » maven-surefire » master #45 to compare, so performing full copy of artifacts
[Pipeline] fileExists
[Pipeline] zip
[2020-12-24T10:06:45.966Z] Writing zip file of C:\Users\jenkins\AppData\Local\Temp\jenkins-Maven-maven-box-maven-surefire-master-46\surefire-its\target to C:\Users\jenkins\AppData\Local\Temp\jenkins-Maven-maven-box-maven-surefire-master-46\surefire-its--windows-jdk8-maven3.2.x.zip
[2020-12-24T10:06:47.533Z] [INFO] Tests run: 1, Failures: 0, Errors: 0, Skipped: 0, Time elapsed: 6.084 s - in org.apache.maven.surefire.its.jiras.Surefire930TestNgSuiteXmlIT
[2020-12-24T10:06:47.533Z] [INFO] Running org.apache.maven.surefire.its.jiras.Surefire943ReportContentIT
[2020-12-24T10:07:15.333Z] [INFO] Tests run: 2, Failures: 0, Errors: 0, Skipped: 0, Time elapsed: 26.319 s - in org.apache.maven.surefire.its.jiras.Surefire943ReportContentIT
[2020-12-24T10:07:15.333Z] [INFO] Running org.apache.maven.surefire.its.jiras.Surefire946KillMainProcessInReusableForkIT
[2020-12-24T10:07:28.909Z] Zipped 18879 entries.
[2020-12-24T10:07:28.909Z] Archiving C:\Users\jenkins\AppData\Local\Temp\jenkins-Maven-maven-box-maven-surefire-master-46\surefire-its--windows-jdk8-maven3.2.x.zip
[2020-12-24T10:07:28.910Z] [Fast Archiver] No artifacts from Maven » Maven TLP » maven-surefire » master #45 to compare, so performing full copy of artifacts
[Pipeline] archiveArtifacts
[2020-12-24T10:07:43.247Z] Archiving artifacts
[2020-12-24T10:07:43.302Z] [Fast Archiver] No artifacts from Maven » Maven TLP » maven-surefire » master #45 to compare, so performing full copy of artifacts
[Pipeline] cleanWs
[2020-12-24T10:07:58.828Z] [WS-CLEANUP] Deleting project workspace...
[2020-12-24T10:07:58.828Z] [WS-CLEANUP] Deferred wipeout is used...
[2020-12-24T10:07:58.990Z] [WS-CLEANUP] done
[Pipeline] }
[Pipeline] // ws
[Pipeline] }
[Pipeline] // timestamps
[Pipeline] }
[Pipeline] // node
[Pipeline] }
[2020-12-24T10:08:24.706Z] [INFO] Tests run: 6, Failures: 0, Errors: 0, Skipped: 0, Time elapsed: 60.467 s - in org.apache.maven.surefire.its.jiras.Surefire946KillMainProcessInReusableForkIT
[2020-12-24T10:08:24.706Z] [INFO] Running org.apache.maven.surefire.its.jiras.Surefire972BizarreNoClassDefIT
[2020-12-24T10:08:24.706Z] [INFO] Tests run: 1, Failures: 0, Errors: 0, Skipped: 0, Time elapsed: 8.421 s - in org.apache.maven.surefire.its.jiras.Surefire972BizarreNoClassDefIT
[2020-12-24T10:08:24.706Z] [INFO] Running org.apache.maven.surefire.its.jiras.Surefire975DefaultVMEncodingIT
[2020-12-24T10:08:27.696Z] [INFO] Tests run: 1, Failures: 0, Errors: 0, Skipped: 0, Time elapsed: 4.937 s - in org.apache.maven.surefire.its.jiras.Surefire975DefaultVMEncodingIT
[2020-12-24T10:08:27.696Z] [INFO] Running org.apache.maven.surefire.its.jiras.Surefire979WrongClassLoaderIT
[2020-12-24T10:08:32.461Z] [INFO] Tests run: 1, Failures: 0, Errors: 0, Skipped: 0, Time elapsed: 5.275 s - in org.apache.maven.surefire.its.jiras.Surefire979WrongClassLoaderIT
[2020-12-24T10:08:32.461Z] [INFO] Running org.apache.maven.surefire.its.jiras.Surefire985ParameterizedRunnerAndCategoriesIT
[2020-12-24T10:08:37.255Z] [INFO] Tests run: 1, Failures: 0, Errors: 0, Skipped: 0, Time elapsed: 4.417 s - in org.apache.maven.surefire.its.jiras.Surefire985ParameterizedRunnerAndCategoriesIT
[2020-12-24T10:08:37.255Z] [INFO] Running org.apache.maven.surefire.its.jiras.Surefire995CategoryInheritanceIT
[2020-12-24T10:09:11.317Z] [INFO] Tests run: 7, Failures: 0, Errors: 0, Skipped: 0, Time elapsed: 32.471 s - in org.apache.maven.surefire.its.jiras.Surefire995CategoryInheritanceIT
[2020-12-24T10:09:11.317Z] [INFO]
[2020-12-24T10:09:11.317Z] [INFO] Results:
[2020-12-24T10:09:11.317Z] [INFO]
[2020-12-24T10:09:11.317Z] [WARNING] Tests run: 973, Failures: 0, Errors: 0, Skipped: 310
[2020-12-24T10:09:11.317Z] [INFO]
[2020-12-24T10:09:11.317Z] [INFO]
[2020-12-24T10:09:11.317Z] [INFO] --- maven-checkstyle-plugin:3.0.0:check (checkstyle-check) @ surefire-its ---
[2020-12-24T10:09:14.293Z] [INFO]
[2020-12-24T10:09:14.293Z] [INFO] --- maven-failsafe-plugin:3.0.0-M4:verify (default) @ surefire-its ---
[2020-12-24T10:09:14.293Z] [INFO] Failsafe report directory: C:\Users\jenkins\AppData\Local\Temp\jenkins-Maven-maven-box-maven-surefire-master-46\surefire-its\target\failsafe-reports
[2020-12-24T10:09:14.293Z] [INFO]
[2020-12-24T10:09:14.293Z] [INFO] --- maven-install-plugin:2.5.2:install (default-install) @ surefire-its ---
[2020-12-24T10:09:14.293Z] [INFO] Skipping artifact installation
[2020-12-24T10:09:14.293Z] [INFO]                                                                        
[2020-12-24T10:09:14.293Z] [INFO] ------------------------------------------------------------------------
[2020-12-24T10:09:14.293Z] [INFO] Building Surefire Shared Utils 3.0.0-M6-SNAPSHOT
[2020-12-24T10:09:14.293Z] [INFO] ------------------------------------------------------------------------
[2020-12-24T10:09:14.293Z] [INFO]
[2020-12-24T10:09:14.293Z] [INFO] --- maven-clean-plugin:3.1.0:clean (default-clean) @ surefire-shared-utils ---
[2020-12-24T10:09:14.293Z] [INFO]
[2020-12-24T10:09:14.293Z] [INFO] --- maven-enforcer-plugin:3.0.0-M3:enforce (enforce-maven-version) @ surefire-shared-utils ---
[2020-12-24T10:09:14.293Z] [INFO]
[2020-12-24T10:09:14.293Z] [INFO] --- maven-enforcer-plugin:3.0.0-M3:enforce (enforce-bytecode-version) @ surefire-shared-utils ---
[2020-12-24T10:09:14.625Z] [INFO] Adding ignore: module-info
[2020-12-24T10:09:14.625Z] [INFO]
[2020-12-24T10:09:14.625Z] [INFO] --- maven-enforcer-plugin:3.0.0-M3:enforce (enforce-java) @ surefire-shared-utils ---
[2020-12-24T10:09:14.625Z] [INFO]
[2020-12-24T10:09:14.625Z] [INFO] --- maven-enforcer-plugin:3.0.0-M3:enforce (enforce-maven) @ surefire-shared-utils ---
[2020-12-24T10:09:14.625Z] [INFO]
[2020-12-24T10:09:14.625Z] [INFO] --- apache-rat-plugin:0.13:check (rat-check) @ surefire-shared-utils ---
[2020-12-24T10:09:14.626Z] [INFO] Enabled default license matchers.
[2020-12-24T10:09:14.626Z] [INFO] Will parse SCM ignores for exclusions...
[2020-12-24T10:09:14.626Z] [INFO] Finished adding exclusions from SCM ignore files.
[2020-12-24T10:09:14.626Z] [INFO] 62 implicit excludes (use -debug for more details).
[2020-12-24T10:09:14.626Z] [INFO] 27 explicit excludes (use -debug for more details).
[2020-12-24T10:09:14.626Z] [INFO] 1 resources included (use -debug for more details)
[2020-12-24T10:09:14.626Z] [INFO] Rat check: Summary over all files. Unapproved: 0, unknown: 0, generated: 0, approved: 1 licenses.
[2020-12-24T10:09:14.626Z] [INFO]
[2020-12-24T10:09:14.626Z] [INFO] --- maven-compiler-plugin:3.8.1:compile (compile-generated) @ surefire-shared-utils ---
[2020-12-24T10:09:14.626Z] [INFO] No sources to compile
[2020-12-24T10:09:14.626Z] [INFO]
[2020-12-24T10:09:14.626Z] [INFO] --- maven-remote-resources-plugin:1.7.0:process (process-resource-bundles) @ surefire-shared-utils ---
[2020-12-24T10:09:14.626Z] [INFO] Preparing remote bundle org.apache:apache-jar-resource-bundle:1.4
[2020-12-24T10:09:14.626Z] [INFO] Copying 3 resources from 1 bundle.
[2020-12-24T10:09:14.957Z] [INFO]
[2020-12-24T10:09:14.957Z] [INFO] --- maven-resources-plugin:3.1.0:resources (default-resources) @ surefire-shared-utils ---
[2020-12-24T10:09:14.957Z] [INFO] Using 'UTF-8' encoding to copy filtered resources.
[2020-12-24T10:09:14.957Z] [INFO] skip non existing resourceDirectory C:\Users\jenkins\AppData\Local\Temp\jenkins-Maven-maven-box-maven-surefire-master-46\surefire-shared-utils\src\main\resources
[2020-12-24T10:09:14.957Z] [INFO] Copying 3 resources
[2020-12-24T10:09:14.957Z] [INFO]
[2020-12-24T10:09:14.957Z] [INFO] --- maven-compiler-plugin:3.8.1:compile (default-compile) @ surefire-shared-utils ---
[2020-12-24T10:09:14.957Z] [INFO] No sources to compile
[2020-12-24T10:09:14.957Z] [INFO]
[2020-12-24T10:09:14.957Z] [INFO] --- animal-sniffer-maven-plugin:1.17:check (signature-check) @ surefire-shared-utils ---
[2020-12-24T10:09:14.957Z] [INFO] Checking unresolved references to org.codehaus.mojo.signature:java17:1.0
[2020-12-24T10:09:15.288Z] [INFO]
[2020-12-24T10:09:15.288Z] [INFO] --- maven-resources-plugin:3.1.0:testResources (default-testResources) @ surefire-shared-utils ---
[2020-12-24T10:09:15.288Z] [INFO] Using 'UTF-8' encoding to copy filtered resources.
[2020-12-24T10:09:15.288Z] [INFO] skip non existing resourceDirectory C:\Users\jenkins\AppData\Local\Temp\jenkins-Maven-maven-box-maven-surefire-master-46\surefire-shared-utils\src\test\resources
[2020-12-24T10:09:15.288Z] [INFO] Copying 3 resources
[2020-12-24T10:09:15.288Z] [INFO]
[2020-12-24T10:09:15.288Z] [INFO] --- maven-compiler-plugin:3.8.1:testCompile (default-testCompile) @ surefire-shared-utils ---
[2020-12-24T10:09:15.288Z] [INFO] No sources to compile
[2020-12-24T10:09:15.288Z] [INFO]
[2020-12-24T10:09:15.288Z] [INFO] --- maven-surefire-plugin:3.0.0-M4:test (default-test) @ surefire-shared-utils ---
[2020-12-24T10:09:15.288Z] [INFO]
[2020-12-24T10:09:15.288Z] [INFO] --- maven-jar-plugin:3.2.0:jar (default-jar) @ surefire-shared-utils ---
[2020-12-24T10:09:15.288Z] [INFO] Building jar: C:\Users\jenkins\AppData\Local\Temp\jenkins-Maven-maven-box-maven-surefire-master-46\surefire-shared-utils\target\surefire-shared-utils-3.0.0-M6-SNAPSHOT.jar
[2020-12-24T10:09:15.288Z] [INFO]
[2020-12-24T10:09:15.288Z] [INFO] --- maven-site-plugin:3.8.2:attach-descriptor (attach-descriptor) @ surefire-shared-utils ---
[2020-12-24T10:09:15.288Z] [INFO] Skipping because packaging 'jar' is not pom.
[2020-12-24T10:09:15.288Z] [INFO]
[2020-12-24T10:09:15.288Z] [INFO] --- maven-shade-plugin:3.2.3:shade (default) @ surefire-shared-utils ---
[2020-12-24T10:09:15.288Z] [INFO] Including org.apache.maven.shared:maven-shared-utils:jar:3.1.0 in the shaded jar.
[2020-12-24T10:09:15.288Z] [INFO] Including commons-io:commons-io:jar:2.6 in the shaded jar.
[2020-12-24T10:09:15.288Z] [INFO] Including org.apache.commons:commons-lang3:jar:3.8.1 in the shaded jar.
[2020-12-24T10:09:15.288Z] [INFO] Including org.apache.commons:commons-compress:jar:1.20 in the shaded jar.
[2020-12-24T10:09:15.288Z] [INFO] Including commons-codec:commons-codec:jar:1.11 in the shaded jar.
[2020-12-24T10:09:15.999Z] [WARNING] commons-codec-1.11.jar, commons-compress-1.20.jar, commons-io-2.6.jar, commons-lang3-3.8.1.jar, maven-shared-utils-3.1.0.jar, surefire-shared-utils-3.0.0-M6-SNAPSHOT.jar define 1 overlapping resources:
[2020-12-24T10:09:15.999Z] [WARNING]   - META-INF/MANIFEST.MF
[2020-12-24T10:09:15.999Z] [WARNING] commons-codec-1.11.jar, commons-compress-1.20.jar, commons-io-2.6.jar, commons-lang3-3.8.1.jar define 2 overlapping resources:
[2020-12-24T10:09:15.999Z] [WARNING]   - META-INF/LICENSE.txt
[2020-12-24T10:09:15.999Z] [WARNING]   - META-INF/NOTICE.txt
[2020-12-24T10:09:15.999Z] [WARNING] maven-shared-utils-3.1.0.jar, surefire-shared-utils-3.0.0-M6-SNAPSHOT.jar define 3 overlapping resources:
[2020-12-24T10:09:15.999Z] [WARNING]   - META-INF/DEPENDENCIES
[2020-12-24T10:09:15.999Z] [WARNING]   - META-INF/LICENSE
[2020-12-24T10:09:15.999Z] [WARNING]   - META-INF/NOTICE
[2020-12-24T10:09:15.999Z] [WARNING] maven-shade-plugin has detected that some class files are
[2020-12-24T10:09:15.999Z] [WARNING] present in two or more JARs. When this happens, only one
[2020-12-24T10:09:15.999Z] [WARNING] single version of the class is copied to the uber jar.
[2020-12-24T10:09:15.999Z] [WARNING] Usually this is not harmful and you can skip these warnings,
[2020-12-24T10:09:15.999Z] [WARNING] otherwise try to manually exclude artifacts based on
[2020-12-24T10:09:15.999Z] [WARNING] mvn dependency:tree -Ddetail=true and the above output.
[2020-12-24T10:09:15.999Z] [WARNING] See http://maven.apache.org/plugins/maven-shade-plugin/
[2020-12-24T10:09:15.999Z] [INFO] Replacing original artifact with shaded artifact.
[2020-12-24T10:09:15.999Z] [INFO] Replacing C:\Users\jenkins\AppData\Local\Temp\jenkins-Maven-maven-box-maven-surefire-master-46\surefire-shared-utils\target\surefire-shared-utils-3.0.0-M6-SNAPSHOT.jar with C:\Users\jenkins\AppData\Local\Temp\jenkins-Maven-maven-box-maven-surefire-master-46\surefire-shared-utils\target\surefire-shared-utils-3.0.0-M6-SNAPSHOT-shaded.jar
[2020-12-24T10:09:15.999Z] [INFO] Dependency-reduced POM written at: C:\Users\jenkins\AppData\Local\Temp\jenkins-Maven-maven-box-maven-surefire-master-46\surefire-shared-utils\dependency-reduced-pom.xml
[2020-12-24T10:09:15.999Z] [INFO]
[2020-12-24T10:09:15.999Z] [INFO] --- maven-checkstyle-plugin:3.0.0:check (checkstyle-check) @ surefire-shared-utils ---
[2020-12-24T10:09:16.350Z] [INFO]
[2020-12-24T10:09:16.350Z] [INFO] --- maven-install-plugin:2.5.2:install (default-install) @ surefire-shared-utils ---
[2020-12-24T10:09:16.350Z] [INFO] Installing C:\Users\jenkins\AppData\Local\Temp\jenkins-Maven-maven-box-maven-surefire-master-46\surefire-shared-utils\target\surefire-shared-utils-3.0.0-M6-SNAPSHOT.jar to C:\Users\jenkins\AppData\Local\Temp\jenkins-Maven-maven-box-maven-surefire-master-46\.m2\org\apache\maven\surefire\surefire-shared-utils\3.0.0-M6-SNAPSHOT\surefire-shared-utils-3.0.0-M6-SNAPSHOT.jar
[2020-12-24T10:09:16.350Z] [INFO] Installing C:\Users\jenkins\AppData\Local\Temp\jenkins-Maven-maven-box-maven-surefire-master-46\surefire-shared-utils\dependency-reduced-pom.xml to C:\Users\jenkins\AppData\Local\Temp\jenkins-Maven-maven-box-maven-surefire-master-46\.m2\org\apache\maven\surefire\surefire-shared-utils\3.0.0-M6-SNAPSHOT\surefire-shared-utils-3.0.0-M6-SNAPSHOT.pom
[2020-12-24T10:09:16.350Z] [INFO] ------------------------------------------------------------------------
[2020-12-24T10:09:16.350Z] [INFO] Reactor Summary:
[2020-12-24T10:09:16.350Z] [INFO]
[2020-12-24T10:09:16.350Z] [INFO] Apache Maven Surefire .............................. SUCCESS [ 47.222 s]
[2020-12-24T10:09:16.350Z] [INFO] SureFire Logger API ................................ SUCCESS [ 18.124 s]
[2020-12-24T10:09:16.350Z] [INFO] SureFire API ....................................... SUCCESS [ 20.246 s]
[2020-12-24T10:09:16.350Z] [INFO] Surefire Extensions API ............................ SUCCESS [  6.303 s]
[2020-12-24T10:09:16.350Z] [INFO] Surefire Extensions SPI ............................ SUCCESS [  1.947 s]
[2020-12-24T10:09:16.350Z] [INFO] SureFire Booter .................................... SUCCESS [ 23.382 s]
[2020-12-24T10:09:16.350Z] [INFO] Maven Surefire Test-Grouping Support ............... SUCCESS [  8.176 s]
[2020-12-24T10:09:16.350Z] [INFO] SureFire Providers ................................. SUCCESS [  0.920 s]
[2020-12-24T10:09:16.350Z] [INFO] Shared JUnit3 Provider Code ........................ SUCCESS [  4.123 s]
[2020-12-24T10:09:16.350Z] [INFO] Shared Java 5 Provider Base ........................ SUCCESS [  5.243 s]
[2020-12-24T10:09:16.350Z] [INFO] Shared JUnit4 Provider Code ........................ SUCCESS [  5.663 s]
[2020-12-24T10:09:16.350Z] [INFO] Shared JUnit48 Provider Code ....................... SUCCESS [  8.847 s]
[2020-12-24T10:09:16.350Z] [INFO] SureFire JUnit Runner .............................. SUCCESS [  4.218 s]
[2020-12-24T10:09:16.350Z] [INFO] SureFire JUnit4 Runner ............................. SUCCESS [  4.482 s]
[2020-12-24T10:09:16.350Z] [INFO] Maven Surefire Common .............................. SUCCESS [01:15 min]
[2020-12-24T10:09:16.350Z] [INFO] SureFire JUnitCore Runner .......................... SUCCESS [02:20 min]
[2020-12-24T10:09:16.350Z] [INFO] SureFire JUnit Platform Runner ..................... SUCCESS [ 11.648 s]
[2020-12-24T10:09:16.350Z] [INFO] SureFire TestNG Utils .............................. SUCCESS [  4.508 s]
[2020-12-24T10:09:16.350Z] [INFO] SureFire TestNG Runner ............................. SUCCESS [  6.621 s]
[2020-12-24T10:09:16.350Z] [INFO] ShadeFire JUnit3 Provider .......................... SUCCESS [  2.098 s]
[2020-12-24T10:09:16.350Z] [INFO] Surefire Report Parser ............................. SUCCESS [  7.078 s]
[2020-12-24T10:09:16.350Z] [INFO] Maven Surefire Plugin .............................. SUCCESS [ 10.243 s]
[2020-12-24T10:09:16.350Z] [INFO] Maven Failsafe Plugin .............................. SUCCESS [01:09 min]
[2020-12-24T10:09:16.350Z] [INFO] Maven Surefire Report Plugin ....................... SUCCESS [ 19.753 s]
[2020-12-24T10:09:16.350Z] [INFO] Maven Surefire Integration Tests ................... SUCCESS [  01:04 h]
[2020-12-24T10:09:16.350Z] [INFO] Surefire Shared Utils .............................. SUCCESS [  2.252 s]
[2020-12-24T10:09:16.350Z] [INFO] ------------------------------------------------------------------------
[2020-12-24T10:09:16.350Z] [INFO] BUILD SUCCESS
[2020-12-24T10:09:16.350Z] [INFO] ------------------------------------------------------------------------
[2020-12-24T10:09:16.350Z] [INFO] Total time: 01:12 h
[2020-12-24T10:09:16.350Z] [INFO] Finished at: 2020-12-24T02:09:16-08:00
[2020-12-24T10:09:17.061Z] [INFO] Final Memory: 56M/206M
[2020-12-24T10:09:17.061Z] [INFO] ------------------------------------------------------------------------
[Pipeline] }
[Pipeline] // withEnv
[Pipeline] }
[Pipeline] // stage
[Pipeline] fileExists
[Pipeline] zip
[2020-12-24T10:09:17.424Z] Writing zip file of C:\Users\jenkins\AppData\Local\Temp\jenkins-Maven-maven-box-maven-surefire-master-46\maven-failsafe-plugin\target\it to C:\Users\jenkins\AppData\Local\Temp\jenkins-Maven-maven-box-maven-surefire-master-46\maven-failsafe-plugin--windows-jdk7-maven3.2.x.zip
[2020-12-24T10:09:17.579Z] Zipped 78 entries.
[2020-12-24T10:09:17.579Z] Archiving C:\Users\jenkins\AppData\Local\Temp\jenkins-Maven-maven-box-maven-surefire-master-46\maven-failsafe-plugin--windows-jdk7-maven3.2.x.zip
[2020-12-24T10:09:17.579Z] [Fast Archiver] No artifacts from Maven » Maven TLP » maven-surefire » master #45 to compare, so performing full copy of artifacts
[Pipeline] fileExists
[Pipeline] zip
[2020-12-24T10:09:17.727Z] Writing zip file of C:\Users\jenkins\AppData\Local\Temp\jenkins-Maven-maven-box-maven-surefire-master-46\surefire-its\target to C:\Users\jenkins\AppData\Local\Temp\jenkins-Maven-maven-box-maven-surefire-master-46\surefire-its--windows-jdk7-maven3.2.x.zip
[2020-12-24T10:09:55.280Z] Zipped 17026 entries.
[2020-12-24T10:09:55.280Z] Archiving C:\Users\jenkins\AppData\Local\Temp\jenkins-Maven-maven-box-maven-surefire-master-46\surefire-its--windows-jdk7-maven3.2.x.zip
[2020-12-24T10:09:55.280Z] [Fast Archiver] No artifacts from Maven » Maven TLP » maven-surefire » master #45 to compare, so performing full copy of artifacts
[Pipeline] archiveArtifacts
[2020-12-24T10:10:04.893Z] Archiving artifacts
[2020-12-24T10:10:04.927Z] [Fast Archiver] No artifacts from Maven » Maven TLP » maven-surefire » master #45 to compare, so performing full copy of artifacts
[Pipeline] cleanWs
[2020-12-24T10:10:14.558Z] [WS-CLEANUP] Deleting project workspace...
[2020-12-24T10:10:14.558Z] [WS-CLEANUP] Deferred wipeout is used...
[2020-12-24T10:10:14.714Z] [WS-CLEANUP] done
[Pipeline] }
[Pipeline] // ws
[Pipeline] }
[Pipeline] // timestamps
[Pipeline] }
[Pipeline] // node
[Pipeline] }
[Pipeline] // parallel
[Pipeline] echo
Build result: FAILURE
[Pipeline] jiraIssueSelector
[Pipeline] echo
The authors of changes [christoffer.sawicki].
[Pipeline] echo
Sending email ...
[Pipeline] emailext
Reply | Threaded
Open this post in threaded view
|

Build failed in Jenkins: Maven » Maven TLP » maven-surefire » master #47

Apache Jenkins Server-2
See https://ci-builds.apache.org/job/Maven/job/maven-box/job/maven-surefire/job/master/47/

Changes:

* Next Maven version change 3.7.x -> 4.x.x
* Added Java 17
* ci: JDK 8, JDK 11, JDK 15

1 tests failed.
FAILED:  org.apache.maven.surefire.booter.SystemUtilsTest.

Error Message:
PowerMock internal error: Should never throw exception at this level

Stack Trace:
java.lang.RuntimeException: PowerMock internal error: Should never throw exception at this level
        at org.powermock.modules.junit4.internal.impl.PowerMockJUnit44RunnerDelegateImpl$PowerMockJUnit44MethodRunner.handleException(PowerMockJUnit44RunnerDelegateImpl.java:384)
        at org.powermock.modules.junit4.internal.impl.PowerMockJUnit47RunnerDelegateImpl$PowerMockJUnit47MethodRunner.evaluateStatement(PowerMockJUnit47RunnerDelegateImpl.java:110)
        at org.powermock.modules.junit4.internal.impl.PowerMockJUnit47RunnerDelegateImpl$PowerMockJUnit47MethodRunner.executeTest(PowerMockJUnit47RunnerDelegateImpl.java:82)
        at org.powermock.modules.junit4.internal.impl.PowerMockJUnit44RunnerDelegateImpl$PowerMockJUnit44MethodRunner.runBeforesThenTestThenAfters(PowerMockJUnit44RunnerDelegateImpl.java:298)
        at org.junit.internal.runners.MethodRoadie.runTest(MethodRoadie.java:87)
        at org.junit.internal.runners.MethodRoadie.run(MethodRoadie.java:50)
        at org.powermock.modules.junit4.internal.impl.PowerMockJUnit44RunnerDelegateImpl.invokeTestMethod(PowerMockJUnit44RunnerDelegateImpl.java:218)
        at org.powermock.modules.junit4.internal.impl.PowerMockJUnit44RunnerDelegateImpl.runMethods(PowerMockJUnit44RunnerDelegateImpl.java:160)
        at org.powermock.modules.junit4.internal.impl.PowerMockJUnit44RunnerDelegateImpl$1.run(PowerMockJUnit44RunnerDelegateImpl.java:134)
        at org.junit.internal.runners.ClassRoadie.runUnprotected(ClassRoadie.java:34)
        at org.junit.internal.runners.ClassRoadie.runProtected(ClassRoadie.java:44)
        at org.powermock.modules.junit4.internal.impl.PowerMockJUnit44RunnerDelegateImpl.run(PowerMockJUnit44RunnerDelegateImpl.java:136)
        at org.powermock.modules.junit4.common.internal.impl.JUnit4TestSuiteChunkerImpl.run(JUnit4TestSuiteChunkerImpl.java:117)
        at org.powermock.modules.junit4.common.internal.impl.AbstractCommonPowerMockRunner.run(AbstractCommonPowerMockRunner.java:57)
        at org.powermock.modules.junit4.PowerMockRunner.run(PowerMockRunner.java:59)
        at org.junit.runners.Suite.runChild(Suite.java:128)
        at org.junit.runners.Suite.runChild(Suite.java:27)
        at org.junit.runners.ParentRunner$4.run(ParentRunner.java:331)
        at org.junit.runners.ParentRunner$1.schedule(ParentRunner.java:79)
        at org.junit.runners.ParentRunner.runChildren(ParentRunner.java:329)
        at org.junit.runners.ParentRunner.access$100(ParentRunner.java:66)
        at org.junit.runners.ParentRunner$2.evaluate(ParentRunner.java:293)
        at org.junit.runners.ParentRunner$3.evaluate(ParentRunner.java:306)
        at org.junit.runners.ParentRunner.run(ParentRunner.java:413)
        at junit.framework.JUnit4TestAdapter.run(JUnit4TestAdapter.java:50)
        at junit.framework.TestSuite.runTest(TestSuite.java:241)
        at junit.framework.TestSuite.run(TestSuite.java:236)
        at java.base/jdk.internal.reflect.NativeMethodAccessorImpl.invoke0(Native Method)
        at java.base/jdk.internal.reflect.NativeMethodAccessorImpl.invoke(NativeMethodAccessorImpl.java:78)
        at java.base/jdk.internal.reflect.DelegatingMethodAccessorImpl.invoke(DelegatingMethodAccessorImpl.java:43)
        at java.base/java.lang.reflect.Method.invoke(Method.java:567)
        at org.apache.maven.shadefire.surefire.junit.JUnitTestSet.execute(JUnitTestSet.java:99)
        at org.apache.maven.shadefire.surefire.junit.JUnit3Provider.executeTestSet(JUnit3Provider.java:141)
        at org.apache.maven.shadefire.surefire.junit.JUnit3Provider.invoke(JUnit3Provider.java:114)
        at org.apache.maven.shadefire.surefire.booter.ForkedBooter.runSuitesInProcess(ForkedBooter.java:377)
        at org.apache.maven.shadefire.surefire.booter.ForkedBooter.execute(ForkedBooter.java:138)
        at org.apache.maven.shadefire.surefire.booter.ForkedBooter.run(ForkedBooter.java:465)
        at org.apache.maven.shadefire.surefire.booter.ForkedBooter.main(ForkedBooter.java:451)
Caused by: java.lang.reflect.InaccessibleObjectException: Unable to make protected native java.lang.Object java.lang.Object.clone() throws java.lang.CloneNotSupportedException accessible: module java.base does not "opens java.lang" to unnamed module @6b357eb6
        at java.base/java.lang.reflect.AccessibleObject.checkCanSetAccessible(AccessibleObject.java:357)
        at java.base/java.lang.reflect.AccessibleObject.checkCanSetAccessible(AccessibleObject.java:297)
        at java.base/java.lang.reflect.Method.checkCanSetAccessible(Method.java:199)
        at java.base/java.lang.reflect.Method.setAccessible(Method.java:193)
        at org.powermock.reflect.internal.WhiteboxImpl.doGetAllMethods(WhiteboxImpl.java:1508)
        at org.powermock.reflect.internal.WhiteboxImpl.getAllMethods(WhiteboxImpl.java:1482)
        at org.powermock.reflect.internal.WhiteboxImpl.findMethodOrThrowException(WhiteboxImpl.java:862)
        at org.powermock.reflect.internal.WhiteboxImpl.doInvokeMethod(WhiteboxImpl.java:822)
        at org.powermock.reflect.internal.WhiteboxImpl.invokeMethod(WhiteboxImpl.java:690)
        at org.powermock.reflect.Whitebox.invokeMethod(Whitebox.java:401)
        at org.powermock.modules.junit4.internal.impl.PowerMockJUnit44RunnerDelegateImpl$PowerMockJUnit44MethodRunner.handleException(PowerMockJUnit44RunnerDelegateImpl.java:361)
        ... 37 more
Caused by: java.lang.reflect.InaccessibleObjectException: Unable to make protected native java.lang.Object java.lang.Object.clone() throws java.lang.CloneNotSupportedException accessible: module java.base does not "opens java.lang" to unnamed module @6b357eb6
        at java.base/java.lang.reflect.AccessibleObject.checkCanSetAccessible(AccessibleObject.java:357)
        at java.base/java.lang.reflect.AccessibleObject.checkCanSetAccessible(AccessibleObject.java:297)
        at java.base/java.lang.reflect.Method.checkCanSetAccessible(Method.java:199)
        at java.base/java.lang.reflect.Method.setAccessible(Method.java:193)
        at org.powermock.reflect.internal.WhiteboxImpl.doGetAllMethods(WhiteboxImpl.java:1508)
        at org.powermock.reflect.internal.WhiteboxImpl.getAllMethods(WhiteboxImpl.java:1482)
        at org.powermock.reflect.internal.WhiteboxImpl.findMethodOrThrowException(WhiteboxImpl.java:862)
        at org.powermock.reflect.internal.WhiteboxImpl.doInvokeMethod(WhiteboxImpl.java:822)
        at org.powermock.reflect.internal.WhiteboxImpl.invokeMethod(WhiteboxImpl.java:690)
        at org.powermock.reflect.Whitebox.invokeMethod(Whitebox.java:401)
        at org.powermock.modules.junit4.internal.impl.PowerMockJUnit44RunnerDelegateImpl$PowerMockJUnit44MethodRunner.handleException(PowerMockJUnit44RunnerDelegateImpl.java:361)
        ... 37 more




Build log:
[...truncated 49024 lines...]
[2021-01-08T15:18:21.681Z] [INFO] Tests run: 1, Failures: 0, Errors: 0, Skipped: 0, Time elapsed: 4.752 s - in org.apache.maven.surefire.its.jiras.Surefire685CommaSeparatedIncludesIT
[2021-01-08T15:18:21.681Z] [INFO] Running org.apache.maven.surefire.its.jiras.Surefire697NiceSummaryIT
[2021-01-08T15:18:25.464Z] [INFO] Tests run: 1, Failures: 0, Errors: 0, Skipped: 0, Time elapsed: 3.828 s - in org.apache.maven.surefire.its.jiras.Surefire697NiceSummaryIT
[2021-01-08T15:18:25.464Z] [INFO] Running org.apache.maven.surefire.its.jiras.Surefire705ParallelForkTimeoutIT
[2021-01-08T15:18:32.750Z] [INFO] Tests run: 1, Failures: 0, Errors: 0, Skipped: 0, Time elapsed: 7.903 s - in org.apache.maven.surefire.its.jiras.Surefire705ParallelForkTimeoutIT
[2021-01-08T15:18:32.750Z] [INFO] Running org.apache.maven.surefire.its.jiras.Surefire733AllOverrridesCapturedIT
[2021-01-08T15:18:37.513Z] [INFO] Tests run: 1, Failures: 0, Errors: 0, Skipped: 0, Time elapsed: 4.448 s - in org.apache.maven.surefire.its.jiras.Surefire733AllOverrridesCapturedIT
[2021-01-08T15:18:37.513Z] [INFO] Running org.apache.maven.surefire.its.jiras.Surefire735ForkFailWithRedirectConsoleOutputIT
[2021-01-08T15:18:44.833Z] [INFO] Tests run: 2, Failures: 0, Errors: 0, Skipped: 0, Time elapsed: 7.773 s - in org.apache.maven.surefire.its.jiras.Surefire735ForkFailWithRedirectConsoleOutputIT
[2021-01-08T15:18:44.833Z] [INFO] Running org.apache.maven.surefire.its.jiras.Surefire740TruncatedCommaIT
[2021-01-08T15:18:48.617Z] [INFO] Tests run: 1, Failures: 0, Errors: 0, Skipped: 0, Time elapsed: 3.697 s - in org.apache.maven.surefire.its.jiras.Surefire740TruncatedCommaIT
[2021-01-08T15:18:48.617Z] [INFO] Running org.apache.maven.surefire.its.jiras.Surefire747MethodParallelWithSuiteCountIT
[2021-01-08T15:19:11.696Z] [INFO] Tests run: 2, Failures: 0, Errors: 0, Skipped: 0, Time elapsed: 20.001 s - in org.apache.maven.surefire.its.jiras.Surefire747MethodParallelWithSuiteCountIT
[2021-01-08T15:19:11.696Z] [INFO] Running org.apache.maven.surefire.its.jiras.Surefire772BothReportsIT
[2021-01-08T15:19:18.975Z] [INFO] Tests run: 3, Failures: 0, Errors: 0, Skipped: 0, Time elapsed: 9.214 s - in org.apache.maven.surefire.its.jiras.Surefire772BothReportsIT
[2021-01-08T15:19:18.975Z] [INFO] Running org.apache.maven.surefire.its.jiras.Surefire772NoFailsafeReportsIT
[2021-01-08T15:19:29.817Z] [INFO] Tests run: 4, Failures: 0, Errors: 0, Skipped: 0, Time elapsed: 11.573 s - in org.apache.maven.surefire.its.jiras.Surefire772NoFailsafeReportsIT
[2021-01-08T15:19:29.817Z] [INFO] Running org.apache.maven.surefire.its.jiras.Surefire772NoSurefireReportsIT
[2021-01-08T15:19:42.946Z] [INFO] Tests run: 4, Failures: 0, Errors: 0, Skipped: 0, Time elapsed: 12.172 s - in org.apache.maven.surefire.its.jiras.Surefire772NoSurefireReportsIT
[2021-01-08T15:19:42.946Z] [INFO] Running org.apache.maven.surefire.its.jiras.Surefire772SpecifiedReportsIT
[2021-01-08T15:19:51.860Z] [INFO] Tests run: 3, Failures: 0, Errors: 0, Skipped: 0, Time elapsed: 9.191 s - in org.apache.maven.surefire.its.jiras.Surefire772SpecifiedReportsIT
[2021-01-08T15:19:51.860Z] [INFO] Running org.apache.maven.surefire.its.jiras.Surefire801ForkModeNoneClassLoaderIT
[2021-01-08T15:19:54.824Z] [INFO] Tests run: 1, Failures: 0, Errors: 0, Skipped: 0, Time elapsed: 4.088 s - in org.apache.maven.surefire.its.jiras.Surefire801ForkModeNoneClassLoaderIT
[2021-01-08T15:19:54.824Z] [INFO] Running org.apache.maven.surefire.its.jiras.Surefire803MultiFailsafeExecsIT
[2021-01-08T15:20:13.984Z] [INFO] Tests run: 2, Failures: 0, Errors: 0, Skipped: 0, Time elapsed: 16.138 s - in org.apache.maven.surefire.its.jiras.Surefire803MultiFailsafeExecsIT
[2021-01-08T15:20:13.984Z] [INFO] Running org.apache.maven.surefire.its.jiras.Surefire806SpecifiedTestControlsIT
[2021-01-08T15:20:15.646Z] [WARNING] Tests run: 3, Failures: 0, Errors: 0, Skipped: 2, Time elapsed: 4.226 s - in org.apache.maven.surefire.its.jiras.Surefire806SpecifiedTestControlsIT
[2021-01-08T15:20:15.646Z] [INFO] Running org.apache.maven.surefire.its.jiras.Surefire809GroupExpressionsIT
[2021-01-08T15:20:49.013Z] [INFO] Tests run: 6, Failures: 0, Errors: 0, Skipped: 0, Time elapsed: 29.529 s - in org.apache.maven.surefire.its.jiras.Surefire809GroupExpressionsIT
[2021-01-08T15:20:49.013Z] [INFO] Running org.apache.maven.surefire.its.jiras.Surefire812Log4JClassLoaderIT
[2021-01-08T15:20:49.359Z] [INFO] Tests run: 1, Failures: 0, Errors: 0, Skipped: 0, Time elapsed: 4.439 s - in org.apache.maven.surefire.its.jiras.Surefire812Log4JClassLoaderIT
[2021-01-08T15:20:49.359Z] [INFO] Running org.apache.maven.surefire.its.jiras.Surefire817SystemExitIT
[2021-01-08T15:20:54.136Z] [INFO] Tests run: 1, Failures: 0, Errors: 0, Skipped: 0, Time elapsed: 4.615 s - in org.apache.maven.surefire.its.jiras.Surefire817SystemExitIT
[2021-01-08T15:20:54.136Z] [INFO] Running org.apache.maven.surefire.its.jiras.Surefire818NpeIgnoresTestsIT
[2021-01-08T15:21:01.414Z] [INFO] Tests run: 1, Failures: 0, Errors: 0, Skipped: 0, Time elapsed: 6.486 s - in org.apache.maven.surefire.its.jiras.Surefire818NpeIgnoresTestsIT
[2021-01-08T15:21:01.414Z] [INFO] Running org.apache.maven.surefire.its.jiras.Surefire828EmptyGroupExprIT
[2021-01-08T15:21:20.568Z] [INFO] Tests run: 4, Failures: 0, Errors: 0, Skipped: 0, Time elapsed: 18.615 s - in org.apache.maven.surefire.its.jiras.Surefire828EmptyGroupExprIT
[2021-01-08T15:21:20.568Z] [INFO] Running org.apache.maven.surefire.its.jiras.Surefire832ProviderSelectionIT
[2021-01-08T15:21:25.354Z] [INFO] Tests run: 1, Failures: 0, Errors: 0, Skipped: 0, Time elapsed: 5.524 s - in org.apache.maven.surefire.its.jiras.Surefire832ProviderSelectionIT
[2021-01-08T15:21:25.354Z] [INFO] Running org.apache.maven.surefire.its.jiras.Surefire839TestWithoutCategoriesIT
[2021-01-08T15:21:36.184Z] [INFO] Tests run: 2, Failures: 0, Errors: 0, Skipped: 0, Time elapsed: 10.939 s - in org.apache.maven.surefire.its.jiras.Surefire839TestWithoutCategoriesIT
[2021-01-08T15:21:36.184Z] [INFO] Running org.apache.maven.surefire.its.jiras.Surefire847AdditionalFailureIT
[2021-01-08T15:21:42.140Z] [INFO] Tests run: 1, Failures: 0, Errors: 0, Skipped: 0, Time elapsed: 6.221 s - in org.apache.maven.surefire.its.jiras.Surefire847AdditionalFailureIT
[2021-01-08T15:21:42.140Z] [INFO] Running org.apache.maven.surefire.its.jiras.Surefire855AllowFailsafeUseArtifactFileIT
[2021-01-08T15:22:39.890Z] [INFO] Tests run: 4, Failures: 0, Errors: 0, Skipped: 0, Time elapsed: 48.898 s - in org.apache.maven.surefire.its.jiras.Surefire855AllowFailsafeUseArtifactFileIT
[2021-01-08T15:22:39.890Z] [INFO] Running org.apache.maven.surefire.its.jiras.Surefire901MIssingResultfileWhenNoTestsIT
[2021-01-08T15:22:39.890Z] [INFO] Tests run: 1, Failures: 0, Errors: 0, Skipped: 0, Time elapsed: 3.126 s - in org.apache.maven.surefire.its.jiras.Surefire901MIssingResultfileWhenNoTestsIT
[2021-01-08T15:22:39.890Z] [INFO] Running org.apache.maven.surefire.its.jiras.Surefire907PerThreadWithoutThreadCountIT
[2021-01-08T15:22:39.890Z] [INFO] Tests run: 1, Failures: 0, Errors: 0, Skipped: 0, Time elapsed: 3.152 s - in org.apache.maven.surefire.its.jiras.Surefire907PerThreadWithoutThreadCountIT
[2021-01-08T15:22:39.890Z] [INFO] Running org.apache.maven.surefire.its.jiras.Surefire920TestFailureIgnoreWithTimeoutIT
[2021-01-08T15:22:48.786Z] [INFO] Tests run: 2, Failures: 0, Errors: 0, Skipped: 0, Time elapsed: 11.74 s - in org.apache.maven.surefire.its.jiras.Surefire920TestFailureIgnoreWithTimeoutIT
[2021-01-08T15:22:48.786Z] [INFO] Running org.apache.maven.surefire.its.jiras.Surefire926FailureWith2ProvidersIT
[2021-01-08T15:22:54.700Z] [INFO] Tests run: 1, Failures: 0, Errors: 0, Skipped: 0, Time elapsed: 5.885 s - in org.apache.maven.surefire.its.jiras.Surefire926FailureWith2ProvidersIT
[2021-01-08T15:22:54.700Z] [INFO] Running org.apache.maven.surefire.its.jiras.Surefire930TestNgSuiteXmlIT
[2021-01-08T15:23:00.610Z] [INFO] Tests run: 1, Failures: 0, Errors: 0, Skipped: 0, Time elapsed: 5.636 s - in org.apache.maven.surefire.its.jiras.Surefire930TestNgSuiteXmlIT
[2021-01-08T15:23:00.610Z] [INFO] Running org.apache.maven.surefire.its.jiras.Surefire943ReportContentIT
[2021-01-08T15:23:28.394Z] [INFO] Tests run: 2, Failures: 0, Errors: 0, Skipped: 0, Time elapsed: 25.761 s - in org.apache.maven.surefire.its.jiras.Surefire943ReportContentIT
[2021-01-08T15:23:28.394Z] [INFO] Running org.apache.maven.surefire.its.jiras.Surefire946KillMainProcessInReusableForkIT
[2021-01-08T15:24:26.148Z] [INFO] Tests run: 6, Failures: 0, Errors: 0, Skipped: 0, Time elapsed: 58.919 s - in org.apache.maven.surefire.its.jiras.Surefire946KillMainProcessInReusableForkIT
[2021-01-08T15:24:26.148Z] [INFO] Running org.apache.maven.surefire.its.jiras.Surefire972BizarreNoClassDefIT
[2021-01-08T15:24:33.439Z] [INFO] Tests run: 1, Failures: 0, Errors: 0, Skipped: 0, Time elapsed: 8.226 s - in org.apache.maven.surefire.its.jiras.Surefire972BizarreNoClassDefIT
[2021-01-08T15:24:33.439Z] [INFO] Running org.apache.maven.surefire.its.jiras.Surefire975DefaultVMEncodingIT
[2021-01-08T15:24:38.277Z] [INFO] Tests run: 1, Failures: 0, Errors: 0, Skipped: 0, Time elapsed: 4.544 s - in org.apache.maven.surefire.its.jiras.Surefire975DefaultVMEncodingIT
[2021-01-08T15:24:38.277Z] [INFO] Running org.apache.maven.surefire.its.jiras.Surefire979WrongClassLoaderIT
[2021-01-08T15:24:43.093Z] [INFO] Tests run: 1, Failures: 0, Errors: 0, Skipped: 0, Time elapsed: 5.056 s - in org.apache.maven.surefire.its.jiras.Surefire979WrongClassLoaderIT
[2021-01-08T15:24:43.094Z] [INFO] Running org.apache.maven.surefire.its.jiras.Surefire985ParameterizedRunnerAndCategoriesIT
[2021-01-08T15:24:47.850Z] [INFO] Tests run: 1, Failures: 0, Errors: 0, Skipped: 0, Time elapsed: 4.711 s - in org.apache.maven.surefire.its.jiras.Surefire985ParameterizedRunnerAndCategoriesIT
[2021-01-08T15:24:47.850Z] [INFO] Running org.apache.maven.surefire.its.jiras.Surefire995CategoryInheritanceIT
[2021-01-08T15:25:21.208Z] [INFO] Tests run: 7, Failures: 0, Errors: 0, Skipped: 0, Time elapsed: 33.147 s - in org.apache.maven.surefire.its.jiras.Surefire995CategoryInheritanceIT
[2021-01-08T15:25:21.208Z] [INFO]
[2021-01-08T15:25:21.208Z] [INFO] Results:
[2021-01-08T15:25:21.208Z] [INFO]
[2021-01-08T15:25:21.208Z] [WARNING] Tests run: 973, Failures: 0, Errors: 0, Skipped: 310
[2021-01-08T15:25:21.208Z] [INFO]
[2021-01-08T15:25:21.208Z] [INFO]
[2021-01-08T15:25:21.208Z] [INFO] --- maven-checkstyle-plugin:3.0.0:check (checkstyle-check) @ surefire-its ---
[2021-01-08T15:25:22.358Z] [INFO]
[2021-01-08T15:25:22.358Z] [INFO] --- maven-failsafe-plugin:3.0.0-M4:verify (default) @ surefire-its ---
[2021-01-08T15:25:22.358Z] [INFO] Failsafe report directory: C:\Users\jenkins\AppData\Local\Temp\jenkins-Maven-maven-box-maven-surefire-master-47\surefire-its\target\failsafe-reports
[2021-01-08T15:25:22.358Z] [INFO]
[2021-01-08T15:25:22.358Z] [INFO] --- maven-install-plugin:2.5.2:install (default-install) @ surefire-its ---
[2021-01-08T15:25:22.358Z] [INFO] Skipping artifact installation
[2021-01-08T15:25:22.358Z] [INFO]                                                                        
[2021-01-08T15:25:22.358Z] [INFO] ------------------------------------------------------------------------
[2021-01-08T15:25:22.358Z] [INFO] Building Surefire Shared Utils 3.0.0-M6-SNAPSHOT
[2021-01-08T15:25:22.358Z] [INFO] ------------------------------------------------------------------------
[2021-01-08T15:25:22.689Z] [INFO]
[2021-01-08T15:25:22.689Z] [INFO] --- maven-clean-plugin:3.1.0:clean (default-clean) @ surefire-shared-utils ---
[2021-01-08T15:25:22.689Z] [INFO]
[2021-01-08T15:25:22.689Z] [INFO] --- maven-enforcer-plugin:3.0.0-M3:enforce (enforce-maven-version) @ surefire-shared-utils ---
[2021-01-08T15:25:22.689Z] [INFO]
[2021-01-08T15:25:22.689Z] [INFO] --- maven-enforcer-plugin:3.0.0-M3:enforce (enforce-bytecode-version) @ surefire-shared-utils ---
[2021-01-08T15:25:22.689Z] [INFO] Adding ignore: module-info
[2021-01-08T15:25:22.689Z] [INFO]
[2021-01-08T15:25:22.689Z] [INFO] --- maven-enforcer-plugin:3.0.0-M3:enforce (enforce-java) @ surefire-shared-utils ---
[2021-01-08T15:25:22.689Z] [INFO]
[2021-01-08T15:25:22.689Z] [INFO] --- maven-enforcer-plugin:3.0.0-M3:enforce (enforce-maven) @ surefire-shared-utils ---
[2021-01-08T15:25:22.689Z] [INFO]
[2021-01-08T15:25:22.689Z] [INFO] --- apache-rat-plugin:0.13:check (rat-check) @ surefire-shared-utils ---
[2021-01-08T15:25:22.689Z] [INFO] Enabled default license matchers.
[2021-01-08T15:25:22.689Z] [INFO] Will parse SCM ignores for exclusions...
[2021-01-08T15:25:22.689Z] [INFO] Finished adding exclusions from SCM ignore files.
[2021-01-08T15:25:22.689Z] [INFO] 62 implicit excludes (use -debug for more details).
[2021-01-08T15:25:22.689Z] [INFO] 27 explicit excludes (use -debug for more details).
[2021-01-08T15:25:22.689Z] [INFO] 1 resources included (use -debug for more details)
[2021-01-08T15:25:22.689Z] [INFO] Rat check: Summary over all files. Unapproved: 0, unknown: 0, generated: 0, approved: 1 licenses.
[2021-01-08T15:25:22.689Z] [INFO]
[2021-01-08T15:25:22.689Z] [INFO] --- maven-compiler-plugin:3.8.1:compile (compile-generated) @ surefire-shared-utils ---
[2021-01-08T15:25:22.689Z] [INFO] No sources to compile
[2021-01-08T15:25:22.689Z] [INFO]
[2021-01-08T15:25:22.689Z] [INFO] --- maven-remote-resources-plugin:1.7.0:process (process-resource-bundles) @ surefire-shared-utils ---
[2021-01-08T15:25:22.689Z] [INFO] Preparing remote bundle org.apache:apache-jar-resource-bundle:1.4
[2021-01-08T15:25:22.689Z] [INFO] Copying 3 resources from 1 bundle.
[2021-01-08T15:25:23.027Z] [INFO]
[2021-01-08T15:25:23.027Z] [INFO] --- maven-resources-plugin:3.1.0:resources (default-resources) @ surefire-shared-utils ---
[2021-01-08T15:25:23.027Z] [INFO] Using 'UTF-8' encoding to copy filtered resources.
[2021-01-08T15:25:23.027Z] [INFO] skip non existing resourceDirectory C:\Users\jenkins\AppData\Local\Temp\jenkins-Maven-maven-box-maven-surefire-master-47\surefire-shared-utils\src\main\resources
[2021-01-08T15:25:23.027Z] [INFO] Copying 3 resources
[2021-01-08T15:25:23.027Z] [INFO]
[2021-01-08T15:25:23.027Z] [INFO] --- maven-compiler-plugin:3.8.1:compile (default-compile) @ surefire-shared-utils ---
[2021-01-08T15:25:23.027Z] [INFO] No sources to compile
[2021-01-08T15:25:23.027Z] [INFO]
[2021-01-08T15:25:23.028Z] [INFO] --- animal-sniffer-maven-plugin:1.17:check (signature-check) @ surefire-shared-utils ---
[2021-01-08T15:25:23.028Z] [INFO] Checking unresolved references to org.codehaus.mojo.signature:java17:1.0
[2021-01-08T15:25:23.359Z] [INFO]
[2021-01-08T15:25:23.359Z] [INFO] --- maven-resources-plugin:3.1.0:testResources (default-testResources) @ surefire-shared-utils ---
[2021-01-08T15:25:23.359Z] [INFO] Using 'UTF-8' encoding to copy filtered resources.
[2021-01-08T15:25:23.359Z] [INFO] skip non existing resourceDirectory C:\Users\jenkins\AppData\Local\Temp\jenkins-Maven-maven-box-maven-surefire-master-47\surefire-shared-utils\src\test\resources
[2021-01-08T15:25:23.359Z] [INFO] Copying 3 resources
[2021-01-08T15:25:23.359Z] [INFO]
[2021-01-08T15:25:23.359Z] [INFO] --- maven-compiler-plugin:3.8.1:testCompile (default-testCompile) @ surefire-shared-utils ---
[2021-01-08T15:25:23.359Z] [INFO] No sources to compile
[2021-01-08T15:25:23.359Z] [INFO]
[2021-01-08T15:25:23.359Z] [INFO] --- maven-surefire-plugin:3.0.0-M4:test (default-test) @ surefire-shared-utils ---
[2021-01-08T15:25:23.359Z] [INFO]
[2021-01-08T15:25:23.359Z] [INFO] --- maven-jar-plugin:3.2.0:jar (default-jar) @ surefire-shared-utils ---
[2021-01-08T15:25:23.359Z] [INFO] Building jar: C:\Users\jenkins\AppData\Local\Temp\jenkins-Maven-maven-box-maven-surefire-master-47\surefire-shared-utils\target\surefire-shared-utils-3.0.0-M6-SNAPSHOT.jar
[2021-01-08T15:25:23.359Z] [INFO]
[2021-01-08T15:25:23.359Z] [INFO] --- maven-site-plugin:3.8.2:attach-descriptor (attach-descriptor) @ surefire-shared-utils ---
[2021-01-08T15:25:23.359Z] [INFO] Skipping because packaging 'jar' is not pom.
[2021-01-08T15:25:23.359Z] [INFO]
[2021-01-08T15:25:23.359Z] [INFO] --- maven-shade-plugin:3.2.3:shade (default) @ surefire-shared-utils ---
[2021-01-08T15:25:23.359Z] [INFO] Including org.apache.maven.shared:maven-shared-utils:jar:3.1.0 in the shaded jar.
[2021-01-08T15:25:23.359Z] [INFO] Including commons-io:commons-io:jar:2.6 in the shaded jar.
[2021-01-08T15:25:23.359Z] [INFO] Including org.apache.commons:commons-lang3:jar:3.8.1 in the shaded jar.
[2021-01-08T15:25:23.359Z] [INFO] Including org.apache.commons:commons-compress:jar:1.20 in the shaded jar.
[2021-01-08T15:25:23.359Z] [INFO] Including commons-codec:commons-codec:jar:1.11 in the shaded jar.
[2021-01-08T15:25:24.069Z] [WARNING] commons-codec-1.11.jar, commons-compress-1.20.jar, commons-io-2.6.jar, commons-lang3-3.8.1.jar, maven-shared-utils-3.1.0.jar, surefire-shared-utils-3.0.0-M6-SNAPSHOT.jar define 1 overlapping resources:
[2021-01-08T15:25:24.069Z] [WARNING]   - META-INF/MANIFEST.MF
[2021-01-08T15:25:24.069Z] [WARNING] commons-codec-1.11.jar, commons-compress-1.20.jar, commons-io-2.6.jar, commons-lang3-3.8.1.jar define 2 overlapping resources:
[2021-01-08T15:25:24.069Z] [WARNING]   - META-INF/LICENSE.txt
[2021-01-08T15:25:24.069Z] [WARNING]   - META-INF/NOTICE.txt
[2021-01-08T15:25:24.069Z] [WARNING] maven-shared-utils-3.1.0.jar, surefire-shared-utils-3.0.0-M6-SNAPSHOT.jar define 3 overlapping resources:
[2021-01-08T15:25:24.069Z] [WARNING]   - META-INF/DEPENDENCIES
[2021-01-08T15:25:24.069Z] [WARNING]   - META-INF/LICENSE
[2021-01-08T15:25:24.069Z] [WARNING]   - META-INF/NOTICE
[2021-01-08T15:25:24.069Z] [WARNING] maven-shade-plugin has detected that some class files are
[2021-01-08T15:25:24.069Z] [WARNING] present in two or more JARs. When this happens, only one
[2021-01-08T15:25:24.069Z] [WARNING] single version of the class is copied to the uber jar.
[2021-01-08T15:25:24.069Z] [WARNING] Usually this is not harmful and you can skip these warnings,
[2021-01-08T15:25:24.069Z] [WARNING] otherwise try to manually exclude artifacts based on
[2021-01-08T15:25:24.069Z] [WARNING] mvn dependency:tree -Ddetail=true and the above output.
[2021-01-08T15:25:24.069Z] [WARNING] See http://maven.apache.org/plugins/maven-shade-plugin/
[2021-01-08T15:25:24.069Z] [INFO] Replacing original artifact with shaded artifact.
[2021-01-08T15:25:24.069Z] [INFO] Replacing C:\Users\jenkins\AppData\Local\Temp\jenkins-Maven-maven-box-maven-surefire-master-47\surefire-shared-utils\target\surefire-shared-utils-3.0.0-M6-SNAPSHOT.jar with C:\Users\jenkins\AppData\Local\Temp\jenkins-Maven-maven-box-maven-surefire-master-47\surefire-shared-utils\target\surefire-shared-utils-3.0.0-M6-SNAPSHOT-shaded.jar
[2021-01-08T15:25:24.069Z] [INFO] Dependency-reduced POM written at: C:\Users\jenkins\AppData\Local\Temp\jenkins-Maven-maven-box-maven-surefire-master-47\surefire-shared-utils\dependency-reduced-pom.xml
[2021-01-08T15:25:24.420Z] [INFO]
[2021-01-08T15:25:24.420Z] [INFO] --- maven-checkstyle-plugin:3.0.0:check (checkstyle-check) @ surefire-shared-utils ---
[2021-01-08T15:25:24.420Z] [INFO]
[2021-01-08T15:25:24.420Z] [INFO] --- maven-install-plugin:2.5.2:install (default-install) @ surefire-shared-utils ---
[2021-01-08T15:25:24.420Z] [INFO] Installing C:\Users\jenkins\AppData\Local\Temp\jenkins-Maven-maven-box-maven-surefire-master-47\surefire-shared-utils\target\surefire-shared-utils-3.0.0-M6-SNAPSHOT.jar to C:\Users\jenkins\AppData\Local\Temp\jenkins-Maven-maven-box-maven-surefire-master-47\.m2\org\apache\maven\surefire\surefire-shared-utils\3.0.0-M6-SNAPSHOT\surefire-shared-utils-3.0.0-M6-SNAPSHOT.jar
[2021-01-08T15:25:24.420Z] [INFO] Installing C:\Users\jenkins\AppData\Local\Temp\jenkins-Maven-maven-box-maven-surefire-master-47\surefire-shared-utils\dependency-reduced-pom.xml to C:\Users\jenkins\AppData\Local\Temp\jenkins-Maven-maven-box-maven-surefire-master-47\.m2\org\apache\maven\surefire\surefire-shared-utils\3.0.0-M6-SNAPSHOT\surefire-shared-utils-3.0.0-M6-SNAPSHOT.pom
[2021-01-08T15:25:24.420Z] [INFO] ------------------------------------------------------------------------
[2021-01-08T15:25:24.420Z] [INFO] Reactor Summary:
[2021-01-08T15:25:24.420Z] [INFO]
[2021-01-08T15:25:24.420Z] [INFO] Apache Maven Surefire .............................. SUCCESS [ 47.181 s]
[2021-01-08T15:25:24.420Z] [INFO] SureFire Logger API ................................ SUCCESS [ 17.651 s]
[2021-01-08T15:25:24.420Z] [INFO] SureFire API ....................................... SUCCESS [ 19.591 s]
[2021-01-08T15:25:24.420Z] [INFO] Surefire Extensions API ............................ SUCCESS [  6.089 s]
[2021-01-08T15:25:24.420Z] [INFO] Surefire Extensions SPI ............................ SUCCESS [  2.120 s]
[2021-01-08T15:25:24.420Z] [INFO] SureFire Booter .................................... SUCCESS [ 23.679 s]
[2021-01-08T15:25:24.420Z] [INFO] Maven Surefire Test-Grouping Support ............... SUCCESS [  8.218 s]
[2021-01-08T15:25:24.420Z] [INFO] SureFire Providers ................................. SUCCESS [  0.916 s]
[2021-01-08T15:25:24.420Z] [INFO] Shared JUnit3 Provider Code ........................ SUCCESS [  4.394 s]
[2021-01-08T15:25:24.420Z] [INFO] Shared Java 5 Provider Base ........................ SUCCESS [  5.135 s]
[2021-01-08T15:25:24.420Z] [INFO] Shared JUnit4 Provider Code ........................ SUCCESS [  5.533 s]
[2021-01-08T15:25:24.420Z] [INFO] Shared JUnit48 Provider Code ....................... SUCCESS [  9.358 s]
[2021-01-08T15:25:24.420Z] [INFO] SureFire JUnit Runner .............................. SUCCESS [  4.750 s]
[2021-01-08T15:25:24.420Z] [INFO] SureFire JUnit4 Runner ............................. SUCCESS [  4.465 s]
[2021-01-08T15:25:24.420Z] [INFO] Maven Surefire Common .............................. SUCCESS [01:13 min]
[2021-01-08T15:25:24.420Z] [INFO] SureFire JUnitCore Runner .......................... SUCCESS [02:20 min]
[2021-01-08T15:25:24.420Z] [INFO] SureFire JUnit Platform Runner ..................... SUCCESS [ 11.980 s]
[2021-01-08T15:25:24.420Z] [INFO] SureFire TestNG Utils .............................. SUCCESS [  4.614 s]
[2021-01-08T15:25:24.420Z] [INFO] SureFire TestNG Runner ............................. SUCCESS [  6.868 s]
[2021-01-08T15:25:24.420Z] [INFO] ShadeFire JUnit3 Provider .......................... SUCCESS [  2.181 s]
[2021-01-08T15:25:24.420Z] [INFO] Surefire Report Parser ............................. SUCCESS [  6.845 s]
[2021-01-08T15:25:24.420Z] [INFO] Maven Surefire Plugin .............................. SUCCESS [ 10.331 s]
[2021-01-08T15:25:24.420Z] [INFO] Maven Failsafe Plugin .............................. SUCCESS [01:08 min]
[2021-01-08T15:25:24.420Z] [INFO] Maven Surefire Report Plugin ....................... SUCCESS [ 19.227 s]
[2021-01-08T15:25:24.420Z] [INFO] Maven Surefire Integration Tests ................... SUCCESS [  01:00 h]
[2021-01-08T15:25:24.420Z] [INFO] Surefire Shared Utils .............................. SUCCESS [  2.049 s]
[2021-01-08T15:25:24.420Z] [INFO] ------------------------------------------------------------------------
[2021-01-08T15:25:24.420Z] [INFO] BUILD SUCCESS
[2021-01-08T15:25:24.420Z] [INFO] ------------------------------------------------------------------------
[2021-01-08T15:25:24.420Z] [INFO] Total time: 01:08 h
[2021-01-08T15:25:24.420Z] [INFO] Finished at: 2021-01-08T07:25:33-08:00
[2021-01-08T15:25:25.129Z] [INFO] Final Memory: 57M/197M
[2021-01-08T15:25:25.129Z] [INFO] ------------------------------------------------------------------------
[Pipeline] }
[Pipeline] // withEnv
[Pipeline] }
[Pipeline] // stage
[Pipeline] fileExists
[Pipeline] zip
[2021-01-08T15:25:25.425Z] Writing zip file of C:\Users\jenkins\AppData\Local\Temp\jenkins-Maven-maven-box-maven-surefire-master-47\maven-failsafe-plugin\target\it to C:\Users\jenkins\AppData\Local\Temp\jenkins-Maven-maven-box-maven-surefire-master-47\maven-failsafe-plugin--windows-jdk7-maven3.2.x.zip
[2021-01-08T15:25:25.565Z] Zipped 78 entries.
[2021-01-08T15:25:25.565Z] Archiving C:\Users\jenkins\AppData\Local\Temp\jenkins-Maven-maven-box-maven-surefire-master-47\maven-failsafe-plugin--windows-jdk7-maven3.2.x.zip
[2021-01-08T15:25:25.565Z] [Fast Archiver] No artifacts from Maven » Maven TLP » maven-surefire » master #45 to compare, so performing full copy of artifacts
[Pipeline] fileExists
[Pipeline] zip
[2021-01-08T15:25:25.729Z] Writing zip file of C:\Users\jenkins\AppData\Local\Temp\jenkins-Maven-maven-box-maven-surefire-master-47\surefire-its\target to C:\Users\jenkins\AppData\Local\Temp\jenkins-Maven-maven-box-maven-surefire-master-47\surefire-its--windows-jdk7-maven3.2.x.zip
[2021-01-08T15:25:57.572Z] Zipped 17026 entries.
[2021-01-08T15:25:57.572Z] Archiving C:\Users\jenkins\AppData\Local\Temp\jenkins-Maven-maven-box-maven-surefire-master-47\surefire-its--windows-jdk7-maven3.2.x.zip
[2021-01-08T15:25:57.573Z] [Fast Archiver] No artifacts from Maven » Maven TLP » maven-surefire » master #45 to compare, so performing full copy of artifacts
[Pipeline] archiveArtifacts
[2021-01-08T15:26:02.486Z] Archiving artifacts
[2021-01-08T15:26:02.521Z] [Fast Archiver] No artifacts from Maven » Maven TLP » maven-surefire » master #45 to compare, so performing full copy of artifacts
[Pipeline] cleanWs
[2021-01-08T15:26:08.694Z] [WS-CLEANUP] Deleting project workspace...
[2021-01-08T15:26:08.694Z] [WS-CLEANUP] Deferred wipeout is used...
[2021-01-08T15:26:08.842Z] [WS-CLEANUP] done
[Pipeline] }
[Pipeline] // ws
[Pipeline] }
[Pipeline] // timestamps
[Pipeline] }
[Pipeline] // node
[Pipeline] }
[Pipeline] // parallel
[Pipeline] echo
hudson.AbortException: hudson.AbortException: script returned exit code 1
[Pipeline] echo
Build result: FAILURE
[Pipeline] jiraIssueSelector
[Pipeline] echo
The authors of changes [slachiewicz, tibordigana].
[Pipeline] echo
Sending email ...
[Pipeline] emailext