Build failed in Jenkins: Maven » Maven TLP » maven-surefire » master #40

Previous Topic Next Topic
 
classic Classic list List threaded Threaded
1 message Options
Reply | Threaded
Open this post in threaded view
|

Build failed in Jenkins: Maven » Maven TLP » maven-surefire » master #40

Apache Jenkins Server-2
See https://ci-builds.apache.org/job/Maven/job/maven-box/job/maven-surefire/job/master/40/

Changes:

* SUREFIRE-1584: Update example documentation

All tests passed

Build log:
[...truncated 54616 lines...]
[2020-11-11T14:58:22.782Z] [INFO] Running org.apache.maven.surefire.its.jiras.Surefire621TestCountingJunit3InParallelIT
[2020-11-11T14:58:56.168Z] [INFO] Tests run: 5, Failures: 0, Errors: 0, Skipped: 0, Time elapsed: 29.163 s - in org.apache.maven.surefire.its.jiras.Surefire621TestCountingJunit3InParallelIT
[2020-11-11T14:58:56.168Z] [INFO] Running org.apache.maven.surefire.its.jiras.Surefire628ConsoleOutputBeforeAndAfterClassIT
[2020-11-11T14:58:56.499Z] [INFO] Tests run: 1, Failures: 0, Errors: 0, Skipped: 0, Time elapsed: 5.303 s - in org.apache.maven.surefire.its.jiras.Surefire628ConsoleOutputBeforeAndAfterClassIT
[2020-11-11T14:58:56.499Z] [INFO] Running org.apache.maven.surefire.its.jiras.Surefire634UnsettableSystemPropertiesWarningIT
[2020-11-11T14:59:02.425Z] [INFO] Tests run: 1, Failures: 0, Errors: 0, Skipped: 0, Time elapsed: 5.106 s - in org.apache.maven.surefire.its.jiras.Surefire634UnsettableSystemPropertiesWarningIT
[2020-11-11T14:59:02.425Z] [INFO] Running org.apache.maven.surefire.its.jiras.Surefire649EmptyStringSystemPropertiesIT
[2020-11-11T14:59:11.327Z] [INFO] Tests run: 2, Failures: 0, Errors: 0, Skipped: 0, Time elapsed: 8.736 s - in org.apache.maven.surefire.its.jiras.Surefire649EmptyStringSystemPropertiesIT
[2020-11-11T14:59:11.327Z] [INFO] Running org.apache.maven.surefire.its.jiras.Surefire673MockitoIT
[2020-11-11T14:59:16.088Z] [INFO] Tests run: 1, Failures: 0, Errors: 0, Skipped: 0, Time elapsed: 5.708 s - in org.apache.maven.surefire.its.jiras.Surefire673MockitoIT
[2020-11-11T14:59:16.088Z] [INFO] Running org.apache.maven.surefire.its.jiras.Surefire674BuildFailingWhenErrorsIT
[2020-11-11T14:59:20.851Z] [INFO] Tests run: 1, Failures: 0, Errors: 0, Skipped: 0, Time elapsed: 5.044 s - in org.apache.maven.surefire.its.jiras.Surefire674BuildFailingWhenErrorsIT
[2020-11-11T14:59:20.851Z] [INFO] Running org.apache.maven.surefire.its.jiras.Surefire674BuildFailingWhenFailsafeErrorsIT
[2020-11-11T14:59:28.131Z] [INFO] Tests run: 1, Failures: 0, Errors: 0, Skipped: 0, Time elapsed: 6.07 s - in org.apache.maven.surefire.its.jiras.Surefire674BuildFailingWhenFailsafeErrorsIT
[2020-11-11T14:59:28.131Z] [INFO] Running org.apache.maven.surefire.its.jiras.Surefire685CommaSeparatedIncludesIT
[2020-11-11T14:59:32.902Z] [INFO] Tests run: 1, Failures: 0, Errors: 0, Skipped: 0, Time elapsed: 5.206 s - in org.apache.maven.surefire.its.jiras.Surefire685CommaSeparatedIncludesIT
[2020-11-11T14:59:32.902Z] [INFO] Running org.apache.maven.surefire.its.jiras.Surefire697NiceSummaryIT
[2020-11-11T14:59:37.662Z] [INFO] Tests run: 1, Failures: 0, Errors: 0, Skipped: 0, Time elapsed: 4.995 s - in org.apache.maven.surefire.its.jiras.Surefire697NiceSummaryIT
[2020-11-11T14:59:37.662Z] [INFO] Running org.apache.maven.surefire.its.jiras.Surefire705ParallelForkTimeoutIT
[2020-11-11T14:59:46.566Z] [INFO] Tests run: 1, Failures: 0, Errors: 0, Skipped: 0, Time elapsed: 8.288 s - in org.apache.maven.surefire.its.jiras.Surefire705ParallelForkTimeoutIT
[2020-11-11T14:59:46.566Z] [INFO] Running org.apache.maven.surefire.its.jiras.Surefire733AllOverrridesCapturedIT
[2020-11-11T14:59:50.352Z] [INFO] Tests run: 1, Failures: 0, Errors: 0, Skipped: 0, Time elapsed: 4.884 s - in org.apache.maven.surefire.its.jiras.Surefire733AllOverrridesCapturedIT
[2020-11-11T14:59:50.352Z] [INFO] Running org.apache.maven.surefire.its.jiras.Surefire735ForkFailWithRedirectConsoleOutputIT
[2020-11-11T14:59:59.252Z] [INFO] Tests run: 2, Failures: 0, Errors: 0, Skipped: 0, Time elapsed: 8.131 s - in org.apache.maven.surefire.its.jiras.Surefire735ForkFailWithRedirectConsoleOutputIT
[2020-11-11T14:59:59.252Z] [INFO] Running org.apache.maven.surefire.its.jiras.Surefire740TruncatedCommaIT
[2020-11-11T15:00:03.038Z] [INFO] Tests run: 1, Failures: 0, Errors: 0, Skipped: 0, Time elapsed: 4.339 s - in org.apache.maven.surefire.its.jiras.Surefire740TruncatedCommaIT
[2020-11-11T15:00:03.038Z] [INFO] Running org.apache.maven.surefire.its.jiras.Surefire747MethodParallelWithSuiteCountIT
[2020-11-11T15:00:26.115Z] [INFO] Tests run: 2, Failures: 0, Errors: 0, Skipped: 0, Time elapsed: 21.693 s - in org.apache.maven.surefire.its.jiras.Surefire747MethodParallelWithSuiteCountIT
[2020-11-11T15:00:26.115Z] [INFO] Running org.apache.maven.surefire.its.jiras.Surefire772BothReportsIT
[2020-11-11T15:00:35.016Z] [INFO] Tests run: 3, Failures: 0, Errors: 0, Skipped: 0, Time elapsed: 9.444 s - in org.apache.maven.surefire.its.jiras.Surefire772BothReportsIT
[2020-11-11T15:00:35.016Z] [INFO] Running org.apache.maven.surefire.its.jiras.Surefire772NoFailsafeReportsIT
[2020-11-11T15:00:48.147Z] [INFO] Tests run: 4, Failures: 0, Errors: 0, Skipped: 0, Time elapsed: 12.592 s - in org.apache.maven.surefire.its.jiras.Surefire772NoFailsafeReportsIT
[2020-11-11T15:00:48.147Z] [INFO] Running org.apache.maven.surefire.its.jiras.Surefire772NoSurefireReportsIT
[2020-11-11T15:01:01.334Z] [INFO] Tests run: 4, Failures: 0, Errors: 0, Skipped: 0, Time elapsed: 13.247 s - in org.apache.maven.surefire.its.jiras.Surefire772NoSurefireReportsIT
[2020-11-11T15:01:01.334Z] [INFO] Running org.apache.maven.surefire.its.jiras.Surefire772SpecifiedReportsIT
[2020-11-11T15:01:10.235Z] [INFO] Tests run: 3, Failures: 0, Errors: 0, Skipped: 0, Time elapsed: 9.342 s - in org.apache.maven.surefire.its.jiras.Surefire772SpecifiedReportsIT
[2020-11-11T15:01:10.235Z] [INFO] Running org.apache.maven.surefire.its.jiras.Surefire801ForkModeNoneClassLoaderIT
[2020-11-11T15:01:14.046Z] [INFO] Tests run: 1, Failures: 0, Errors: 0, Skipped: 0, Time elapsed: 4.252 s - in org.apache.maven.surefire.its.jiras.Surefire801ForkModeNoneClassLoaderIT
[2020-11-11T15:01:14.046Z] [INFO] Running org.apache.maven.surefire.its.jiras.Surefire803MultiFailsafeExecsIT
[2020-11-11T15:01:33.200Z] [INFO] Tests run: 2, Failures: 0, Errors: 0, Skipped: 0, Time elapsed: 16.601 s - in org.apache.maven.surefire.its.jiras.Surefire803MultiFailsafeExecsIT
[2020-11-11T15:01:33.200Z] [INFO] Running org.apache.maven.surefire.its.jiras.Surefire806SpecifiedTestControlsIT
[2020-11-11T15:01:34.866Z] [WARNING] Tests run: 3, Failures: 0, Errors: 0, Skipped: 2, Time elapsed: 4.606 s - in org.apache.maven.surefire.its.jiras.Surefire806SpecifiedTestControlsIT
[2020-11-11T15:01:34.866Z] [INFO] Running org.apache.maven.surefire.its.jiras.Surefire809GroupExpressionsIT
[2020-11-11T15:02:08.229Z] [INFO] Tests run: 6, Failures: 0, Errors: 0, Skipped: 0, Time elapsed: 31.233 s - in org.apache.maven.surefire.its.jiras.Surefire809GroupExpressionsIT
[2020-11-11T15:02:08.229Z] [INFO] Running org.apache.maven.surefire.its.jiras.Surefire812Log4JClassLoaderIT
[2020-11-11T15:02:11.199Z] [INFO] Tests run: 1, Failures: 0, Errors: 0, Skipped: 0, Time elapsed: 4.882 s - in org.apache.maven.surefire.its.jiras.Surefire812Log4JClassLoaderIT
[2020-11-11T15:02:11.199Z] [INFO] Running org.apache.maven.surefire.its.jiras.Surefire817SystemExitIT
[2020-11-11T15:02:17.114Z] [INFO] Tests run: 1, Failures: 0, Errors: 0, Skipped: 0, Time elapsed: 6.049 s - in org.apache.maven.surefire.its.jiras.Surefire817SystemExitIT
[2020-11-11T15:02:17.114Z] [INFO] Running org.apache.maven.surefire.its.jiras.Surefire818NpeIgnoresTestsIT
[2020-11-11T15:02:24.396Z] [INFO] Tests run: 1, Failures: 0, Errors: 0, Skipped: 0, Time elapsed: 6.529 s - in org.apache.maven.surefire.its.jiras.Surefire818NpeIgnoresTestsIT
[2020-11-11T15:02:24.396Z] [INFO] Running org.apache.maven.surefire.its.jiras.Surefire828EmptyGroupExprIT
[2020-11-11T15:02:47.474Z] [INFO] Tests run: 4, Failures: 0, Errors: 0, Skipped: 0, Time elapsed: 20.526 s - in org.apache.maven.surefire.its.jiras.Surefire828EmptyGroupExprIT
[2020-11-11T15:02:47.474Z] [INFO] Running org.apache.maven.surefire.its.jiras.Surefire832ProviderSelectionIT
[2020-11-11T15:02:49.136Z] [INFO] Tests run: 1, Failures: 0, Errors: 0, Skipped: 0, Time elapsed: 4.99 s - in org.apache.maven.surefire.its.jiras.Surefire832ProviderSelectionIT
[2020-11-11T15:02:49.136Z] [INFO] Running org.apache.maven.surefire.its.jiras.Surefire839TestWithoutCategoriesIT
[2020-11-11T15:03:02.268Z] [INFO] Tests run: 2, Failures: 0, Errors: 0, Skipped: 0, Time elapsed: 11.958 s - in org.apache.maven.surefire.its.jiras.Surefire839TestWithoutCategoriesIT
[2020-11-11T15:03:02.268Z] [INFO] Running org.apache.maven.surefire.its.jiras.Surefire847AdditionalFailureIT
[2020-11-11T15:03:07.084Z] [INFO] Tests run: 1, Failures: 0, Errors: 0, Skipped: 0, Time elapsed: 5.888 s - in org.apache.maven.surefire.its.jiras.Surefire847AdditionalFailureIT
[2020-11-11T15:03:07.084Z] [INFO] Running org.apache.maven.surefire.its.jiras.Surefire855AllowFailsafeUseArtifactFileIT
[2020-11-11T15:04:04.897Z] [INFO] Tests run: 4, Failures: 0, Errors: 0, Skipped: 0, Time elapsed: 50.149 s - in org.apache.maven.surefire.its.jiras.Surefire855AllowFailsafeUseArtifactFileIT
[2020-11-11T15:04:04.897Z] [INFO] Running org.apache.maven.surefire.its.jiras.Surefire901MIssingResultfileWhenNoTestsIT
[2020-11-11T15:04:04.897Z] [INFO] Tests run: 1, Failures: 0, Errors: 0, Skipped: 0, Time elapsed: 4.513 s - in org.apache.maven.surefire.its.jiras.Surefire901MIssingResultfileWhenNoTestsIT
[2020-11-11T15:04:04.897Z] [INFO] Running org.apache.maven.surefire.its.jiras.Surefire907PerThreadWithoutThreadCountIT
[2020-11-11T15:04:05.228Z] [INFO] Tests run: 1, Failures: 0, Errors: 0, Skipped: 0, Time elapsed: 3.799 s - in org.apache.maven.surefire.its.jiras.Surefire907PerThreadWithoutThreadCountIT
[2020-11-11T15:04:05.228Z] [INFO] Running org.apache.maven.surefire.its.jiras.Surefire920TestFailureIgnoreWithTimeoutIT
[2020-11-11T15:04:18.386Z] [INFO] Tests run: 2, Failures: 0, Errors: 0, Skipped: 0, Time elapsed: 13.042 s - in org.apache.maven.surefire.its.jiras.Surefire920TestFailureIgnoreWithTimeoutIT
[2020-11-11T15:04:18.386Z] [INFO] Running org.apache.maven.surefire.its.jiras.Surefire926FailureWith2ProvidersIT
[2020-11-11T15:04:24.305Z] [INFO] Tests run: 1, Failures: 0, Errors: 0, Skipped: 0, Time elapsed: 5.986 s - in org.apache.maven.surefire.its.jiras.Surefire926FailureWith2ProvidersIT
[2020-11-11T15:04:24.305Z] [INFO] Running org.apache.maven.surefire.its.jiras.Surefire930TestNgSuiteXmlIT
[2020-11-11T15:04:30.217Z] [INFO] Tests run: 1, Failures: 0, Errors: 0, Skipped: 0, Time elapsed: 5.469 s - in org.apache.maven.surefire.its.jiras.Surefire930TestNgSuiteXmlIT
[2020-11-11T15:04:30.217Z] [INFO] Running org.apache.maven.surefire.its.jiras.Surefire943ReportContentIT
[2020-11-11T15:04:57.999Z] [INFO] Tests run: 2, Failures: 0, Errors: 0, Skipped: 0, Time elapsed: 26.783 s - in org.apache.maven.surefire.its.jiras.Surefire943ReportContentIT
[2020-11-11T15:04:57.999Z] [INFO] Running org.apache.maven.surefire.its.jiras.Surefire946KillMainProcessInReusableForkIT
[2020-11-11T15:06:07.293Z] [INFO] Tests run: 6, Failures: 0, Errors: 0, Skipped: 0, Time elapsed: 61.016 s - in org.apache.maven.surefire.its.jiras.Surefire946KillMainProcessInReusableForkIT
[2020-11-11T15:06:07.293Z] [INFO] Running org.apache.maven.surefire.its.jiras.Surefire972BizarreNoClassDefIT
[2020-11-11T15:06:07.293Z] [INFO] Tests run: 1, Failures: 0, Errors: 0, Skipped: 0, Time elapsed: 8.698 s - in org.apache.maven.surefire.its.jiras.Surefire972BizarreNoClassDefIT
[2020-11-11T15:06:07.293Z] [INFO] Running org.apache.maven.surefire.its.jiras.Surefire975DefaultVMEncodingIT
[2020-11-11T15:06:12.089Z] [INFO] Tests run: 1, Failures: 0, Errors: 0, Skipped: 0, Time elapsed: 5.356 s - in org.apache.maven.surefire.its.jiras.Surefire975DefaultVMEncodingIT
[2020-11-11T15:06:12.089Z] [INFO] Running org.apache.maven.surefire.its.jiras.Surefire979WrongClassLoaderIT
[2020-11-11T15:06:16.849Z] [INFO] Tests run: 1, Failures: 0, Errors: 0, Skipped: 0, Time elapsed: 5.023 s - in org.apache.maven.surefire.its.jiras.Surefire979WrongClassLoaderIT
[2020-11-11T15:06:16.849Z] [INFO] Running org.apache.maven.surefire.its.jiras.Surefire985ParameterizedRunnerAndCategoriesIT
[2020-11-11T15:06:21.607Z] [INFO] Tests run: 1, Failures: 0, Errors: 0, Skipped: 0, Time elapsed: 4.634 s - in org.apache.maven.surefire.its.jiras.Surefire985ParameterizedRunnerAndCategoriesIT
[2020-11-11T15:06:21.607Z] [INFO] Running org.apache.maven.surefire.its.jiras.Surefire995CategoryInheritanceIT
[2020-11-11T15:07:01.677Z] [INFO] Tests run: 7, Failures: 0, Errors: 0, Skipped: 0, Time elapsed: 35.443 s - in org.apache.maven.surefire.its.jiras.Surefire995CategoryInheritanceIT
[2020-11-11T15:07:01.677Z] [INFO]
[2020-11-11T15:07:01.677Z] [INFO] Results:
[2020-11-11T15:07:01.677Z] [INFO]
[2020-11-11T15:07:01.677Z] [WARNING] Tests run: 959, Failures: 0, Errors: 0, Skipped: 296
[2020-11-11T15:07:01.677Z] [INFO]
[2020-11-11T15:07:01.677Z] [INFO]
[2020-11-11T15:07:01.677Z] [INFO] --- maven-checkstyle-plugin:3.0.0:check (checkstyle-check) @ surefire-its ---
[2020-11-11T15:07:01.677Z] [INFO]
[2020-11-11T15:07:01.677Z] [INFO] --- maven-failsafe-plugin:3.0.0-M4:verify (default) @ surefire-its ---
[2020-11-11T15:07:01.677Z] [INFO] Failsafe report directory: C:\Users\jenkins\AppData\Local\Temp\jenkins-Maven-maven-box-maven-surefire-master-40\surefire-its\target\failsafe-reports
[2020-11-11T15:07:01.677Z] [INFO]
[2020-11-11T15:07:01.677Z] [INFO] --- maven-install-plugin:2.5.2:install (default-install) @ surefire-its ---
[2020-11-11T15:07:01.677Z] [INFO] Skipping artifact installation
[2020-11-11T15:07:01.677Z] [INFO]                                                                        
[2020-11-11T15:07:01.677Z] [INFO] ------------------------------------------------------------------------
[2020-11-11T15:07:01.677Z] [INFO] Building Surefire Shared Utils 3.0.0-M6-SNAPSHOT
[2020-11-11T15:07:01.677Z] [INFO] ------------------------------------------------------------------------
[2020-11-11T15:07:01.677Z] [INFO]
[2020-11-11T15:07:01.677Z] [INFO] --- maven-clean-plugin:3.1.0:clean (default-clean) @ surefire-shared-utils ---
[2020-11-11T15:07:01.677Z] [INFO]
[2020-11-11T15:07:01.677Z] [INFO] --- maven-enforcer-plugin:3.0.0-M3:enforce (enforce-maven-version) @ surefire-shared-utils ---
[2020-11-11T15:07:01.677Z] [INFO]
[2020-11-11T15:07:01.677Z] [INFO] --- maven-enforcer-plugin:3.0.0-M3:enforce (enforce-bytecode-version) @ surefire-shared-utils ---
[2020-11-11T15:07:01.677Z] [INFO] Adding ignore: module-info
[2020-11-11T15:07:01.677Z] [INFO]
[2020-11-11T15:07:01.677Z] [INFO] --- maven-enforcer-plugin:3.0.0-M3:enforce (enforce-java) @ surefire-shared-utils ---
[2020-11-11T15:07:01.677Z] [INFO]
[2020-11-11T15:07:01.677Z] [INFO] --- maven-enforcer-plugin:3.0.0-M3:enforce (enforce-maven) @ surefire-shared-utils ---
[2020-11-11T15:07:01.677Z] [INFO]
[2020-11-11T15:07:01.677Z] [INFO] --- apache-rat-plugin:0.13:check (rat-check) @ surefire-shared-utils ---
[2020-11-11T15:07:01.677Z] [INFO] Enabled default license matchers.
[2020-11-11T15:07:01.677Z] [INFO] Will parse SCM ignores for exclusions...
[2020-11-11T15:07:01.677Z] [INFO] Finished adding exclusions from SCM ignore files.
[2020-11-11T15:07:01.677Z] [INFO] 62 implicit excludes (use -debug for more details).
[2020-11-11T15:07:01.677Z] [INFO] 27 explicit excludes (use -debug for more details).
[2020-11-11T15:07:01.677Z] [INFO] 1 resources included (use -debug for more details)
[2020-11-11T15:07:01.677Z] [INFO] Rat check: Summary over all files. Unapproved: 0, unknown: 0, generated: 0, approved: 1 licenses.
[2020-11-11T15:07:01.677Z] [INFO]
[2020-11-11T15:07:01.677Z] [INFO] --- maven-compiler-plugin:3.8.1:compile (compile-generated) @ surefire-shared-utils ---
[2020-11-11T15:07:01.677Z] [INFO] No sources to compile
[2020-11-11T15:07:01.677Z] [INFO]
[2020-11-11T15:07:01.677Z] [INFO] --- maven-remote-resources-plugin:1.7.0:process (process-resource-bundles) @ surefire-shared-utils ---
[2020-11-11T15:07:01.677Z] [INFO] Preparing remote bundle org.apache:apache-jar-resource-bundle:1.4
[2020-11-11T15:07:01.677Z] [INFO] Copying 3 resources from 1 bundle.
[2020-11-11T15:07:01.677Z] [INFO]
[2020-11-11T15:07:01.677Z] [INFO] --- maven-resources-plugin:3.1.0:resources (default-resources) @ surefire-shared-utils ---
[2020-11-11T15:07:01.677Z] [INFO] Using 'UTF-8' encoding to copy filtered resources.
[2020-11-11T15:07:01.677Z] [INFO] skip non existing resourceDirectory C:\Users\jenkins\AppData\Local\Temp\jenkins-Maven-maven-box-maven-surefire-master-40\surefire-shared-utils\src\main\resources
[2020-11-11T15:07:01.677Z] [INFO] Copying 3 resources
[2020-11-11T15:07:01.677Z] [INFO]
[2020-11-11T15:07:01.677Z] [INFO] --- maven-compiler-plugin:3.8.1:compile (default-compile) @ surefire-shared-utils ---
[2020-11-11T15:07:01.677Z] [INFO] No sources to compile
[2020-11-11T15:07:01.677Z] [INFO]
[2020-11-11T15:07:01.677Z] [INFO] --- animal-sniffer-maven-plugin:1.17:check (signature-check) @ surefire-shared-utils ---
[2020-11-11T15:07:01.677Z] [INFO] Checking unresolved references to org.codehaus.mojo.signature:java17:1.0
[2020-11-11T15:07:01.677Z] [INFO]
[2020-11-11T15:07:01.677Z] [INFO] --- maven-resources-plugin:3.1.0:testResources (default-testResources) @ surefire-shared-utils ---
[2020-11-11T15:07:01.677Z] [INFO] Using 'UTF-8' encoding to copy filtered resources.
[2020-11-11T15:07:01.677Z] [INFO] skip non existing resourceDirectory C:\Users\jenkins\AppData\Local\Temp\jenkins-Maven-maven-box-maven-surefire-master-40\surefire-shared-utils\src\test\resources
[2020-11-11T15:07:01.677Z] [INFO] Copying 3 resources
[2020-11-11T15:07:01.677Z] [INFO]
[2020-11-11T15:07:01.677Z] [INFO] --- maven-compiler-plugin:3.8.1:testCompile (default-testCompile) @ surefire-shared-utils ---
[2020-11-11T15:07:01.677Z] [INFO] No sources to compile
[2020-11-11T15:07:01.677Z] [INFO]
[2020-11-11T15:07:01.677Z] [INFO] --- maven-surefire-plugin:3.0.0-M4:test (default-test) @ surefire-shared-utils ---
[2020-11-11T15:07:01.677Z] [INFO]
[2020-11-11T15:07:01.677Z] [INFO] --- maven-jar-plugin:3.2.0:jar (default-jar) @ surefire-shared-utils ---
[2020-11-11T15:07:01.677Z] [INFO] Building jar: C:\Users\jenkins\AppData\Local\Temp\jenkins-Maven-maven-box-maven-surefire-master-40\surefire-shared-utils\target\surefire-shared-utils-3.0.0-M6-SNAPSHOT.jar
[2020-11-11T15:07:01.677Z] [INFO]
[2020-11-11T15:07:01.677Z] [INFO] --- maven-site-plugin:3.8.2:attach-descriptor (attach-descriptor) @ surefire-shared-utils ---
[2020-11-11T15:07:01.677Z] [INFO] Skipping because packaging 'jar' is not pom.
[2020-11-11T15:07:01.677Z] [INFO]
[2020-11-11T15:07:01.677Z] [INFO] --- maven-shade-plugin:3.2.3:shade (default) @ surefire-shared-utils ---
[2020-11-11T15:07:01.677Z] [INFO] Including org.apache.maven.shared:maven-shared-utils:jar:3.1.0 in the shaded jar.
[2020-11-11T15:07:01.677Z] [INFO] Including commons-io:commons-io:jar:2.6 in the shaded jar.
[2020-11-11T15:07:01.677Z] [INFO] Including org.apache.commons:commons-lang3:jar:3.8.1 in the shaded jar.
[2020-11-11T15:07:01.677Z] [INFO] Including org.apache.commons:commons-compress:jar:1.20 in the shaded jar.
[2020-11-11T15:07:01.677Z] [INFO] Including commons-codec:commons-codec:jar:1.11 in the shaded jar.
[2020-11-11T15:07:01.677Z] [WARNING] maven-shared-utils-3.1.0.jar, surefire-shared-utils-3.0.0-M6-SNAPSHOT.jar define 3 overlapping resources:
[2020-11-11T15:07:01.677Z] [WARNING]   - META-INF/DEPENDENCIES
[2020-11-11T15:07:01.677Z] [WARNING]   - META-INF/LICENSE
[2020-11-11T15:07:01.677Z] [WARNING]   - META-INF/NOTICE
[2020-11-11T15:07:01.677Z] [WARNING] commons-codec-1.11.jar, commons-compress-1.20.jar, commons-io-2.6.jar, commons-lang3-3.8.1.jar define 2 overlapping resources:
[2020-11-11T15:07:01.677Z] [WARNING]   - META-INF/LICENSE.txt
[2020-11-11T15:07:01.677Z] [WARNING]   - META-INF/NOTICE.txt
[2020-11-11T15:07:01.677Z] [WARNING] commons-codec-1.11.jar, commons-compress-1.20.jar, commons-io-2.6.jar, commons-lang3-3.8.1.jar, maven-shared-utils-3.1.0.jar, surefire-shared-utils-3.0.0-M6-SNAPSHOT.jar define 1 overlapping resources:
[2020-11-11T15:07:01.677Z] [WARNING]   - META-INF/MANIFEST.MF
[2020-11-11T15:07:01.677Z] [WARNING] maven-shade-plugin has detected that some class files are
[2020-11-11T15:07:01.677Z] [WARNING] present in two or more JARs. When this happens, only one
[2020-11-11T15:07:01.677Z] [WARNING] single version of the class is copied to the uber jar.
[2020-11-11T15:07:01.677Z] [WARNING] Usually this is not harmful and you can skip these warnings,
[2020-11-11T15:07:01.677Z] [WARNING] otherwise try to manually exclude artifacts based on
[2020-11-11T15:07:01.677Z] [WARNING] mvn dependency:tree -Ddetail=true and the above output.
[2020-11-11T15:07:01.677Z] [WARNING] See http://maven.apache.org/plugins/maven-shade-plugin/
[2020-11-11T15:07:01.677Z] [INFO] Replacing original artifact with shaded artifact.
[2020-11-11T15:07:01.677Z] [INFO] Replacing C:\Users\jenkins\AppData\Local\Temp\jenkins-Maven-maven-box-maven-surefire-master-40\surefire-shared-utils\target\surefire-shared-utils-3.0.0-M6-SNAPSHOT.jar with C:\Users\jenkins\AppData\Local\Temp\jenkins-Maven-maven-box-maven-surefire-master-40\surefire-shared-utils\target\surefire-shared-utils-3.0.0-M6-SNAPSHOT-shaded.jar
[2020-11-11T15:07:01.677Z] [INFO] Dependency-reduced POM written at: C:\Users\jenkins\AppData\Local\Temp\jenkins-Maven-maven-box-maven-surefire-master-40\surefire-shared-utils\dependency-reduced-pom.xml
[2020-11-11T15:07:01.677Z] [INFO]
[2020-11-11T15:07:01.677Z] [INFO] --- maven-checkstyle-plugin:3.0.0:check (checkstyle-check) @ surefire-shared-utils ---
[2020-11-11T15:07:01.677Z] [INFO]
[2020-11-11T15:07:01.677Z] [INFO] --- maven-install-plugin:2.5.2:install (default-install) @ surefire-shared-utils ---
[2020-11-11T15:07:01.677Z] [INFO] Installing C:\Users\jenkins\AppData\Local\Temp\jenkins-Maven-maven-box-maven-surefire-master-40\surefire-shared-utils\target\surefire-shared-utils-3.0.0-M6-SNAPSHOT.jar to C:\Users\jenkins\AppData\Local\Temp\jenkins-Maven-maven-box-maven-surefire-master-40\.m2\org\apache\maven\surefire\surefire-shared-utils\3.0.0-M6-SNAPSHOT\surefire-shared-utils-3.0.0-M6-SNAPSHOT.jar
[2020-11-11T15:07:01.677Z] [INFO] Installing C:\Users\jenkins\AppData\Local\Temp\jenkins-Maven-maven-box-maven-surefire-master-40\surefire-shared-utils\dependency-reduced-pom.xml to C:\Users\jenkins\AppData\Local\Temp\jenkins-Maven-maven-box-maven-surefire-master-40\.m2\org\apache\maven\surefire\surefire-shared-utils\3.0.0-M6-SNAPSHOT\surefire-shared-utils-3.0.0-M6-SNAPSHOT.pom
[2020-11-11T15:07:01.677Z] [INFO] ------------------------------------------------------------------------
[2020-11-11T15:07:01.677Z] [INFO] Reactor Summary:
[2020-11-11T15:07:01.677Z] [INFO]
[2020-11-11T15:07:01.677Z] [INFO] Apache Maven Surefire .............................. SUCCESS [ 51.318 s]
[2020-11-11T15:07:01.677Z] [INFO] SureFire Logger API ................................ SUCCESS [ 18.262 s]
[2020-11-11T15:07:01.677Z] [INFO] SureFire API ....................................... SUCCESS [ 25.118 s]
[2020-11-11T15:07:01.677Z] [INFO] Surefire Extensions API ............................ SUCCESS [  9.312 s]
[2020-11-11T15:07:01.677Z] [INFO] Surefire Extensions SPI ............................ SUCCESS [  2.076 s]
[2020-11-11T15:07:01.678Z] [INFO] SureFire Booter .................................... SUCCESS [ 24.217 s]
[2020-11-11T15:07:01.678Z] [INFO] Maven Surefire Test-Grouping Support ............... SUCCESS [  8.145 s]
[2020-11-11T15:07:01.678Z] [INFO] SureFire Providers ................................. SUCCESS [  0.953 s]
[2020-11-11T15:07:01.678Z] [INFO] Shared JUnit3 Provider Code ........................ SUCCESS [  4.244 s]
[2020-11-11T15:07:01.678Z] [INFO] Shared Java 5 Provider Base ........................ SUCCESS [  5.468 s]
[2020-11-11T15:07:01.678Z] [INFO] Shared JUnit4 Provider Code ........................ SUCCESS [  5.565 s]
[2020-11-11T15:07:01.678Z] [INFO] Shared JUnit48 Provider Code ....................... SUCCESS [  9.962 s]
[2020-11-11T15:07:01.678Z] [INFO] SureFire JUnit Runner .............................. SUCCESS [  4.795 s]
[2020-11-11T15:07:01.678Z] [INFO] SureFire JUnit4 Runner ............................. SUCCESS [  4.741 s]
[2020-11-11T15:07:01.678Z] [INFO] Maven Surefire Common .............................. SUCCESS [01:15 min]
[2020-11-11T15:07:01.678Z] [INFO] SureFire JUnitCore Runner .......................... SUCCESS [02:21 min]
[2020-11-11T15:07:01.678Z] [INFO] SureFire JUnit Platform Runner ..................... SUCCESS [ 12.404 s]
[2020-11-11T15:07:01.678Z] [INFO] SureFire TestNG Utils .............................. SUCCESS [  5.036 s]
[2020-11-11T15:07:01.678Z] [INFO] SureFire TestNG Runner ............................. SUCCESS [  7.190 s]
[2020-11-11T15:07:01.678Z] [INFO] ShadeFire JUnit3 Provider .......................... SUCCESS [  2.226 s]
[2020-11-11T15:07:01.678Z] [INFO] Surefire Report Parser ............................. SUCCESS [  7.275 s]
[2020-11-11T15:07:01.678Z] [INFO] Maven Surefire Plugin .............................. SUCCESS [ 10.761 s]
[2020-11-11T15:07:01.678Z] [INFO] Maven Failsafe Plugin .............................. SUCCESS [01:18 min]
[2020-11-11T15:07:01.678Z] [INFO] Maven Surefire Report Plugin ....................... SUCCESS [ 20.395 s]
[2020-11-11T15:07:01.678Z] [INFO] Maven Surefire Integration Tests ................... SUCCESS [  01:03 h]
[2020-11-11T15:07:01.678Z] [INFO] Surefire Shared Utils .............................. SUCCESS [  2.074 s]
[2020-11-11T15:07:01.678Z] [INFO] ------------------------------------------------------------------------
[2020-11-11T15:07:01.678Z] [INFO] BUILD SUCCESS
[2020-11-11T15:07:01.678Z] [INFO] ------------------------------------------------------------------------
[2020-11-11T15:07:01.678Z] [INFO] Total time: 01:12 h
[2020-11-11T15:07:01.678Z] [INFO] Finished at: 2020-11-11T07:07:00-08:00
[2020-11-11T15:07:01.678Z] [INFO] Final Memory: 57M/213M
[2020-11-11T15:07:01.678Z] [INFO] ------------------------------------------------------------------------
[Pipeline] }
[Pipeline] // withEnv
[Pipeline] }
[Pipeline] // stage
[Pipeline] cleanWs
[2020-11-11T15:07:02.135Z] [WS-CLEANUP] Deleting project workspace...
[2020-11-11T15:07:02.135Z] [WS-CLEANUP] Deferred wipeout is used...
[2020-11-11T15:07:02.289Z] [WS-CLEANUP] done
[Pipeline] }
[Pipeline] // ws
[Pipeline] }
[Pipeline] // timestamps
[Pipeline] }
[Pipeline] // node
[Pipeline] }
[Pipeline] // parallel
[Pipeline] echo
hudson.AbortException: hudson.AbortException: script returned exit code 1
[Pipeline] echo
Build result: FAILURE
[Pipeline] jiraIssueSelector
[Pipeline] echo
The authors of changes [tibordigana].
[Pipeline] echo
Sending email ...
[Pipeline] emailext