Build failed in Jenkins: Maven » Maven TLP » maven-source-plugin » stabilize #2

Previous Topic Next Topic
 
classic Classic list List threaded Threaded
3 messages Options
Reply | Threaded
Open this post in threaded view
|

Build failed in Jenkins: Maven » Maven TLP » maven-source-plugin » stabilize #2

Apache Jenkins Server-2
See https://ci-builds.apache.org/job/Maven/job/maven-box/job/maven-source-plugin/job/stabilize/2/

Changes:

* Call initialize phase, will trigger ant:sleep on unix+JDK8

All tests passed

Build log:
[...truncated 41511 lines...]
[INFO]           jar-without-descriptor-config\pom.xml ............ SUCCESS (3.3 s)
[INFO] Building: manifest-content\pom.xml
[INFO] run post-build script verify.bsh
[INFO]           jar-without-descriptor-config\pom.xml ............ SUCCESS (3.1 s)
[INFO] Building: manifest-content\pom.xml
[withMaven] openTasksPublisher - Scan Tasks for Maven artifact org.apache.maven.plugins:maven-source-plugin:maven-plugin:3.2.2-SNAPSHOT in source directory windows-jdk7-m3.6.x_build\src\main\java
[withMaven] openTasksPublisher - Scan Tasks for Maven artifact org.apache.maven.plugins:maven-source-plugin:maven-plugin:3.2.2-SNAPSHOT in source directory windows-jdk7-m3.5.x_build\src\main\java
[withMaven] Publishers: Generated Artifacts Publisher: 1040 ms, Junit Publisher: 1232 ms, Open Task Scanner Publisher: 358 ms, Invoker Publisher: 36618 ms
[TASKS] Scanning folder 'f:\jenkins\jenkins-slave\712657a4\workspace\ox_maven-source-plugin_stabilize@2' for files matching the pattern 'windows-jdk7-m3.5.x_build\src\main\java\**\*' - excludes: null
[TASKS] Found 7 files to scan for tasks
[TASKS] Found 0 open tasks.
Skipping warnings blame since pipelines do not have an SCM link.%n
[TASKS] Scanning folder 'f:\jenkins\jenkins-slave\712657a4\workspace\ox_maven-source-plugin_stabilize@3@2' for files matching the pattern 'windows-jdk7-m3.6.x_build\src\main\java\**\*' - excludes: null
[TASKS] Found 7 files to scan for tasks
[TASKS] Found 0 open tasks.
Skipping warnings blame since pipelines do not have an SCM link.%n
[withMaven] invokerPublisher - Archive invoker results for Maven artifact MavenArtifact{org.apache.maven.plugins:maven-source-plugin:maven-plugin:3.2.2-SNAPSHOT(version: 3.2.2-SNAPSHOT, snapshot:false) } generated by PluginInvocation{org.apache.maven.plugins:maven-invoker-plugin:3.2.1@integration-test  integration-test}: windows-jdk7-m3.5.x_build\target\invoker-reports\*.xml
[withMaven] invokerPublisher - Archive invoker results for Maven artifact MavenArtifact{org.apache.maven.plugins:maven-source-plugin:maven-plugin:3.2.2-SNAPSHOT(version: 3.2.2-SNAPSHOT, snapshot:false) } generated by PluginInvocation{org.apache.maven.plugins:maven-invoker-plugin:3.2.1@integration-test  integration-test}: windows-jdk7-m3.6.x_build\target\invoker-reports\*.xml
[INFO] run post-build script verify.bsh
[INFO]           manifest-content\pom.xml ......................... SUCCESS (3.2 s)
[INFO] Building: MSOURCES-62\pom.xml
[Pipeline] // withMaven
[Pipeline] cleanWs
[WS-CLEANUP] Deleting project workspace...
[WS-CLEANUP] Deferred wipeout is used...
[INFO] run post-build script verify.bsh
[INFO]           manifest-content\pom.xml ......................... SUCCESS (3.2 s)
[INFO] Building: MSOURCES-62\pom.xml
[WS-CLEANUP] done
[Pipeline] }
[Pipeline] // stage
[Pipeline] }
[Pipeline] // ws
[Pipeline] }
[Pipeline] // node
[Pipeline] }
[INFO] run post-build script verify.bsh
[INFO]           MSOURCES-62\pom.xml .............................. SUCCESS (5.0 s)
[INFO] Building: MSOURCES-64\pom.xml
[INFO] run post-build script verify.bsh
[INFO]           MSOURCES-62\pom.xml .............................. SUCCESS (4.8 s)
[INFO] Building: MSOURCES-64\pom.xml
[withMaven] Publishers: Generated Artifacts Publisher: 718 ms, Junit Publisher: 4864 ms, Open Task Scanner Publisher: 779 ms, Invoker Publisher: 7338 ms
[withMaven] Publishers: Generated Artifacts Publisher: 182 ms, Junit Publisher: 2292 ms, Open Task Scanner Publisher: 608 ms, Invoker Publisher: 7341 ms
[Pipeline] // withMaven
[Pipeline] // withMaven
[Pipeline] cleanWs
[Pipeline] cleanWs
[WS-CLEANUP] Deleting project workspace...
[WS-CLEANUP] Deferred wipeout is used...
[WS-CLEANUP] Deleting project workspace...
[WS-CLEANUP] Deferred wipeout is used...
[WS-CLEANUP] done
[Pipeline] }
[WS-CLEANUP] done
[Pipeline] // stage
[Pipeline] }
[Pipeline] }
[Pipeline] // ws
[Pipeline] // stage
[Pipeline] }
[Pipeline] }
[Pipeline] // node
[Pipeline] // ws
[Pipeline] }
[Pipeline] }
[Pipeline] // node
[Pipeline] }
[INFO] run post-build script verify.groovy
WARNING: An illegal reflective access operation has occurred
WARNING: Illegal reflective access by org.codehaus.groovy.reflection.CachedClass (file:/f:/jenkins/jenkins-slave/712657a4/workspace/.maven_repositories/1/org/codehaus/groovy/groovy-all/2.4.8/groovy-all-2.4.8.jar) to method java.lang.Object.finalize()
WARNING: Please consider reporting this to the maintainers of org.codehaus.groovy.reflection.CachedClass
WARNING: Use --illegal-access=warn to enable warnings of further illegal reflective access operations
WARNING: All illegal access operations will be denied in a future release
[INFO] run post-build script verify.groovy
WARNING: An illegal reflective access operation has occurred
WARNING: Illegal reflective access by org.codehaus.groovy.reflection.CachedClass (file:/f:/jenkins/jenkins-slave/712657a4/workspace/.maven_repositories/0/org/codehaus/groovy/groovy-all/2.4.8/groovy-all-2.4.8.jar) to method java.lang.Object.finalize()
WARNING: Please consider reporting this to the maintainers of org.codehaus.groovy.reflection.CachedClass
WARNING: Use --illegal-access=warn to enable warnings of further illegal reflective access operations
WARNING: All illegal access operations will be denied in a future release
[INFO]           MSOURCES-64\pom.xml .............................. SUCCESS (5.0 s)
[INFO] Building: MSOURCES-95\pom.xml
[INFO]           MSOURCES-64\pom.xml .............................. SUCCESS (5.0 s)
[INFO] Building: MSOURCES-95\pom.xml
[INFO] run post-build script verify.groovy
[INFO]           MSOURCES-95\pom.xml .............................. SUCCESS (6.2 s)
[INFO] Building: project-without-sources\pom.xml
[INFO] run post-build script verify.groovy
[INFO]           MSOURCES-95\pom.xml .............................. SUCCESS (6.3 s)
[INFO] Building: project-without-sources\pom.xml
[INFO] run post-build script verify.bsh
[INFO]           project-without-sources\pom.xml .................. SUCCESS (2.5 s)
[INFO] Building: reproducible\pom.xml
[INFO] run post-build script verify.bsh
[INFO]           project-without-sources\pom.xml .................. SUCCESS (2.6 s)
[INFO] Building: reproducible\pom.xml
[INFO] run post-build script verify.groovy
[INFO] run post-build script verify.groovy
[INFO]           reproducible\pom.xml ............................. SUCCESS (10.9 s)
[INFO] Building: test-jar\pom.xml
[INFO]           reproducible\pom.xml ............................. SUCCESS (11.3 s)
[INFO] Building: test-jar\pom.xml
[INFO] run post-build script verify.bsh
[INFO]           test-jar\pom.xml ................................. SUCCESS (3.5 s)
[INFO] Building: test-jar-classifier\pom.xml
[INFO] run post-build script verify.bsh
[INFO]           test-jar\pom.xml ................................. SUCCESS (3.4 s)
[INFO] Building: test-jar-classifier\pom.xml
[INFO] run post-build script verify.bsh
[INFO]           test-jar-classifier\pom.xml ...................... SUCCESS (3.5 s)
[INFO] Building: test-jar-generated\pom.xml
[INFO] run post-build script verify.bsh
[INFO]           test-jar-classifier\pom.xml ...................... SUCCESS (3.5 s)
[INFO] Building: test-jar-generated\pom.xml
[INFO] run post-build script verify.bsh
[INFO]           test-jar-generated\pom.xml ....................... SUCCESS (4.9 s)
[INFO] Building: test-jar-no-fork\pom.xml
[INFO] run post-build script verify.bsh
[INFO]           test-jar-generated\pom.xml ....................... SUCCESS (5.0 s)
[INFO] Building: test-jar-no-fork\pom.xml
[INFO] run post-build script verify.bsh
[INFO]           test-jar-no-fork\pom.xml ......................... SUCCESS (6.0 s)
[INFO] Building: verify-parameter-goal-generated-test-jar\pom.xml
[INFO] run post-build script verify.bsh
[INFO]           test-jar-no-fork\pom.xml ......................... SUCCESS (5.9 s)
[INFO] Building: verify-parameter-goal-generated-test-jar\pom.xml
[INFO] run post-build script verify.groovy
[INFO]           verify-parameter-goal-generated-test-jar\pom.xml . SUCCESS (2.6 s)
[INFO] Building: verify-parameter-goal-jar\pom.xml
[INFO] run post-build script verify.groovy
[INFO]           verify-parameter-goal-generated-test-jar\pom.xml . SUCCESS (2.6 s)
[INFO] Building: verify-parameter-goal-jar\pom.xml
[INFO] run post-build script verify.groovy
[INFO] run post-build script verify.groovy
[INFO]           verify-parameter-goal-jar\pom.xml ................ SUCCESS (3.2 s)
[INFO] Building: verify-parameter-goal-jar-no-fork\pom.xml
[INFO]           verify-parameter-goal-jar\pom.xml ................ SUCCESS (3.3 s)
[INFO] Building: verify-parameter-goal-jar-no-fork\pom.xml
[INFO] run post-build script verify.groovy
[INFO]           verify-parameter-goal-jar-no-fork\pom.xml ........ SUCCESS (3.0 s)
[INFO] Building: verify-parameter-goal-test-jar\pom.xml
[INFO] run post-build script verify.groovy
[INFO]           verify-parameter-goal-jar-no-fork\pom.xml ........ SUCCESS (3.0 s)
[INFO] Building: verify-parameter-goal-test-jar\pom.xml
[INFO] run post-build script verify.groovy
[INFO]           verify-parameter-goal-test-jar\pom.xml ........... SUCCESS (2.8 s)
[INFO] Building: verify-parameter-goal-test-jar-no-fork\pom.xml
[INFO] run post-build script verify.groovy
[INFO]           verify-parameter-goal-test-jar\pom.xml ........... SUCCESS (2.8 s)
[INFO] Building: verify-parameter-goal-test-jar-no-fork\pom.xml
[INFO] run post-build script verify.groovy
[INFO]           verify-parameter-goal-test-jar-no-fork\pom.xml ... SUCCESS (3.0 s)
[INFO]
[INFO] --- maven-checkstyle-plugin:3.0.0:check (checkstyle-check) @ maven-source-plugin ---
[INFO] run post-build script verify.groovy
[INFO]           verify-parameter-goal-test-jar-no-fork\pom.xml ... SUCCESS (3.2 s)
[INFO]
[INFO] --- maven-checkstyle-plugin:3.0.0:check (checkstyle-check) @ maven-source-plugin ---
[INFO]
[INFO] --- maven-invoker-plugin:3.2.1:verify (integration-test) @ maven-source-plugin ---
[INFO] -------------------------------------------------
[INFO] Build Summary:
[INFO]   Passed: 22, Failed: 0, Errors: 0, Skipped: 0
[INFO] -------------------------------------------------
[INFO] ------------------------------------------------------------------------
[INFO] BUILD SUCCESS
[INFO] ------------------------------------------------------------------------
[INFO] Total time:  02:14 min
[INFO] Finished at: 2020-07-31T08:10:27-07:00
[INFO] ------------------------------------------------------------------------
[INFO] [jenkins-event-spy] Generated F:\jenkins\jenkins-slave\712657a4\workspace\ox_maven-source-plugin_stabilize@3@2@tmp\withMavenec373df5\maven-spy-20200731-080812-4333273220564008893288.log
[Pipeline] }
[Pipeline] // dir
[Pipeline] }
[INFO]
[INFO] --- maven-invoker-plugin:3.2.1:verify (integration-test) @ maven-source-plugin ---
[INFO] -------------------------------------------------
[INFO] Build Summary:
[INFO]   Passed: 22, Failed: 0, Errors: 0, Skipped: 0
[INFO] -------------------------------------------------
[INFO] ------------------------------------------------------------------------
[INFO] BUILD SUCCESS
[INFO] ------------------------------------------------------------------------
[INFO] Total time:  02:14 min
[INFO] Finished at: 2020-07-31T08:10:27-07:00
[INFO] ------------------------------------------------------------------------
[INFO] [jenkins-event-spy] Generated F:\jenkins\jenkins-slave\712657a4\workspace\ox_maven-source-plugin_stabilize@2@tmp\withMaven0bc4ab7f\maven-spy-20200731-080812-58117907593803199484995.log
[Pipeline] }
[Pipeline] // dir
[Pipeline] }
[withMaven] artifactsPublisher - Archive artifact windows-jdk15-m3.6.x_build\pom.xml under org\apache\maven\plugins\maven-source-plugin\3.2.2-SNAPSHOT\maven-source-plugin-3.2.2-SNAPSHOT.pom
[withMaven] artifactsPublisher - Archive artifact windows-jdk15-m3.6.x_build\target\maven-source-plugin-3.2.2-SNAPSHOT.jar under org\apache\maven\plugins\maven-source-plugin\3.2.2-SNAPSHOT\maven-source-plugin-3.2.2-SNAPSHOT.jar
[Fast Archiver] No prior successful build to compare, so performing full copy of artifacts
[withMaven] artifactsPublisher - Archive artifact windows-jdk14-m3.6.x_build\pom.xml under org\apache\maven\plugins\maven-source-plugin\3.2.2-SNAPSHOT\maven-source-plugin-3.2.2-SNAPSHOT.pom
[withMaven] junitPublisher - Archive test results for Maven artifact org.apache.maven.plugins:maven-source-plugin:maven-plugin:3.2.2-SNAPSHOT generated by maven-surefire-plugin:test (default-test): windows-jdk15-m3.6.x_build\target\surefire-reports\*.xml
Recording test results
[withMaven] artifactsPublisher - Archive artifact windows-jdk14-m3.6.x_build\target\maven-source-plugin-3.2.2-SNAPSHOT.jar under org\apache\maven\plugins\maven-source-plugin\3.2.2-SNAPSHOT\maven-source-plugin-3.2.2-SNAPSHOT.jar
[Fast Archiver] No prior successful build to compare, so performing full copy of artifacts
[withMaven] junitPublisher - Archive test results for Maven artifact org.apache.maven.plugins:maven-source-plugin:maven-plugin:3.2.2-SNAPSHOT generated by maven-surefire-plugin:test (default-test): windows-jdk14-m3.6.x_build\target\surefire-reports\*.xml
Recording test results
[withMaven] openTasksPublisher - Scan Tasks for Maven artifact org.apache.maven.plugins:maven-source-plugin:maven-plugin:3.2.2-SNAPSHOT in source directory windows-jdk15-m3.6.x_build\src\main\java
[TASKS] Scanning folder 'f:\jenkins\jenkins-slave\712657a4\workspace\ox_maven-source-plugin_stabilize@3@2' for files matching the pattern 'windows-jdk15-m3.6.x_build\src\main\java\**\*' - excludes: null
[TASKS] Found 7 files to scan for tasks
[TASKS] Found 0 open tasks.
Skipping warnings blame since pipelines do not have an SCM link.%n
[withMaven] invokerPublisher - Archive invoker results for Maven artifact MavenArtifact{org.apache.maven.plugins:maven-source-plugin:maven-plugin:3.2.2-SNAPSHOT(version: 3.2.2-SNAPSHOT, snapshot:false) } generated by PluginInvocation{org.apache.maven.plugins:maven-invoker-plugin:3.2.1@integration-test  integration-test}: windows-jdk15-m3.6.x_build\target\invoker-reports\*.xml
[withMaven] openTasksPublisher - Scan Tasks for Maven artifact org.apache.maven.plugins:maven-source-plugin:maven-plugin:3.2.2-SNAPSHOT in source directory windows-jdk14-m3.6.x_build\src\main\java
[TASKS] Scanning folder 'f:\jenkins\jenkins-slave\712657a4\workspace\ox_maven-source-plugin_stabilize@2' for files matching the pattern 'windows-jdk14-m3.6.x_build\src\main\java\**\*' - excludes: null
[TASKS] Found 7 files to scan for tasks
[TASKS] Found 0 open tasks.
Skipping warnings blame since pipelines do not have an SCM link.%n
[withMaven] invokerPublisher - Archive invoker results for Maven artifact MavenArtifact{org.apache.maven.plugins:maven-source-plugin:maven-plugin:3.2.2-SNAPSHOT(version: 3.2.2-SNAPSHOT, snapshot:false) } generated by PluginInvocation{org.apache.maven.plugins:maven-invoker-plugin:3.2.1@integration-test  integration-test}: windows-jdk14-m3.6.x_build\target\invoker-reports\*.xml
[withMaven] Publishers: Generated Artifacts Publisher: 432 ms, Junit Publisher: 210 ms, Open Task Scanner Publisher: 61 ms, Invoker Publisher: 5688 ms
[Pipeline] // withMaven
[Pipeline] cleanWs
[WS-CLEANUP] Deleting project workspace...
[WS-CLEANUP] Deferred wipeout is used...
[withMaven] Publishers: Generated Artifacts Publisher: 219 ms, Junit Publisher: 267 ms, Open Task Scanner Publisher: 68 ms, Invoker Publisher: 5640 ms
[WS-CLEANUP] done
[Pipeline] }
[Pipeline] // stage
[Pipeline] // withMaven
[Pipeline] }
[Pipeline] cleanWs
[Pipeline] // ws
[Pipeline] }
[Pipeline] // node
[Pipeline] }
[WS-CLEANUP] Deleting project workspace...
[WS-CLEANUP] Deferred wipeout is used...
[WS-CLEANUP] done
[Pipeline] }
[Pipeline] // stage
[Pipeline] }
[Pipeline] // ws
[Pipeline] }
[Pipeline] // node
[Pipeline] }
[Pipeline] // parallel
[Pipeline] stage
[Pipeline] { (Notifications)
[Pipeline] echo
Build result: FAILURE
[Pipeline] jiraIssueSelector
[Pipeline] echo
The authors of changes [rfscholte].
[Pipeline] echo
Sending email ...
[Pipeline] emailext
Reply | Threaded
Open this post in threaded view
|

Build failed in Jenkins: Maven » Maven TLP » maven-source-plugin » stabilize #3

Apache Jenkins Server-2
See https://ci-builds.apache.org/job/Maven/job/maven-box/job/maven-source-plugin/job/stabilize/3/

Changes:

* Fix JDK range

All tests passed

Build log:
[...truncated 41936 lines...]
[DEBUG]   (f) failOnViolation = true
[DEBUG]   (f) failsOnError = false
[DEBUG]   (f) headerLocation = config/maven-header.txt
[DEBUG]   (f) includeResources = true
[DEBUG]   (f) includeTestResources = true
[DEBUG]   (f) includeTestSourceDirectory = false
[DEBUG]   (f) includes = **\/*.java
[DEBUG]   (f) logViolationsToConsole = true
[DEBUG]   (f) maxAllowedViolations = 0
[DEBUG]   (f) omitIgnoredModules = false
[DEBUG]   (f) outputFile = f:\jenkins\jenkins-slave\712657a4\workspace\ox_maven-source-plugin_stabilize@2\windows-jdk7-m3.5.x_build\target\checkstyle-result.xml
[DEBUG]   (f) outputFileFormat = xml
[DEBUG]   (f) plugin = Component Descriptor: role: 'org.apache.maven.plugin.Mojo', implementation: 'org.apache.maven.plugins.checkstyle.CheckstyleViolationCheckMojo', role hint: 'org.apache.maven.plugins:maven-checkstyle-plugin:3.0.0:check'
role: 'org.apache.maven.plugin.Mojo', implementation: 'org.apache.maven.plugins.checkstyle.CheckstyleReport', role hint: 'org.apache.maven.plugins:maven-checkstyle-plugin:3.0.0:checkstyle'
role: 'org.apache.maven.plugin.Mojo', implementation: 'org.apache.maven.plugins.checkstyle.CheckstyleAggregateReport', role hint: 'org.apache.maven.plugins:maven-checkstyle-plugin:3.0.0:checkstyle-aggregate'
role: 'org.apache.maven.plugin.Mojo', implementation: 'org.apache.maven.plugins.checkstyle.HelpMojo', role hint: 'org.apache.maven.plugins:maven-checkstyle-plugin:3.0.0:help'
---
[DEBUG]   (f) project = MavenProject: org.apache.maven.plugins:maven-source-plugin:3.2.2-SNAPSHOT @ f:\jenkins\jenkins-slave\712657a4\workspace\ox_maven-source-plugin_stabilize@2\windows-jdk7-m3.5.x_build\pom.xml
[DEBUG]   (f) resourceIncludes = **/*.properties
[DEBUG]   (f) resources = [Resource {targetPath: null, filtering: false, FileSet {directory: f:\jenkins\jenkins-slave\712657a4\workspace\ox_maven-source-plugin_stabilize@2\windows-jdk7-m3.5.x_build\src\main\resources, PatternSet [includes: {}, excludes: {}]}}, Resource {targetPath: null, filtering: false, FileSet {directory: f:\jenkins\jenkins-slave\712657a4\workspace\ox_maven-source-plugin_stabilize@2\windows-jdk7-m3.5.x_build\target\maven-shared-archive-resources, PatternSet [includes: {}, excludes: {}]}}]
[DEBUG]   (f) rulesFiles = f:\jenkins\jenkins-slave\712657a4\workspace\ox_maven-source-plugin_stabilize@2\windows-jdk7-m3.5.x_build\target\checkstyle-rules.xml
[DEBUG]   (f) skip = false
[DEBUG]   (f) skipExec = false
[DEBUG]   (f) sourceDirectories = [src/main/java]
[DEBUG]   (f) suppressionsFileExpression = checkstyle.suppressions.file
[DEBUG]   (f) testResources = [Resource {targetPath: null, filtering: false, FileSet {directory: f:\jenkins\jenkins-slave\712657a4\workspace\ox_maven-source-plugin_stabilize@2\windows-jdk7-m3.5.x_build\src\test\resources, PatternSet [includes: {}, excludes: {}]}}, Resource {targetPath: null, filtering: false, FileSet {directory: f:\jenkins\jenkins-slave\712657a4\workspace\ox_maven-source-plugin_stabilize@2\windows-jdk7-m3.5.x_build\target\maven-shared-archive-resources, PatternSet [includes: {}, excludes: {}]}}]
[DEBUG]   (f) testSourceDirectories = [src/test/java]
[DEBUG]   (f) violationIgnore = RedundantThrows,NewlineAtEndOfFile,ParameterNumber,MethodLength,FileLength
[DEBUG]   (f) violationSeverity = error
[DEBUG] -- end configuration --
[DEBUG] executeCheckstyle start headerLocation : config/maven-header.txt
[DEBUG] Added 7 source files found in 'F:\jenkins\jenkins-slave\712657a4\workspace\ox_maven-source-plugin_stabilize@2\windows-jdk7-m3.5.x_build\src\main\java'.
[DEBUG] The resources directory 'f:\jenkins\jenkins-slave\712657a4\workspace\ox_maven-source-plugin_stabilize@2\windows-jdk7-m3.5.x_build\src\main\resources' does not exist or is not a directory.
[DEBUG] Added 0 resource files found in 'f:\jenkins\jenkins-slave\712657a4\workspace\ox_maven-source-plugin_stabilize@2\windows-jdk7-m3.5.x_build\target\maven-shared-archive-resources'.
[DEBUG] Added 9 resource files found in 'f:\jenkins\jenkins-slave\712657a4\workspace\ox_maven-source-plugin_stabilize@2\windows-jdk7-m3.5.x_build\src\test\resources'.
[DEBUG] Added 0 resource files found in 'f:\jenkins\jenkins-slave\712657a4\workspace\ox_maven-source-plugin_stabilize@2\windows-jdk7-m3.5.x_build\target\maven-shared-archive-resources'.
[DEBUG] Added 16 files to process.
[DEBUG] Adding the outputDirectory file:/f:/jenkins/jenkins-slave/712657a4/workspace/ox_maven-source-plugin_stabilize@2/windows-jdk7-m3.5.x_build/target/classes/ to the Checkstyle class path
[DEBUG] request.getConfigLocation() config/maven_checks.xml
[DEBUG] URLResourceLoader: No valid URL 'config/maven_checks.xml'
[DEBUG] URLResourceLoader: No valid URL 'config/maven_checks.xml'
[DEBUG] The resource 'config/maven_checks.xml' was not found with resourceLoader org.codehaus.plexus.resource.loader.URLResourceLoader.
[DEBUG] The resource 'config/maven_checks.xml' was not found with resourceLoader org.codehaus.plexus.resource.loader.JarResourceLoader.
[DEBUG] The resource 'config/maven_checks.xml' was not found with resourceLoader org.codehaus.plexus.resource.loader.FileResourceLoader.
[DEBUG] The resource 'config/maven_checks.xml' was found as jar:file:/f:/jenkins/jenkins-slave/712657a4/workspace/.maven_repositories/1/org/apache/maven/shared/maven-shared-resources/2/maven-shared-resources-2.jar!/config/maven_checks.xml.
[DEBUG] headerLocation config/maven-header.txt
[DEBUG] URLResourceLoader: No valid URL 'config/maven-header.txt'
[DEBUG] URLResourceLoader: No valid URL 'config/maven-header.txt'
[DEBUG] The resource 'config/maven-header.txt' was not found with resourceLoader org.codehaus.plexus.resource.loader.URLResourceLoader.
[DEBUG] JarResourceLoader : trying to load "jar:file:/f:/jenkins/jenkins-slave/712657a4/workspace/.maven_repositories/1/org/apache/maven/shared/maven-shared-resources/2/maven-shared-resources-2.jar"
[DEBUG] The resource 'config/maven-header.txt' was found as jar:file:/f:/jenkins/jenkins-slave/712657a4/workspace/.maven_repositories/1/org/apache/maven/shared/maven-shared-resources/2/maven-shared-resources-2.jar!/config/maven-header.txt.
[INFO] run post-build script verify.groovy
[INFO]           verify-parameter-goal-generated-test-jar\pom.xml . SUCCESS (3.4 s)
[INFO] Building: verify-parameter-goal-jar\pom.xml
[INFO] run post-build script verify.groovy
[INFO]           verify-parameter-goal-generated-test-jar\pom.xml . SUCCESS (3.5 s)
[INFO] Building: verify-parameter-goal-jar\pom.xml
[DEBUG] Added 'f:\jenkins\jenkins-slave\712657a4\workspace\ox_maven-source-plugin_stabilize@2\windows-jdk7-m3.5.x_build\target\maven-shared-archive-resources' as a source directory.
[INFO]
[INFO] --- maven-invoker-plugin:3.2.1:verify (integration-test) @ maven-source-plugin ---
[DEBUG] Configuring mojo org.apache.maven.plugins:maven-invoker-plugin:3.2.1:verify from plugin realm ClassRealm[plugin>org.apache.maven.plugins:maven-invoker-plugin:3.2.1, parent: sun.misc.Launcher$AppClassLoader@4069b25f]
[DEBUG] Configuring mojo 'org.apache.maven.plugins:maven-invoker-plugin:3.2.1:verify' with basic configurator -->
[DEBUG]   (f) ignoreFailures = false
[DEBUG]   (f) reportsDirectory = f:\jenkins\jenkins-slave\712657a4\workspace\ox_maven-source-plugin_stabilize@2\windows-jdk7-m3.5.x_build\target\invoker-reports
[DEBUG]   (f) skipInvocation = false
[DEBUG]   (f) suppressSummaries = false
[DEBUG] -- end configuration --
[INFO] -------------------------------------------------
[INFO] Build Summary:
[INFO]   Passed: 22, Failed: 0, Errors: 0, Skipped: 0
[INFO] -------------------------------------------------
[INFO] ------------------------------------------------------------------------
[INFO] BUILD SUCCESS
[INFO] ------------------------------------------------------------------------
[INFO] Total time: 02:20 min
[INFO] Finished at: 2020-07-31T08:18:54-07:00
[INFO] ------------------------------------------------------------------------
[INFO] [jenkins-event-spy] Generated F:\jenkins\jenkins-slave\712657a4\workspace\ox_maven-source-plugin_stabilize@2@tmp\withMavenb92e7652\maven-spy-20200731-081633-5518014967900911573528.log
Picked up JAVA_TOOL_OPTIONS: -Dmaven.ext.class.path="f:\jenkins\jenkins-slave\712657a4\workspace\ox_maven-source-plugin_stabilize@2@tmp\withMavenb92e7652\pipeline-maven-spy.jar" -Dorg.jenkinsci.plugins.pipeline.maven.reportsFolder="f:\jenkins\jenkins-slave\712657a4\workspace\ox_maven-source-plugin_stabilize@2@tmp\withMavenb92e7652"
[Pipeline] }
[Pipeline] // dir
[Pipeline] }
[withMaven] artifactsPublisher - Archive artifact windows-jdk7-m3.5.x_build\pom.xml under org\apache\maven\plugins\maven-source-plugin\3.2.2-SNAPSHOT\maven-source-plugin-3.2.2-SNAPSHOT.pom
[withMaven] artifactsPublisher - Archive artifact windows-jdk7-m3.5.x_build\target\maven-source-plugin-3.2.2-SNAPSHOT.jar under org\apache\maven\plugins\maven-source-plugin\3.2.2-SNAPSHOT\maven-source-plugin-3.2.2-SNAPSHOT.jar
[Fast Archiver] No prior successful build to compare, so performing full copy of artifacts
[withMaven] junitPublisher - Archive test results for Maven artifact org.apache.maven.plugins:maven-source-plugin:maven-plugin:3.2.2-SNAPSHOT generated by maven-surefire-plugin:test (default-test): windows-jdk7-m3.5.x_build\target\surefire-reports\*.xml
Recording test results
[withMaven] openTasksPublisher - Scan Tasks for Maven artifact org.apache.maven.plugins:maven-source-plugin:maven-plugin:3.2.2-SNAPSHOT in source directory windows-jdk7-m3.5.x_build\src\main\java
[TASKS] Scanning folder 'f:\jenkins\jenkins-slave\712657a4\workspace\ox_maven-source-plugin_stabilize@2' for files matching the pattern 'windows-jdk7-m3.5.x_build\src\main\java\**\*' - excludes: null
[TASKS] Found 7 files to scan for tasks
[TASKS] Found 0 open tasks.
Skipping warnings blame since pipelines do not have an SCM link.%n
[withMaven] invokerPublisher - Archive invoker results for Maven artifact MavenArtifact{org.apache.maven.plugins:maven-source-plugin:maven-plugin:3.2.2-SNAPSHOT(version: 3.2.2-SNAPSHOT, snapshot:false) } generated by PluginInvocation{org.apache.maven.plugins:maven-invoker-plugin:3.2.1@integration-test  integration-test}: windows-jdk7-m3.5.x_build\target\invoker-reports\*.xml
[INFO] run post-build script verify.groovy
[INFO]           verify-parameter-goal-jar\pom.xml ................ SUCCESS (3.1 s)
[INFO] Building: verify-parameter-goal-jar-no-fork\pom.xml
[INFO] run post-build script verify.groovy
[INFO]           verify-parameter-goal-jar\pom.xml ................ SUCCESS (3.1 s)
[INFO] Building: verify-parameter-goal-jar-no-fork\pom.xml
[withMaven] Publishers: Generated Artifacts Publisher: 185 ms, Junit Publisher: 225 ms, Open Task Scanner Publisher: 69 ms, Invoker Publisher: 6476 ms
[Pipeline] // withMaven
[Pipeline] cleanWs
[WS-CLEANUP] Deleting project workspace...
[WS-CLEANUP] Deferred wipeout is used...
[WS-CLEANUP] done
[Pipeline] }
[Pipeline] // stage
[Pipeline] }
[Pipeline] // ws
[Pipeline] }
[Pipeline] // node
[Pipeline] }
[INFO] run post-build script verify.groovy
[INFO]           verify-parameter-goal-jar-no-fork\pom.xml ........ SUCCESS (3.1 s)
[INFO] Building: verify-parameter-goal-test-jar\pom.xml
[INFO] run post-build script verify.groovy
[INFO]           verify-parameter-goal-jar-no-fork\pom.xml ........ SUCCESS (3.3 s)
[INFO] Building: verify-parameter-goal-test-jar\pom.xml
[withMaven] Publishers: Generated Artifacts Publisher: 182 ms, Junit Publisher: 228 ms, Open Task Scanner Publisher: 73 ms, Invoker Publisher: 6219 ms
[Pipeline] // withMaven
[Pipeline] cleanWs
[WS-CLEANUP] Deleting project workspace...
[WS-CLEANUP] Deferred wipeout is used...
[WS-CLEANUP] done
[Pipeline] }
[Pipeline] // stage
[Pipeline] }
[Pipeline] // ws
[Pipeline] }
[Pipeline] // node
[Pipeline] }
[withMaven] Publishers: Generated Artifacts Publisher: 1060 ms, Junit Publisher: 1242 ms, Open Task Scanner Publisher: 365 ms, Invoker Publisher: 36980 ms
[Pipeline] // withMaven
[Pipeline] cleanWs
[WS-CLEANUP] Deleting project workspace...
[WS-CLEANUP] Deferred wipeout is used...
[INFO] run post-build script verify.groovy
[INFO]           verify-parameter-goal-test-jar\pom.xml ........... SUCCESS (3.3 s)
[INFO] Building: verify-parameter-goal-test-jar-no-fork\pom.xml
[WS-CLEANUP] done
[Pipeline] }
[Pipeline] // stage
[Pipeline] }
[Pipeline] // ws
[Pipeline] }
[Pipeline] // node
[Pipeline] }
[INFO] run post-build script verify.groovy
[INFO]           verify-parameter-goal-test-jar\pom.xml ........... SUCCESS (3.5 s)
[INFO] Building: verify-parameter-goal-test-jar-no-fork\pom.xml
[INFO] run post-build script verify.groovy
[INFO]           verify-parameter-goal-test-jar-no-fork\pom.xml ... SUCCESS (3.5 s)
[INFO]
[INFO] --- maven-checkstyle-plugin:3.0.0:check (checkstyle-check) @ maven-source-plugin ---
[INFO] run post-build script verify.groovy
[INFO]           verify-parameter-goal-test-jar-no-fork\pom.xml ... SUCCESS (3.7 s)
[INFO]
[INFO] --- maven-checkstyle-plugin:3.0.0:check (checkstyle-check) @ maven-source-plugin ---
[INFO]
[INFO] --- maven-invoker-plugin:3.2.1:verify (integration-test) @ maven-source-plugin ---
[INFO] -------------------------------------------------
[INFO] Build Summary:
[INFO]   Passed: 22, Failed: 0, Errors: 0, Skipped: 0
[INFO] -------------------------------------------------
[INFO] ------------------------------------------------------------------------
[INFO] BUILD SUCCESS
[INFO] ------------------------------------------------------------------------
[INFO] Total time:  02:16 min
[INFO] Finished at: 2020-07-31T08:19:07-07:00
[INFO] ------------------------------------------------------------------------
[INFO] [jenkins-event-spy] Generated F:\jenkins\jenkins-slave\712657a4\workspace\ox_maven-source-plugin_stabilize@2@2@tmp\withMaven5acedabf\maven-spy-20200731-081651-2114656590582821848872.log
[Pipeline] }
[Pipeline] // dir
[Pipeline] }
[INFO]
[INFO] --- maven-invoker-plugin:3.2.1:verify (integration-test) @ maven-source-plugin ---
[INFO] -------------------------------------------------
[INFO] Build Summary:
[INFO]   Passed: 22, Failed: 0, Errors: 0, Skipped: 0
[INFO] -------------------------------------------------
[INFO] ------------------------------------------------------------------------
[INFO] BUILD SUCCESS
[INFO] ------------------------------------------------------------------------
[INFO] Total time:  02:16 min
[INFO] Finished at: 2020-07-31T08:19:08-07:00
[INFO] ------------------------------------------------------------------------
[INFO] [jenkins-event-spy] Generated F:\jenkins\jenkins-slave\712657a4\workspace\ox_maven-source-plugin_stabilize@3@tmp\withMavend815e34e\maven-spy-20200731-081651-50716536758050849052838.log
[Pipeline] }
[Pipeline] // dir
[Pipeline] }
[withMaven] artifactsPublisher - Archive artifact windows-jdk15-m3.6.x_build\pom.xml under org\apache\maven\plugins\maven-source-plugin\3.2.2-SNAPSHOT\maven-source-plugin-3.2.2-SNAPSHOT.pom
[withMaven] artifactsPublisher - Archive artifact windows-jdk14-m3.6.x_build\pom.xml under org\apache\maven\plugins\maven-source-plugin\3.2.2-SNAPSHOT\maven-source-plugin-3.2.2-SNAPSHOT.pom
[withMaven] artifactsPublisher - Archive artifact windows-jdk15-m3.6.x_build\target\maven-source-plugin-3.2.2-SNAPSHOT.jar under org\apache\maven\plugins\maven-source-plugin\3.2.2-SNAPSHOT\maven-source-plugin-3.2.2-SNAPSHOT.jar
[withMaven] artifactsPublisher - Archive artifact windows-jdk14-m3.6.x_build\target\maven-source-plugin-3.2.2-SNAPSHOT.jar under org\apache\maven\plugins\maven-source-plugin\3.2.2-SNAPSHOT\maven-source-plugin-3.2.2-SNAPSHOT.jar
[Fast Archiver] No prior successful build to compare, so performing full copy of artifacts
[Fast Archiver] No prior successful build to compare, so performing full copy of artifacts
[withMaven] junitPublisher - Archive test results for Maven artifact org.apache.maven.plugins:maven-source-plugin:maven-plugin:3.2.2-SNAPSHOT generated by maven-surefire-plugin:test (default-test): windows-jdk14-m3.6.x_build\target\surefire-reports\*.xml
Recording test results
[withMaven] junitPublisher - Archive test results for Maven artifact org.apache.maven.plugins:maven-source-plugin:maven-plugin:3.2.2-SNAPSHOT generated by maven-surefire-plugin:test (default-test): windows-jdk15-m3.6.x_build\target\surefire-reports\*.xml
Recording test results
[withMaven] openTasksPublisher - Scan Tasks for Maven artifact org.apache.maven.plugins:maven-source-plugin:maven-plugin:3.2.2-SNAPSHOT in source directory windows-jdk14-m3.6.x_build\src\main\java
[withMaven] openTasksPublisher - Scan Tasks for Maven artifact org.apache.maven.plugins:maven-source-plugin:maven-plugin:3.2.2-SNAPSHOT in source directory windows-jdk15-m3.6.x_build\src\main\java
[TASKS] Scanning folder 'f:\jenkins\jenkins-slave\712657a4\workspace\ox_maven-source-plugin_stabilize@3' for files matching the pattern 'windows-jdk14-m3.6.x_build\src\main\java\**\*' - excludes: null
[TASKS] Found 7 files to scan for tasks
[TASKS] Found 0 open tasks.
Skipping warnings blame since pipelines do not have an SCM link.%n
[TASKS] Scanning folder 'f:\jenkins\jenkins-slave\712657a4\workspace\ox_maven-source-plugin_stabilize@2@2' for files matching the pattern 'windows-jdk15-m3.6.x_build\src\main\java\**\*' - excludes: null
[TASKS] Found 7 files to scan for tasks
[TASKS] Found 0 open tasks.
Skipping warnings blame since pipelines do not have an SCM link.%n
[withMaven] invokerPublisher - Archive invoker results for Maven artifact MavenArtifact{org.apache.maven.plugins:maven-source-plugin:maven-plugin:3.2.2-SNAPSHOT(version: 3.2.2-SNAPSHOT, snapshot:false) } generated by PluginInvocation{org.apache.maven.plugins:maven-invoker-plugin:3.2.1@integration-test  integration-test}: windows-jdk15-m3.6.x_build\target\invoker-reports\*.xml
[withMaven] invokerPublisher - Archive invoker results for Maven artifact MavenArtifact{org.apache.maven.plugins:maven-source-plugin:maven-plugin:3.2.2-SNAPSHOT(version: 3.2.2-SNAPSHOT, snapshot:false) } generated by PluginInvocation{org.apache.maven.plugins:maven-invoker-plugin:3.2.1@integration-test  integration-test}: windows-jdk14-m3.6.x_build\target\invoker-reports\*.xml
[withMaven] Publishers: Generated Artifacts Publisher: 741 ms, Junit Publisher: 4969 ms, Open Task Scanner Publisher: 808 ms, Invoker Publisher: 7395 ms
[withMaven] Publishers: Generated Artifacts Publisher: 754 ms, Junit Publisher: 5126 ms, Open Task Scanner Publisher: 638 ms, Invoker Publisher: 7401 ms
[Pipeline] // withMaven
[Pipeline] cleanWs
[Pipeline] // withMaven
[Pipeline] cleanWs
[WS-CLEANUP] Deleting project workspace...
[WS-CLEANUP] Deferred wipeout is used...
[WS-CLEANUP] Deleting project workspace...
[WS-CLEANUP] Deferred wipeout is used...
[WS-CLEANUP] done
[Pipeline] }
[Pipeline] // stage
[WS-CLEANUP] done
[Pipeline] }
[Pipeline] // ws
[Pipeline] }
[Pipeline] }
[Pipeline] // node
[Pipeline] // stage
[Pipeline] }
[Pipeline] }
[Pipeline] // ws
[Pipeline] }
[Pipeline] // node
[Pipeline] }
[Pipeline] // parallel
[Pipeline] stage
[Pipeline] { (Notifications)
[Pipeline] echo
Build result: FAILURE
[Pipeline] jiraIssueSelector
[Pipeline] echo
The authors of changes [rfscholte].
[Pipeline] echo
Sending email ...
[Pipeline] emailext
Reply | Threaded
Open this post in threaded view
|

Build failed in Jenkins: Maven » Maven TLP » maven-source-plugin » stabilize #4

Apache Jenkins Server-2
See https://ci-builds.apache.org/job/Maven/job/maven-box/job/maven-source-plugin/job/stabilize/4/

Changes:

* Add profile id

All tests passed

Build log:
[...truncated 41961 lines...]
[Pipeline] }
[Pipeline] // dir
[Pipeline] }
[withMaven] artifactsPublisher - Archive artifact windows-jdk11-m3.6.x_build\pom.xml under org\apache\maven\plugins\maven-source-plugin\3.2.2-SNAPSHOT\maven-source-plugin-3.2.2-SNAPSHOT.pom
[withMaven] artifactsPublisher - Archive artifact windows-jdk11-m3.6.x_build\target\maven-source-plugin-3.2.2-SNAPSHOT.jar under org\apache\maven\plugins\maven-source-plugin\3.2.2-SNAPSHOT\maven-source-plugin-3.2.2-SNAPSHOT.jar
[Fast Archiver] No prior successful build to compare, so performing full copy of artifacts
[withMaven] junitPublisher - Archive test results for Maven artifact org.apache.maven.plugins:maven-source-plugin:maven-plugin:3.2.2-SNAPSHOT generated by maven-surefire-plugin:test (default-test): windows-jdk11-m3.6.x_build\target\surefire-reports\*.xml
Recording test results
[DEBUG] Added '/home/jenkins/workspace/ox_maven-source-plugin_stabilize@2/linux-jdk7-m3.6.x_build/target/maven-shared-archive-resources' as a source directory.
[INFO]
[INFO] --- maven-invoker-plugin:3.2.1:verify (integration-test) @ maven-source-plugin ---
[DEBUG] Configuring mojo org.apache.maven.plugins:maven-invoker-plugin:3.2.1:verify from plugin realm ClassRealm[plugin>org.apache.maven.plugins:maven-invoker-plugin:3.2.1, parent: sun.misc.Launcher$AppClassLoader@5b3d9c02]
[DEBUG] Configuring mojo 'org.apache.maven.plugins:maven-invoker-plugin:3.2.1:verify' with basic configurator -->
[DEBUG]   (f) ignoreFailures = false
[DEBUG]   (f) reportsDirectory = /home/jenkins/workspace/ox_maven-source-plugin_stabilize@2/linux-jdk7-m3.6.x_build/target/invoker-reports
[DEBUG]   (f) skipInvocation = false
[DEBUG]   (f) suppressSummaries = false
[DEBUG] -- end configuration --
[INFO] -------------------------------------------------
[INFO] Build Summary:
[INFO]   Passed: 22, Failed: 0, Errors: 0, Skipped: 0
[INFO] -------------------------------------------------
[INFO] ------------------------------------------------------------------------
[INFO] BUILD SUCCESS
[INFO] ------------------------------------------------------------------------
[INFO] Total time:  03:14 min
[INFO] Finished at: 2020-07-31T15:42:11Z
[INFO] ------------------------------------------------------------------------
[INFO] [jenkins-event-spy] Generated /home/jenkins/workspace/ox_maven-source-plugin_stabilize@2@tmp/withMaven42eefe32/maven-spy-20200731-153856-4198595825960978366735.log
[Pipeline] }
[Pipeline] // dir
[Pipeline] }
[withMaven] openTasksPublisher - Scan Tasks for Maven artifact org.apache.maven.plugins:maven-source-plugin:maven-plugin:3.2.2-SNAPSHOT in source directory windows-jdk11-m3.6.x_build\src\main\java
[withMaven] openTasksPublisher - Scan Tasks for Maven artifact org.apache.maven.plugins:maven-source-plugin:maven-plugin:3.2.2-SNAPSHOT in source directory windows-jdk8-m3.6.x_build\src\main\java
[TASKS] Scanning folder 'f:\jenkins\jenkins-slave\712657a4\workspace\ox_maven-source-plugin_stabilize@3@2' for files matching the pattern 'windows-jdk11-m3.6.x_build\src\main\java\**\*' - excludes: null
[TASKS] Found 7 files to scan for tasks
[TASKS] Found 0 open tasks.
Skipping warnings blame since pipelines do not have an SCM link.%n
[TASKS] Scanning folder 'f:\jenkins\jenkins-slave\712657a4\workspace\ox_maven-source-plugin_stabilize@2' for files matching the pattern 'windows-jdk8-m3.6.x_build\src\main\java\**\*' - excludes: null
[TASKS] Found 7 files to scan for tasks
[TASKS] Found 0 open tasks.
Skipping warnings blame since pipelines do not have an SCM link.%n
[withMaven] invokerPublisher - Archive invoker results for Maven artifact MavenArtifact{org.apache.maven.plugins:maven-source-plugin:maven-plugin:3.2.2-SNAPSHOT(version: 3.2.2-SNAPSHOT, snapshot:false) } generated by PluginInvocation{org.apache.maven.plugins:maven-invoker-plugin:3.2.1@integration-test  integration-test}: windows-jdk8-m3.6.x_build\target\invoker-reports\*.xml
[withMaven] invokerPublisher - Archive invoker results for Maven artifact MavenArtifact{org.apache.maven.plugins:maven-source-plugin:maven-plugin:3.2.2-SNAPSHOT(version: 3.2.2-SNAPSHOT, snapshot:false) } generated by PluginInvocation{org.apache.maven.plugins:maven-invoker-plugin:3.2.1@integration-test  integration-test}: windows-jdk11-m3.6.x_build\target\invoker-reports\*.xml
[withMaven] artifactsPublisher - Archive artifact linux-jdk7-m3.6.x_build/pom.xml under org/apache/maven/plugins/maven-source-plugin/3.2.2-SNAPSHOT/maven-source-plugin-3.2.2-SNAPSHOT.pom
[withMaven] artifactsPublisher - Archive artifact linux-jdk7-m3.6.x_build/target/maven-source-plugin-3.2.2-SNAPSHOT.jar under org/apache/maven/plugins/maven-source-plugin/3.2.2-SNAPSHOT/maven-source-plugin-3.2.2-SNAPSHOT.jar
[Fast Archiver] No prior successful build to compare, so performing full copy of artifacts
[withMaven] junitPublisher - Archive test results for Maven artifact org.apache.maven.plugins:maven-source-plugin:maven-plugin:3.2.2-SNAPSHOT generated by maven-surefire-plugin:test (default-test): linux-jdk7-m3.6.x_build/target/surefire-reports/*.xml
Recording test results
[INFO] run post-build script verify.bsh
[INFO]           test-jar-no-fork\pom.xml ......................... SUCCESS (5.8 s)
[INFO] Building: verify-parameter-goal-generated-test-jar\pom.xml
[INFO] run post-build script verify.bsh
[INFO]           test-jar-no-fork\pom.xml ......................... SUCCESS (5.8 s)
[INFO] Building: verify-parameter-goal-generated-test-jar\pom.xml
[withMaven] Publishers: Generated Artifacts Publisher: 749 ms, Junit Publisher: 4918 ms, Open Task Scanner Publisher: 783 ms, Invoker Publisher: 7762 ms
[withMaven] Publishers: Generated Artifacts Publisher: 183 ms, Junit Publisher: 4007 ms, Open Task Scanner Publisher: 617 ms, Invoker Publisher: 7761 ms
[Pipeline] // withMaven
[Pipeline] cleanWs
[Pipeline] // withMaven
[Pipeline] cleanWs
[WS-CLEANUP] Deleting project workspace...
[WS-CLEANUP] Deferred wipeout is used...
[WS-CLEANUP] Deleting project workspace...
[WS-CLEANUP] Deferred wipeout is used...
[WS-CLEANUP] done
[Pipeline] }
[Pipeline] // stage
[WS-CLEANUP] done
[Pipeline] }
[Pipeline] // ws
[Pipeline] }
[Pipeline] }
[Pipeline] // node
[Pipeline] // stage
[Pipeline] }
[Pipeline] }
[Pipeline] // ws
[Pipeline] }
[Pipeline] // node
[Pipeline] }
[withMaven] openTasksPublisher - Scan Tasks for Maven artifact org.apache.maven.plugins:maven-source-plugin:maven-plugin:3.2.2-SNAPSHOT in source directory linux-jdk7-m3.6.x_build/src/main/java
[TASKS] Scanning folder '/home/jenkins/workspace/ox_maven-source-plugin_stabilize@2' for files matching the pattern 'linux-jdk7-m3.6.x_build/src/main/java/**/*' - excludes: null
[TASKS] Found 7 files to scan for tasks
[TASKS] Found 0 open tasks.
Skipping warnings blame since pipelines do not have an SCM link.%n
[withMaven] invokerPublisher - Archive invoker results for Maven artifact MavenArtifact{org.apache.maven.plugins:maven-source-plugin:maven-plugin:3.2.2-SNAPSHOT(version: 3.2.2-SNAPSHOT, snapshot:false) } generated by PluginInvocation{org.apache.maven.plugins:maven-invoker-plugin:3.2.1@integration-test  integration-test}: linux-jdk7-m3.6.x_build/target/invoker-reports/*.xml
[INFO] run post-build script verify.groovy
[INFO]           verify-parameter-goal-generated-test-jar\pom.xml . SUCCESS (3.1 s)
[INFO] Building: verify-parameter-goal-jar\pom.xml
[INFO] run post-build script verify.groovy
[INFO]           verify-parameter-goal-generated-test-jar\pom.xml . SUCCESS (3.1 s)
[INFO] Building: verify-parameter-goal-jar\pom.xml
[withMaven] Publishers: Generated Artifacts Publisher: 182 ms, Junit Publisher: 1181 ms, Open Task Scanner Publisher: 787 ms, Invoker Publisher: 7143 ms
[withMaven] Publishers: Generated Artifacts Publisher: 731 ms, Junit Publisher: 5161 ms, Open Task Scanner Publisher: 620 ms, Invoker Publisher: 7158 ms
[Pipeline] // withMaven
[Pipeline] cleanWs
[Pipeline] // withMaven
[Pipeline] cleanWs
[WS-CLEANUP] Deleting project workspace...
[WS-CLEANUP] Deferred wipeout is used...
[WS-CLEANUP] Deleting project workspace...
[WS-CLEANUP] Deferred wipeout is used...
[WS-CLEANUP] done
[Pipeline] }
[Pipeline] // stage
[Pipeline] }
[WS-CLEANUP] done
[Pipeline] // ws
[Pipeline] }
[Pipeline] }
[Pipeline] // node
[Pipeline] // stage
[Pipeline] }
[Pipeline] }
[Pipeline] // ws
[Pipeline] }
[Pipeline] // node
[Pipeline] }
[INFO] run post-build script verify.groovy
[INFO]           verify-parameter-goal-jar\pom.xml ................ SUCCESS (3.3 s)
[INFO] Building: verify-parameter-goal-jar-no-fork\pom.xml
[INFO] run post-build script verify.groovy
[INFO]           verify-parameter-goal-jar\pom.xml ................ SUCCESS (3.3 s)
[INFO] Building: verify-parameter-goal-jar-no-fork\pom.xml
[INFO] run post-build script verify.groovy
[INFO]           verify-parameter-goal-jar-no-fork\pom.xml ........ SUCCESS (3.2 s)
[INFO] Building: verify-parameter-goal-test-jar\pom.xml
[INFO] run post-build script verify.groovy
[INFO]           verify-parameter-goal-jar-no-fork\pom.xml ........ SUCCESS (3.1 s)
[INFO] Building: verify-parameter-goal-test-jar\pom.xml
[INFO] run post-build script verify.groovy
[INFO]           verify-parameter-goal-test-jar\pom.xml ........... SUCCESS (3.3 s)
[INFO] Building: verify-parameter-goal-test-jar-no-fork\pom.xml
[INFO] run post-build script verify.groovy
[INFO]           verify-parameter-goal-test-jar\pom.xml ........... SUCCESS (3.4 s)
[INFO] Building: verify-parameter-goal-test-jar-no-fork\pom.xml
[INFO] run post-build script verify.groovy
[INFO]           verify-parameter-goal-test-jar-no-fork\pom.xml ... SUCCESS (3.2 s)
[INFO]
[INFO] --- maven-checkstyle-plugin:3.0.0:check (checkstyle-check) @ maven-source-plugin ---
[INFO] run post-build script verify.groovy
[INFO]           verify-parameter-goal-test-jar-no-fork\pom.xml ... SUCCESS (3.3 s)
[INFO]
[INFO] --- maven-checkstyle-plugin:3.0.0:check (checkstyle-check) @ maven-source-plugin ---
[INFO]
[INFO] --- maven-invoker-plugin:3.2.1:verify (integration-test) @ maven-source-plugin ---
[INFO] -------------------------------------------------
[INFO] Build Summary:
[INFO]   Passed: 22, Failed: 0, Errors: 0, Skipped: 0
[INFO] -------------------------------------------------
[INFO] ------------------------------------------------------------------------
[INFO] BUILD SUCCESS
[INFO] ------------------------------------------------------------------------
[INFO] Total time:  02:10 min
[INFO] Finished at: 2020-07-31T08:42:39-07:00
[INFO] ------------------------------------------------------------------------
[INFO] [jenkins-event-spy] Generated F:\jenkins\jenkins-slave\712657a4\workspace\ox_maven-source-plugin_stabilize@3@2@tmp\withMavenb5b430fb\maven-spy-20200731-084029-1528155164360783280433.log
[Pipeline] }
[Pipeline] // dir
[Pipeline] }
[INFO]
[INFO] --- maven-invoker-plugin:3.2.1:verify (integration-test) @ maven-source-plugin ---
[INFO] -------------------------------------------------
[INFO] Build Summary:
[INFO]   Passed: 22, Failed: 0, Errors: 0, Skipped: 0
[INFO] -------------------------------------------------
[INFO] ------------------------------------------------------------------------
[INFO] BUILD SUCCESS
[INFO] ------------------------------------------------------------------------
[INFO] Total time:  02:10 min
[INFO] Finished at: 2020-07-31T08:42:40-07:00
[INFO] ------------------------------------------------------------------------
[INFO] [jenkins-event-spy] Generated F:\jenkins\jenkins-slave\712657a4\workspace\ox_maven-source-plugin_stabilize@2@tmp\withMaven3292b44e\maven-spy-20200731-084029-4458588198271417419672.log
[Pipeline] }
[Pipeline] // dir
[Pipeline] }
[withMaven] artifactsPublisher - Archive artifact windows-jdk14-m3.6.x_build\pom.xml under org\apache\maven\plugins\maven-source-plugin\3.2.2-SNAPSHOT\maven-source-plugin-3.2.2-SNAPSHOT.pom
[withMaven] artifactsPublisher - Archive artifact windows-jdk15-m3.6.x_build\pom.xml under org\apache\maven\plugins\maven-source-plugin\3.2.2-SNAPSHOT\maven-source-plugin-3.2.2-SNAPSHOT.pom
[withMaven] artifactsPublisher - Archive artifact windows-jdk14-m3.6.x_build\target\maven-source-plugin-3.2.2-SNAPSHOT.jar under org\apache\maven\plugins\maven-source-plugin\3.2.2-SNAPSHOT\maven-source-plugin-3.2.2-SNAPSHOT.jar
[withMaven] artifactsPublisher - Archive artifact windows-jdk15-m3.6.x_build\target\maven-source-plugin-3.2.2-SNAPSHOT.jar under org\apache\maven\plugins\maven-source-plugin\3.2.2-SNAPSHOT\maven-source-plugin-3.2.2-SNAPSHOT.jar
[Fast Archiver] No prior successful build to compare, so performing full copy of artifacts
[Fast Archiver] No prior successful build to compare, so performing full copy of artifacts
[withMaven] junitPublisher - Archive test results for Maven artifact org.apache.maven.plugins:maven-source-plugin:maven-plugin:3.2.2-SNAPSHOT generated by maven-surefire-plugin:test (default-test): windows-jdk15-m3.6.x_build\target\surefire-reports\*.xml
Recording test results
[withMaven] junitPublisher - Archive test results for Maven artifact org.apache.maven.plugins:maven-source-plugin:maven-plugin:3.2.2-SNAPSHOT generated by maven-surefire-plugin:test (default-test): windows-jdk14-m3.6.x_build\target\surefire-reports\*.xml
Recording test results
[withMaven] openTasksPublisher - Scan Tasks for Maven artifact org.apache.maven.plugins:maven-source-plugin:maven-plugin:3.2.2-SNAPSHOT in source directory windows-jdk15-m3.6.x_build\src\main\java
[withMaven] openTasksPublisher - Scan Tasks for Maven artifact org.apache.maven.plugins:maven-source-plugin:maven-plugin:3.2.2-SNAPSHOT in source directory windows-jdk14-m3.6.x_build\src\main\java
[TASKS] Scanning folder 'f:\jenkins\jenkins-slave\712657a4\workspace\ox_maven-source-plugin_stabilize@2' for files matching the pattern 'windows-jdk14-m3.6.x_build\src\main\java\**\*' - excludes: null
[TASKS] Found 7 files to scan for tasks
[TASKS] Found 0 open tasks.
Skipping warnings blame since pipelines do not have an SCM link.%n
[TASKS] Scanning folder 'f:\jenkins\jenkins-slave\712657a4\workspace\ox_maven-source-plugin_stabilize@3@2' for files matching the pattern 'windows-jdk15-m3.6.x_build\src\main\java\**\*' - excludes: null
[TASKS] Found 7 files to scan for tasks
[TASKS] Found 0 open tasks.
Skipping warnings blame since pipelines do not have an SCM link.%n
[withMaven] invokerPublisher - Archive invoker results for Maven artifact MavenArtifact{org.apache.maven.plugins:maven-source-plugin:maven-plugin:3.2.2-SNAPSHOT(version: 3.2.2-SNAPSHOT, snapshot:false) } generated by PluginInvocation{org.apache.maven.plugins:maven-invoker-plugin:3.2.1@integration-test  integration-test}: windows-jdk15-m3.6.x_build\target\invoker-reports\*.xml
[withMaven] invokerPublisher - Archive invoker results for Maven artifact MavenArtifact{org.apache.maven.plugins:maven-source-plugin:maven-plugin:3.2.2-SNAPSHOT(version: 3.2.2-SNAPSHOT, snapshot:false) } generated by PluginInvocation{org.apache.maven.plugins:maven-invoker-plugin:3.2.1@integration-test  integration-test}: windows-jdk14-m3.6.x_build\target\invoker-reports\*.xml
[withMaven] Publishers: Generated Artifacts Publisher: 750 ms, Junit Publisher: 4910 ms, Open Task Scanner Publisher: 807 ms, Invoker Publisher: 7242 ms
[withMaven] Publishers: Generated Artifacts Publisher: 751 ms, Junit Publisher: 5079 ms, Open Task Scanner Publisher: 636 ms, Invoker Publisher: 7242 ms
[Pipeline] // withMaven
[Pipeline] // withMaven
[Pipeline] cleanWs
[Pipeline] cleanWs
[WS-CLEANUP] Deleting project workspace...
[WS-CLEANUP] Deferred wipeout is used...
[WS-CLEANUP] Deleting project workspace...
[WS-CLEANUP] Deferred wipeout is used...
[WS-CLEANUP] done
[Pipeline] }
[Pipeline] // stage
[WS-CLEANUP] done
[Pipeline] }
[Pipeline] // ws
[Pipeline] }
[Pipeline] }
[Pipeline] // node
[Pipeline] // stage
[Pipeline] }
[Pipeline] }
[Pipeline] // ws
[Pipeline] }
[Pipeline] // node
[Pipeline] }
[withMaven] Publishers: Generated Artifacts Publisher: 1058 ms, Junit Publisher: 1245 ms, Open Task Scanner Publisher: 362 ms, Invoker Publisher: 36921 ms
[Pipeline] // withMaven
[Pipeline] cleanWs
[WS-CLEANUP] Deleting project workspace...
[WS-CLEANUP] Deferred wipeout is used...
[WS-CLEANUP] done
[Pipeline] }
[Pipeline] // stage
[Pipeline] }
[Pipeline] // ws
[Pipeline] }
[Pipeline] // node
[Pipeline] }
[Pipeline] // parallel
[Pipeline] stage
[Pipeline] { (Notifications)
[Pipeline] echo
Build result: FAILURE
[Pipeline] jiraIssueSelector
[Pipeline] echo
The authors of changes [rfscholte].
[Pipeline] echo
Sending email ...
[Pipeline] emailext