Build failed in Jenkins: Maven » Maven TLP » maven-scm » next #2

Previous Topic Next Topic
 
classic Classic list List threaded Threaded
1 message Options
Reply | Threaded
Open this post in threaded view
|

Build failed in Jenkins: Maven » Maven TLP » maven-scm » next #2

Apache Jenkins Server-2
See https://ci-builds.apache.org/job/Maven/job/maven-box/job/maven-scm/job/next/2/

Changes:

* Bump ganymed-ssh2 from build210 to 262
* upgrade com.mks.api:mksapi-jar from 4.10.9049 to 4.16.2671

All tests passed

Build log:
[...truncated 58090 lines...]
[INFO] Using 'UTF-8' encoding to copy filtered resources.
[INFO] skip non existing resourceDirectory F:\jenkins\jenkins-slave\712657a4\workspace\Maven_maven-box_maven-scm_next@2\m\maven-scm-providers\maven-scm-provider-tfs\src\main\resources
[INFO] Copying 3 resources
[INFO]
[INFO] --- maven-compiler-plugin:3.8.1:compile (default-compile) @ maven-scm-provider-tfs ---
[INFO] Changes detected - recompiling the module!
[INFO] Compiling 21 source files to F:\jenkins\jenkins-slave\712657a4\workspace\Maven_maven-box_maven-scm_next@2\m\maven-scm-providers\maven-scm-provider-tfs\target\classes
[INFO] /F:/jenkins/jenkins-slave/712657a4/workspace/Maven_maven-box_maven-scm_next@2/m/maven-scm-providers/maven-scm-provider-tfs/src/main/java/org/apache/maven/scm/provider/tfs/command/TfsTagCommand.java: Some input files use or override a deprecated API.
[INFO] /F:/jenkins/jenkins-slave/712657a4/workspace/Maven_maven-box_maven-scm_next@2/m/maven-scm-providers/maven-scm-provider-tfs/src/main/java/org/apache/maven/scm/provider/tfs/command/TfsTagCommand.java: Recompile with -Xlint:deprecation for details.
[INFO]
[INFO] --- animal-sniffer-maven-plugin:1.9:check (check-java-1.7-compat) @ maven-scm-provider-tfs ---
[INFO] Checking unresolved references to org.codehaus.mojo.signature:java17:1.0
[INFO]
[INFO] --- maven-resources-plugin:3.1.0:testResources (default-testResources) @ maven-scm-provider-tfs ---
[INFO] Using 'UTF-8' encoding to copy filtered resources.
[INFO] Copying 1 resource
[INFO] Copying 3 resources
[INFO]
[INFO] --- maven-compiler-plugin:3.8.1:testCompile (default-testCompile) @ maven-scm-provider-tfs ---
[INFO] Changes detected - recompiling the module!
[INFO] Compiling 13 source files to F:\jenkins\jenkins-slave\712657a4\workspace\Maven_maven-box_maven-scm_next@2\m\maven-scm-providers\maven-scm-provider-tfs\target\test-classes
[INFO]
[INFO] --- maven-surefire-plugin:2.22.0:test (default-test) @ maven-scm-provider-tfs ---
[INFO]
[INFO] -------------------------------------------------------
[INFO]  T E S T S
[INFO] -------------------------------------------------------
[INFO] Running org.apache.maven.scm.provider.tfs.command.blame.TfsBlameConsumerTest
[INFO] Tests run: 1, Failures: 0, Errors: 0, Skipped: 0, Time elapsed: 0.243 s - in org.apache.maven.scm.provider.tfs.command.blame.TfsBlameConsumerTest
[INFO] Running org.apache.maven.scm.provider.tfs.command.TfsAddCommandTest
[INFO] Tests run: 2, Failures: 0, Errors: 0, Skipped: 0, Time elapsed: 0.06 s - in org.apache.maven.scm.provider.tfs.command.TfsAddCommandTest
[INFO] Running org.apache.maven.scm.provider.tfs.command.TfsBranchCommandTest
[INFO] Tests run: 2, Failures: 0, Errors: 0, Skipped: 0, Time elapsed: 0.033 s - in org.apache.maven.scm.provider.tfs.command.TfsBranchCommandTest
[INFO] Running org.apache.maven.scm.provider.tfs.command.TfsChangeLogCommandTest
[INFO] Tests run: 4, Failures: 0, Errors: 0, Skipped: 0, Time elapsed: 0.063 s - in org.apache.maven.scm.provider.tfs.command.TfsChangeLogCommandTest
[INFO] Running org.apache.maven.scm.provider.tfs.command.TfsCheckInCommandTest
[INFO] Tests run: 2, Failures: 0, Errors: 0, Skipped: 0, Time elapsed: 0.027 s - in org.apache.maven.scm.provider.tfs.command.TfsCheckInCommandTest
[INFO] Running org.apache.maven.scm.provider.tfs.command.TfsCheckOutCommandTest
[INFO] Tests run: 5, Failures: 0, Errors: 0, Skipped: 0, Time elapsed: 0.066 s - in org.apache.maven.scm.provider.tfs.command.TfsCheckOutCommandTest
[INFO] Running org.apache.maven.scm.provider.tfs.command.TfsCommandTest
[INFO] Tests run: 1, Failures: 0, Errors: 0, Skipped: 0, Time elapsed: 0.011 s - in org.apache.maven.scm.provider.tfs.command.TfsCommandTest
[INFO] Running org.apache.maven.scm.provider.tfs.command.TfsEditCommandTest
[INFO] Tests run: 3, Failures: 0, Errors: 0, Skipped: 0, Time elapsed: 0.039 s - in org.apache.maven.scm.provider.tfs.command.TfsEditCommandTest
[INFO] Running org.apache.maven.scm.provider.tfs.command.TfsListCommandTest
[INFO] Tests run: 3, Failures: 0, Errors: 0, Skipped: 0, Time elapsed: 0.035 s - in org.apache.maven.scm.provider.tfs.command.TfsListCommandTest
[INFO] Running org.apache.maven.scm.provider.tfs.command.TfsStatusCommandTest
[INFO] Tests run: 4, Failures: 0, Errors: 0, Skipped: 0, Time elapsed: 0.01 s - in org.apache.maven.scm.provider.tfs.command.TfsStatusCommandTest
[INFO] Running org.apache.maven.scm.provider.tfs.command.TfsTagCommandTest
[INFO] Tests run: 2, Failures: 0, Errors: 0, Skipped: 0, Time elapsed: 0.017 s - in org.apache.maven.scm.provider.tfs.command.TfsTagCommandTest
[INFO] Running org.apache.maven.scm.provider.tfs.command.TfsUnEditCommandTest
[INFO] Tests run: 2, Failures: 0, Errors: 0, Skipped: 0, Time elapsed: 0.013 s - in org.apache.maven.scm.provider.tfs.command.TfsUnEditCommandTest
[INFO] Running org.apache.maven.scm.provider.tfs.command.TfsUpdateCommandTest
[INFO] Tests run: 3, Failures: 0, Errors: 0, Skipped: 0, Time elapsed: 0.025 s - in org.apache.maven.scm.provider.tfs.command.TfsUpdateCommandTest
[INFO]
[INFO] Results:
[INFO]
[INFO] Tests run: 34, Failures: 0, Errors: 0, Skipped: 0
[INFO]
[INFO]
[INFO] --- maven-jar-plugin:3.2.0:jar (default-jar) @ maven-scm-provider-tfs ---
[INFO] Building jar: F:\jenkins\jenkins-slave\712657a4\workspace\Maven_maven-box_maven-scm_next@2\m\maven-scm-providers\maven-scm-provider-tfs\target\maven-scm-provider-tfs-1.11.3-SNAPSHOT.jar
[INFO]
[INFO] --- maven-site-plugin:3.7.1:attach-descriptor (attach-descriptor) @ maven-scm-provider-tfs ---
[INFO] Skipping because packaging 'jar' is not pom.
[INFO]
[INFO] --- maven-checkstyle-plugin:3.0.0:check (checkstyle-check) @ maven-scm-provider-tfs ---
[INFO]
[INFO] ---------< org.apache.maven.scm:maven-scm-provider-integrity >----------
[INFO] Building Maven SCM MKS Integrity Provider 1.11.3-SNAPSHOT        [31/35]
[INFO] --------------------------------[ jar ]---------------------------------
[INFO] Downloading from central: https://repo.maven.apache.org/maven2/com/mks/api/mksapi-jar/4.16.2671/mksapi-jar-4.16.2671.pom
[INFO] Downloaded from central: https://repo.maven.apache.org/maven2/com/mks/api/mksapi-jar/4.16.2671/mksapi-jar-4.16.2671.pom (998 B at 33 kB/s)
[INFO] Downloading from central: https://repo.maven.apache.org/maven2/org/codehaus/groovy/groovy-all/2.4.21/groovy-all-2.4.21.pom
[INFO] Downloaded from central: https://repo.maven.apache.org/maven2/org/codehaus/groovy/groovy-all/2.4.21/groovy-all-2.4.21.pom (22 kB at 791 kB/s)
[INFO] Downloading from central: https://repo.maven.apache.org/maven2/com/mks/api/mksapi-jar/4.16.2671/mksapi-jar-4.16.2671.jar
[INFO] Downloading from central: https://repo.maven.apache.org/maven2/org/codehaus/groovy/groovy-all/2.4.21/groovy-all-2.4.21.jar
[INFO] Downloaded from central: https://repo.maven.apache.org/maven2/com/mks/api/mksapi-jar/4.16.2671/mksapi-jar-4.16.2671.jar (3.8 MB at 38 MB/s)
[INFO] Downloaded from central: https://repo.maven.apache.org/maven2/org/codehaus/groovy/groovy-all/2.4.21/groovy-all-2.4.21.jar (7.2 MB at 50 MB/s)
[INFO]
[INFO] --- maven-clean-plugin:3.1.0:clean (default-clean) @ maven-scm-provider-integrity ---
[INFO]
[INFO] --- maven-enforcer-plugin:1.4.1:enforce (enforce-maven-version) @ maven-scm-provider-integrity ---
[INFO]
[INFO] --- maven-enforcer-plugin:1.4.1:enforce (enforce-bytecode-version) @ maven-scm-provider-integrity ---
[INFO] Adding ignore: module-info
[INFO]
[INFO] --- apache-rat-plugin:0.13:check (rat-check) @ maven-scm-provider-integrity ---
[INFO] Enabled default license matchers.
[INFO] Will parse SCM ignores for exclusions...
[INFO] Finished adding exclusions from SCM ignore files.
[INFO] 62 implicit excludes (use -debug for more details).
[INFO] 22 explicit excludes (use -debug for more details).
[INFO] 45 resources included (use -debug for more details)
[INFO] Rat check: Summary over all files. Unapproved: 0, unknown: 0, generated: 0, approved: 45 licenses.
[INFO]
[INFO] --- maven-remote-resources-plugin:1.7.0:process (process-resource-bundles) @ maven-scm-provider-integrity ---
[INFO] Preparing remote bundle org.apache:apache-jar-resource-bundle:1.4
[INFO] Copying 3 resources from 1 bundle.
[INFO]
[INFO] --- plexus-component-metadata:2.0.0:generate-metadata (create-component-descriptor) @ maven-scm-provider-integrity ---
[INFO] Discovered 1 component descriptors(s)
[INFO]
[INFO] --- maven-resources-plugin:3.1.0:resources (default-resources) @ maven-scm-provider-integrity ---
[INFO] Using 'UTF-8' encoding to copy filtered resources.
[INFO] skip non existing resourceDirectory F:\jenkins\jenkins-slave\712657a4\workspace\Maven_maven-box_maven-scm_next@2\m\maven-scm-providers\maven-scm-provider-integrity\src\main\resources
[INFO] Copying 3 resources
[INFO]
[INFO] --- maven-compiler-plugin:3.8.1:compile (default-compile) @ maven-scm-provider-integrity ---
[INFO] Changes detected - recompiling the module!
[INFO] Compiling 30 source files to F:\jenkins\jenkins-slave\712657a4\workspace\Maven_maven-box_maven-scm_next@2\m\maven-scm-providers\maven-scm-provider-integrity\target\classes
[INFO] /F:/jenkins/jenkins-slave/712657a4/workspace/Maven_maven-box_maven-scm_next@2/m/maven-scm-providers/maven-scm-provider-integrity/src/main/java/org/apache/maven/scm/provider/integrity/APISession.java: Some input files use or override a deprecated API.
[INFO] /F:/jenkins/jenkins-slave/712657a4/workspace/Maven_maven-box_maven-scm_next@2/m/maven-scm-providers/maven-scm-provider-integrity/src/main/java/org/apache/maven/scm/provider/integrity/APISession.java: Recompile with -Xlint:deprecation for details.
[INFO] -------------------------------------------------------------
[ERROR] COMPILATION ERROR :
[INFO] -------------------------------------------------------------
[ERROR] /F:/jenkins/jenkins-slave/712657a4/workspace/Maven_maven-box_maven-scm_next@2/m/maven-scm-providers/maven-scm-provider-integrity/src/main/java/org/apache/maven/scm/provider/integrity/APISession.java:[44,86] cannot find symbol
  symbol:   method getAPIVersion()
  location: class com.mks.api.IntegrationPointFactory
[ERROR] /F:/jenkins/jenkins-slave/712657a4/workspace/Maven_maven-box_maven-scm_next@2/m/maven-scm-providers/maven-scm-provider-integrity/src/main/java/org/apache/maven/scm/provider/integrity/APISession.java:[44,32] cannot find symbol
  symbol:   method getAPIVersion()
  location: class com.mks.api.IntegrationPointFactory
[INFO] 2 errors
[INFO] -------------------------------------------------------------
[INFO] ------------------------------------------------------------------------
[INFO] Reactor Summary for Maven SCM 1.11.3-SNAPSHOT:
[INFO]
[INFO] Maven SCM .......................................... SUCCESS [ 45.185 s]
[INFO] Maven SCM API ...................................... SUCCESS [ 13.556 s]
[INFO] Maven SCM Managers ................................. SUCCESS [  0.547 s]
[INFO] Maven SCM Manager for Plexus ....................... SUCCESS [  2.065 s]
[INFO] Maven SCM Test ..................................... SUCCESS [  3.536 s]
[INFO] Maven SCM Providers ................................ SUCCESS [  0.812 s]
[INFO] Maven SCM AccuRev Provider ......................... SUCCESS [  9.581 s]
[INFO] Maven SCM Bazaar Provider .......................... SUCCESS [  3.323 s]
[INFO] Maven SCM Clearcase Provider ....................... SUCCESS [  8.813 s]
[INFO] Maven SCM CVS Provider - Parent .................... SUCCESS [  0.683 s]
[INFO] Maven SCM CVS Provider TCK tests ................... SUCCESS [  2.272 s]
[INFO] Maven SCM CVS Provider - Common library ............ SUCCESS [  4.021 s]
[INFO] Maven SCM CVS Provider - CVS Executable Impl. ...... SUCCESS [  3.043 s]
[INFO] Maven SCM CVS Provider - CVS Java Impl. ............ SUCCESS [  3.719 s]
[INFO] Maven SCM Mercurial (Hg) Provider .................. SUCCESS [  3.608 s]
[INFO] Maven SCM Git Provider - Parent .................... SUCCESS [  0.628 s]
[INFO] Maven SCM Git Provider - Common library ............ SUCCESS [  3.012 s]
[INFO] Maven SCM Git Provider TCK Tests ................... SUCCESS [  1.471 s]
[INFO] Maven SCM Git Provider - Git Executable Impl. ...... SUCCESS [ 14.570 s]
[INFO] Maven SCM Git Provider - JGit Impl. ................ SUCCESS [ 45.774 s]
[INFO] Maven SCM Local Provider ........................... SUCCESS [  2.495 s]
[INFO] Maven SCM Perforce Provider ........................ SUCCESS [  5.165 s]
[INFO] Maven SCM Starteam Provider ........................ SUCCESS [  6.194 s]
[INFO] Maven SCM Subversion Provider - Parent ............. SUCCESS [  0.551 s]
[INFO] Maven SCM Subversion Provider - Common library ..... SUCCESS [  2.888 s]
[INFO] Maven SCM Subversion Provider TCK Tests ............ SUCCESS [  1.279 s]
[INFO] Maven SCM Subversion Provider - SVN Executable Impl. SUCCESS [  7.170 s]
[INFO] Maven SCM Synergy Provider ......................... SUCCESS [  3.944 s]
[INFO] Maven SCM Visual Source Safe Provider .............. SUCCESS [  3.741 s]
[INFO] Maven SCM TFS Provider ............................. SUCCESS [  3.641 s]
[INFO] Maven SCM MKS Integrity Provider ................... FAILURE [  1.764 s]
[INFO] Maven SCM Jazz/Rational Team Concert Provider ...... SKIPPED
[INFO] Maven SCM Standard Providers ....................... SKIPPED
[INFO] Maven SCM Client ................................... SKIPPED
[INFO] Maven SCM Plugin ................................... SKIPPED
[INFO] ------------------------------------------------------------------------
[INFO] BUILD FAILURE
[INFO] ------------------------------------------------------------------------
[INFO] Total time:  03:31 min
[INFO] Finished at: 2021-04-04T04:32:57-07:00
[INFO] ------------------------------------------------------------------------
[WARNING] The requested profile "run-its" could not be activated because it does not exist.
[INFO] [jenkins-event-spy] Generated F:\jenkins\jenkins-slave\712657a4\workspace\Maven_maven-box_maven-scm_next@2@tmp\withMavenc7897ced\maven-spy-20210404-042926-1915059570522197928856.log
[ERROR] Failed to execute goal org.apache.maven.plugins:maven-compiler-plugin:3.8.1:compile (default-compile) on project maven-scm-provider-integrity: Compilation failure: Compilation failure:
[ERROR] /F:/jenkins/jenkins-slave/712657a4/workspace/Maven_maven-box_maven-scm_next@2/m/maven-scm-providers/maven-scm-provider-integrity/src/main/java/org/apache/maven/scm/provider/integrity/APISession.java:[44,86] cannot find symbol
[ERROR]   symbol:   method getAPIVersion()
[ERROR]   location: class com.mks.api.IntegrationPointFactory
[ERROR] /F:/jenkins/jenkins-slave/712657a4/workspace/Maven_maven-box_maven-scm_next@2/m/maven-scm-providers/maven-scm-provider-integrity/src/main/java/org/apache/maven/scm/provider/integrity/APISession.java:[44,32] cannot find symbol
[ERROR]   symbol:   method getAPIVersion()
[ERROR]   location: class com.mks.api.IntegrationPointFactory
[ERROR] -> [Help 1]
[ERROR]
[ERROR] To see the full stack trace of the errors, re-run Maven with the -e switch.
[ERROR] Re-run Maven using the -X switch to enable full debug logging.
[ERROR]
[ERROR] For more information about the errors and possible solutions, please read the following articles:
[ERROR] [Help 1] http://cwiki.apache.org/confluence/display/MAVEN/MojoFailureException
[ERROR]
[ERROR] After correcting the problems, you can resume the build with the command
[ERROR]   mvn <args> -rf :maven-scm-provider-integrity
[Pipeline] }
[Pipeline] // dir
[Pipeline] }
[withMaven] junitPublisher - Archive test results for Maven artifact org.apache.maven.scm:maven-scm-api:jar:1.11.3-SNAPSHOT generated by maven-surefire-plugin:test (default-test): m\maven-scm-api\target\surefire-reports\*.xml
[withMaven] junitPublisher - Archive test results for Maven artifact org.apache.maven.scm:maven-scm-manager-plexus:jar:1.11.3-SNAPSHOT generated by maven-surefire-plugin:test (default-test): m\maven-scm-managers\maven-scm-manager-plexus\target\surefire-reports\*.xml
[withMaven] junitPublisher - Archive test results for Maven artifact org.apache.maven.scm:maven-scm-test:jar:1.11.3-SNAPSHOT generated by maven-surefire-plugin:test (default-test): m\maven-scm-test\target\surefire-reports\*.xml
[withMaven] junitPublisher - Archive test results for Maven artifact org.apache.maven.scm:maven-scm-provider-accurev:jar:1.11.3-SNAPSHOT generated by maven-surefire-plugin:test (default-test): m\maven-scm-providers\maven-scm-provider-accurev\target\surefire-reports\*.xml
[withMaven] junitPublisher - Archive test results for Maven artifact org.apache.maven.scm:maven-scm-provider-bazaar:jar:1.11.3-SNAPSHOT generated by maven-surefire-plugin:test (default-test): m\maven-scm-providers\maven-scm-provider-bazaar\target\surefire-reports\*.xml
[withMaven] junitPublisher - Archive test results for Maven artifact org.apache.maven.scm:maven-scm-provider-clearcase:jar:1.11.3-SNAPSHOT generated by maven-surefire-plugin:test (default-test): m\maven-scm-providers\maven-scm-provider-clearcase\target\surefire-reports\*.xml
[withMaven] junitPublisher - Archive test results for Maven artifact org.apache.maven.scm:maven-scm-provider-cvstest:jar:1.11.3-SNAPSHOT generated by maven-surefire-plugin:test (default-test): m\maven-scm-providers\maven-scm-providers-cvs\maven-scm-provider-cvstest\target\surefire-reports\*.xml
[withMaven] junitPublisher - Archive test results for Maven artifact org.apache.maven.scm:maven-scm-provider-cvs-commons:jar:1.11.3-SNAPSHOT generated by maven-surefire-plugin:test (default-test): m\maven-scm-providers\maven-scm-providers-cvs\maven-scm-provider-cvs-commons\target\surefire-reports\*.xml
[withMaven] junitPublisher - Archive test results for Maven artifact org.apache.maven.scm:maven-scm-provider-cvsexe:jar:1.11.3-SNAPSHOT generated by maven-surefire-plugin:test (default-test): m\maven-scm-providers\maven-scm-providers-cvs\maven-scm-provider-cvsexe\target\surefire-reports\*.xml
[withMaven] junitPublisher - Archive test results for Maven artifact org.apache.maven.scm:maven-scm-provider-cvsjava:jar:1.11.3-SNAPSHOT generated by maven-surefire-plugin:test (default-test): m\maven-scm-providers\maven-scm-providers-cvs\maven-scm-provider-cvsjava\target\surefire-reports\*.xml
[withMaven] junitPublisher - Archive test results for Maven artifact org.apache.maven.scm:maven-scm-provider-hg:jar:1.11.3-SNAPSHOT generated by maven-surefire-plugin:test (default-test): m\maven-scm-providers\maven-scm-provider-hg\target\surefire-reports\*.xml
[withMaven] junitPublisher - Archive test results for Maven artifact org.apache.maven.scm:maven-scm-provider-git-commons:jar:1.11.3-SNAPSHOT generated by maven-surefire-plugin:test (default-test): m\maven-scm-providers\maven-scm-providers-git\maven-scm-provider-git-commons\target\surefire-reports\*.xml
[withMaven] junitPublisher - Archive test results for Maven artifact org.apache.maven.scm:maven-scm-provider-gittest:jar:1.11.3-SNAPSHOT generated by maven-surefire-plugin:test (default-test): m\maven-scm-providers\maven-scm-providers-git\maven-scm-provider-gittest\target\surefire-reports\*.xml
[withMaven] junitPublisher - Archive test results for Maven artifact org.apache.maven.scm:maven-scm-provider-gitexe:jar:1.11.3-SNAPSHOT generated by maven-surefire-plugin:test (default-test): m\maven-scm-providers\maven-scm-providers-git\maven-scm-provider-gitexe\target\surefire-reports\*.xml
[withMaven] junitPublisher - Archive test results for Maven artifact org.apache.maven.scm:maven-scm-provider-jgit:jar:1.11.3-SNAPSHOT generated by maven-surefire-plugin:test (default-test): m\maven-scm-providers\maven-scm-providers-git\maven-scm-provider-jgit\target\surefire-reports\*.xml
[withMaven] junitPublisher - Archive test results for Maven artifact org.apache.maven.scm:maven-scm-provider-local:jar:1.11.3-SNAPSHOT generated by maven-surefire-plugin:test (default-test): m\maven-scm-providers\maven-scm-provider-local\target\surefire-reports\*.xml
[withMaven] junitPublisher - Archive test results for Maven artifact org.apache.maven.scm:maven-scm-provider-perforce:jar:1.11.3-SNAPSHOT generated by maven-surefire-plugin:test (default-test): m\maven-scm-providers\maven-scm-provider-perforce\target\surefire-reports\*.xml
[withMaven] junitPublisher - Archive test results for Maven artifact org.apache.maven.scm:maven-scm-provider-starteam:jar:1.11.3-SNAPSHOT generated by maven-surefire-plugin:test (default-test): m\maven-scm-providers\maven-scm-provider-starteam\target\surefire-reports\*.xml
[withMaven] junitPublisher - Archive test results for Maven artifact org.apache.maven.scm:maven-scm-provider-svn-commons:jar:1.11.3-SNAPSHOT generated by maven-surefire-plugin:test (default-test): m\maven-scm-providers\maven-scm-providers-svn\maven-scm-provider-svn-commons\target\surefire-reports\*.xml
[withMaven] junitPublisher - Archive test results for Maven artifact org.apache.maven.scm:maven-scm-provider-svntest:jar:1.11.3-SNAPSHOT generated by maven-surefire-plugin:test (default-test): m\maven-scm-providers\maven-scm-providers-svn\maven-scm-provider-svntest\target\surefire-reports\*.xml
[withMaven] junitPublisher - Archive test results for Maven artifact org.apache.maven.scm:maven-scm-provider-svnexe:jar:1.11.3-SNAPSHOT generated by maven-surefire-plugin:test (default-test): m\maven-scm-providers\maven-scm-providers-svn\maven-scm-provider-svnexe\target\surefire-reports\*.xml
[withMaven] junitPublisher - Archive test results for Maven artifact org.apache.maven.scm:maven-scm-provider-synergy:jar:1.11.3-SNAPSHOT generated by maven-surefire-plugin:test (default-test): m\maven-scm-providers\maven-scm-provider-synergy\target\surefire-reports\*.xml
[withMaven] junitPublisher - Archive test results for Maven artifact org.apache.maven.scm:maven-scm-provider-vss:jar:1.11.3-SNAPSHOT generated by maven-surefire-plugin:test (default-test): m\maven-scm-providers\maven-scm-provider-vss\target\surefire-reports\*.xml
[withMaven] junitPublisher - Archive test results for Maven artifact org.apache.maven.scm:maven-scm-provider-tfs:jar:1.11.3-SNAPSHOT generated by maven-surefire-plugin:test (default-test): m\maven-scm-providers\maven-scm-provider-tfs\target\surefire-reports\*.xml
Recording test results
[withMaven] Publishers: Junit Publisher: 16423 ms
[Pipeline] // withMaven
[Pipeline] echo
[FAILURE-004] hudson.AbortException: script returned exit code 1
[Pipeline] cleanWs
[WS-CLEANUP] Deleting project workspace...
[WS-CLEANUP] Deferred wipeout is used...
[WS-CLEANUP] done
[Pipeline] cleanWs
[WS-CLEANUP] Deleting project workspace...
[WS-CLEANUP] Deferred wipeout is used...
[WS-CLEANUP] done
[Pipeline] }
[Pipeline] // stage
[Pipeline] }
[Pipeline] // ws
[Pipeline] }
[Pipeline] // withEnv
[Pipeline] }
[Pipeline] // node
[Pipeline] }
Failed in branch windows-jdk16
[Pipeline] // parallel
[Pipeline] echo
[FAILURE-003] AbortException hudson.AbortException: script returned exit code 1
[Pipeline] stage
[Pipeline] { (Notifications)
[Pipeline] echo
Build result: FAILURE
[Pipeline] jiraIssueSelector
[Pipeline] echo
The authors of changes [slachiewicz].
[Pipeline] echo
Sending email ...
[Pipeline] emailext