Build failed in Jenkins: Maven » Maven TLP » maven-resolver » master #45

Previous Topic Next Topic
 
classic Classic list List threaded Threaded
2 messages Options
Reply | Threaded
Open this post in threaded view
|

Build failed in Jenkins: Maven » Maven TLP » maven-resolver » master #45

Apache Jenkins Server-2
See https://ci-builds.apache.org/job/Maven/job/maven-box/job/maven-resolver/job/master/45/

Changes:

* [MRESOLVER-155] Make TrackingFileManager member of DefaultUpdateCheckManager

All tests passed

Build log:
[...truncated 18005 lines...]
[INFO] Downloading from central: https://repo.maven.apache.org/maven2/org/apache/commons/commons-lang3/3.1/commons-lang3-3.1.jar
[INFO] Downloaded from central: https://repo.maven.apache.org/maven2/org/apache/maven/surefire/surefire-api/2.19.1/surefire-api-2.19.1.jar (196 kB at 2.0 MB/s)
[INFO] Downloaded from central: https://repo.maven.apache.org/maven2/org/apache/maven/surefire/maven-surefire-common/2.19.1/maven-surefire-common-2.19.1.jar (293 kB at 3.0 MB/s)
[INFO] Downloaded from central: https://repo.maven.apache.org/maven2/org/codehaus/plexus/plexus-utils/3.0.20/plexus-utils-3.0.20.jar (243 kB at 2.5 MB/s)
[INFO] Downloaded from central: https://repo.maven.apache.org/maven2/org/apache/maven/surefire/surefire-booter/2.19.1/surefire-booter-2.19.1.jar (46 kB at 392 kB/s)
[INFO] Downloaded from central: https://repo.maven.apache.org/maven2/org/apache/commons/commons-lang3/3.1/commons-lang3-3.1.jar (316 kB at 2.5 MB/s)
[INFO] Using 'UTF-8' encoding to read mojo source files.
[INFO] java-javadoc mojo extractor found 0 mojo descriptor.
[INFO] java-annotations mojo extractor found 1 mojo descriptor.
[INFO]
[INFO] --- animal-sniffer-maven-plugin:1.19:check (check-java-compat) @ resolver-demo-maven-plugin ---
[INFO] Checking unresolved references to org.codehaus.mojo.signature:java18:1.0
[INFO]
[INFO] --- maven-resources-plugin:3.1.0:testResources (default-testResources) @ resolver-demo-maven-plugin ---
[INFO] Using 'UTF-8' encoding to copy filtered resources.
[INFO] skip non existing resourceDirectory F:\jenkins\jenkins-slave\712657a4\workspace\_maven-box_maven-resolver_master@2\m\maven-resolver-demos\maven-resolver-demo-maven-plugin\src\test\resources
[INFO] Copying 3 resources
[INFO]
[INFO] --- maven-compiler-plugin:3.8.1:testCompile (default-testCompile) @ resolver-demo-maven-plugin ---
[INFO] No sources to compile
[INFO]
[INFO] --- maven-surefire-plugin:2.22.0:test (default-test) @ resolver-demo-maven-plugin ---
[INFO]
[INFO] --- maven-jar-plugin:3.2.0:jar (default-jar) @ resolver-demo-maven-plugin ---
[INFO] Building jar: F:\jenkins\jenkins-slave\712657a4\workspace\_maven-box_maven-resolver_master@2\m\maven-resolver-demos\maven-resolver-demo-maven-plugin\target\resolver-demo-maven-plugin-1.7.0-SNAPSHOT.jar
[INFO]
[INFO] --- maven-plugin-plugin:3.5.2:addPluginArtifactMetadata (default-addPluginArtifactMetadata) @ resolver-demo-maven-plugin ---
[INFO]
[INFO] --- maven-site-plugin:3.7.1:attach-descriptor (attach-descriptor) @ resolver-demo-maven-plugin ---
[INFO] Skipping because packaging 'maven-plugin' is not pom.
[INFO]
[INFO] --- maven-invoker-plugin:3.2.1:install (integration-test) @ resolver-demo-maven-plugin ---
[INFO] Downloading from central: https://repo.maven.apache.org/maven2/org/apache/maven/shared/maven-invoker/3.0.1/maven-invoker-3.0.1.pom
[INFO] Downloaded from central: https://repo.maven.apache.org/maven2/org/apache/maven/shared/maven-invoker/3.0.1/maven-invoker-3.0.1.pom (4.9 kB at 168 kB/s)
[INFO] Downloading from central: https://repo.maven.apache.org/maven2/org/apache/maven/shared/maven-shared-components/31/maven-shared-components-31.pom
[INFO] Downloaded from central: https://repo.maven.apache.org/maven2/org/apache/maven/shared/maven-shared-components/31/maven-shared-components-31.pom (5.1 kB at 160 kB/s)
[INFO] Downloading from central: https://repo.maven.apache.org/maven2/org/apache/maven/reporting/maven-reporting-impl/2.4/maven-reporting-impl-2.4.pom
[INFO] Downloaded from central: https://repo.maven.apache.org/maven2/org/apache/maven/reporting/maven-reporting-impl/2.4/maven-reporting-impl-2.4.pom (6.1 kB at 242 kB/s)
[INFO] Downloading from central: https://repo.maven.apache.org/maven2/commons-validator/commons-validator/1.4.1/commons-validator-1.4.1.pom
[INFO] Downloaded from central: https://repo.maven.apache.org/maven2/commons-validator/commons-validator/1.4.1/commons-validator-1.4.1.pom (13 kB at 507 kB/s)
[INFO] Downloading from central: https://repo.maven.apache.org/maven2/org/apache/commons/commons-parent/36/commons-parent-36.pom
[INFO] Downloaded from central: https://repo.maven.apache.org/maven2/org/apache/commons/commons-parent/36/commons-parent-36.pom (58 kB at 2.2 MB/s)
[INFO] Downloading from central: https://repo.maven.apache.org/maven2/commons-beanutils/commons-beanutils/1.8.3/commons-beanutils-1.8.3.pom
[INFO] Downloaded from central: https://repo.maven.apache.org/maven2/commons-beanutils/commons-beanutils/1.8.3/commons-beanutils-1.8.3.pom (11 kB at 467 kB/s)
[INFO] Downloading from central: https://repo.maven.apache.org/maven2/org/apache/commons/commons-parent/14/commons-parent-14.pom
[INFO] Downloaded from central: https://repo.maven.apache.org/maven2/org/apache/commons/commons-parent/14/commons-parent-14.pom (31 kB at 1.3 MB/s)
[INFO] Downloading from central: https://repo.maven.apache.org/maven2/commons-digester/commons-digester/1.8.1/commons-digester-1.8.1.pom
[INFO] Downloaded from central: https://repo.maven.apache.org/maven2/commons-digester/commons-digester/1.8.1/commons-digester-1.8.1.pom (10 kB at 386 kB/s)
[INFO] Downloading from central: https://repo.maven.apache.org/maven2/org/apache/maven/shared/maven-script-interpreter/1.2/maven-script-interpreter-1.2.pom
[INFO] Downloaded from central: https://repo.maven.apache.org/maven2/org/apache/maven/shared/maven-script-interpreter/1.2/maven-script-interpreter-1.2.pom (4.0 kB at 174 kB/s)
[INFO] Downloading from central: https://repo.maven.apache.org/maven2/org/apache/maven/maven-plugin-api/2.0.6/maven-plugin-api-2.0.6.pom
[INFO] Downloaded from central: https://repo.maven.apache.org/maven2/org/apache/maven/maven-plugin-api/2.0.6/maven-plugin-api-2.0.6.pom (1.5 kB at 66 kB/s)
[INFO] Downloading from central: https://repo.maven.apache.org/maven2/org/apache/maven/maven/2.0.6/maven-2.0.6.pom
[INFO] Downloaded from central: https://repo.maven.apache.org/maven2/org/apache/maven/maven/2.0.6/maven-2.0.6.pom (9.0 kB at 411 kB/s)
[INFO] Downloading from central: https://repo.maven.apache.org/maven2/org/apache/maven/maven-parent/5/maven-parent-5.pom
[INFO] Downloaded from central: https://repo.maven.apache.org/maven2/org/apache/maven/maven-parent/5/maven-parent-5.pom (15 kB at 693 kB/s)
[INFO] Downloading from central: https://repo.maven.apache.org/maven2/org/apache/ant/ant/1.8.1/ant-1.8.1.pom
[INFO] Downloaded from central: https://repo.maven.apache.org/maven2/org/apache/ant/ant/1.8.1/ant-1.8.1.pom (8.8 kB at 400 kB/s)
[INFO] Downloading from central: https://repo.maven.apache.org/maven2/org/apache/ant/ant-parent/1.8.1/ant-parent-1.8.1.pom
[INFO] Downloaded from central: https://repo.maven.apache.org/maven2/org/apache/ant/ant-parent/1.8.1/ant-parent-1.8.1.pom (4.3 kB at 186 kB/s)
[INFO] Downloading from central: https://repo.maven.apache.org/maven2/org/apache/maven/shared/maven-artifact-transfer/0.11.0/maven-artifact-transfer-0.11.0.pom
[INFO] Downloaded from central: https://repo.maven.apache.org/maven2/org/apache/maven/shared/maven-artifact-transfer/0.11.0/maven-artifact-transfer-0.11.0.pom (11 kB at 424 kB/s)
[INFO] Downloading from central: https://repo.maven.apache.org/maven2/org/apache/maven/shared/maven-common-artifact-filters/3.0.1/maven-common-artifact-filters-3.0.1.pom
[INFO] Downloaded from central: https://repo.maven.apache.org/maven2/org/apache/maven/shared/maven-common-artifact-filters/3.0.1/maven-common-artifact-filters-3.0.1.pom (4.8 kB at 179 kB/s)
[INFO] Downloading from central: https://repo.maven.apache.org/maven2/org/codehaus/plexus/plexus-utils/3.1.1/plexus-utils-3.1.1.pom
[INFO] Downloaded from central: https://repo.maven.apache.org/maven2/org/codehaus/plexus/plexus-utils/3.1.1/plexus-utils-3.1.1.pom (5.1 kB at 195 kB/s)
[INFO] Downloading from central: https://repo.maven.apache.org/maven2/org/apache/maven/doxia/doxia-sink-api/1.7/doxia-sink-api-1.7.pom
[INFO] Downloaded from central: https://repo.maven.apache.org/maven2/org/apache/maven/doxia/doxia-sink-api/1.7/doxia-sink-api-1.7.pom (1.5 kB at 57 kB/s)
[INFO] Downloading from central: https://repo.maven.apache.org/maven2/org/apache/maven/doxia/doxia/1.7/doxia-1.7.pom
[INFO] Downloaded from central: https://repo.maven.apache.org/maven2/org/apache/maven/doxia/doxia/1.7/doxia-1.7.pom (15 kB at 565 kB/s)
[INFO] Downloading from central: https://repo.maven.apache.org/maven2/org/apache/maven/doxia/doxia-logging-api/1.7/doxia-logging-api-1.7.pom
[INFO] Downloaded from central: https://repo.maven.apache.org/maven2/org/apache/maven/doxia/doxia-logging-api/1.7/doxia-logging-api-1.7.pom (1.5 kB at 85 kB/s)
[INFO] Downloading from central: https://repo.maven.apache.org/maven2/org/apache/maven/doxia/doxia-site-renderer/1.7.4/doxia-site-renderer-1.7.4.pom
[INFO] Downloaded from central: https://repo.maven.apache.org/maven2/org/apache/maven/doxia/doxia-site-renderer/1.7.4/doxia-site-renderer-1.7.4.pom (6.7 kB at 248 kB/s)
[INFO] Downloading from central: https://repo.maven.apache.org/maven2/org/apache/maven/doxia/doxia-sitetools/1.7.4/doxia-sitetools-1.7.4.pom
[INFO] Downloaded from central: https://repo.maven.apache.org/maven2/org/apache/maven/doxia/doxia-sitetools/1.7.4/doxia-sitetools-1.7.4.pom (14 kB at 537 kB/s)
[INFO] Downloading from central: https://repo.maven.apache.org/maven2/org/apache/maven/doxia/doxia-core/1.7/doxia-core-1.7.pom
[INFO] Downloaded from central: https://repo.maven.apache.org/maven2/org/apache/maven/doxia/doxia-core/1.7/doxia-core-1.7.pom (4.1 kB at 150 kB/s)
[INFO] Downloading from central: https://repo.maven.apache.org/maven2/org/apache/maven/doxia/doxia-decoration-model/1.7.4/doxia-decoration-model-1.7.4.pom
[INFO] Downloaded from central: https://repo.maven.apache.org/maven2/org/apache/maven/doxia/doxia-decoration-model/1.7.4/doxia-decoration-model-1.7.4.pom (3.4 kB at 136 kB/s)
[INFO] Downloading from central: https://repo.maven.apache.org/maven2/org/apache/maven/doxia/doxia-skin-model/1.7.4/doxia-skin-model-1.7.4.pom
[INFO] Downloaded from central: https://repo.maven.apache.org/maven2/org/apache/maven/doxia/doxia-skin-model/1.7.4/doxia-skin-model-1.7.4.pom (3.0 kB at 126 kB/s)
[INFO] Downloading from central: https://repo.maven.apache.org/maven2/org/apache/maven/doxia/doxia-module-xhtml/1.7/doxia-module-xhtml-1.7.pom
[INFO] Downloaded from central: https://repo.maven.apache.org/maven2/org/apache/maven/doxia/doxia-module-xhtml/1.7/doxia-module-xhtml-1.7.pom (1.6 kB at 71 kB/s)
[INFO] Downloading from central: https://repo.maven.apache.org/maven2/org/apache/maven/doxia/doxia-modules/1.7/doxia-modules-1.7.pom
[INFO] Downloaded from central: https://repo.maven.apache.org/maven2/org/apache/maven/doxia/doxia-modules/1.7/doxia-modules-1.7.pom (2.6 kB at 101 kB/s)
[INFO] Downloading from central: https://repo.maven.apache.org/maven2/org/codehaus/groovy/groovy-all/2.4.8/groovy-all-2.4.8.pom
[INFO] Downloaded from central: https://repo.maven.apache.org/maven2/org/codehaus/groovy/groovy-all/2.4.8/groovy-all-2.4.8.pom (21 kB at 855 kB/s)
[INFO] Downloading from central: https://repo.maven.apache.org/maven2/org/codehaus/plexus/plexus-interpolation/1.26/plexus-interpolation-1.26.pom
[INFO] Downloaded from central: https://repo.maven.apache.org/maven2/org/codehaus/plexus/plexus-interpolation/1.26/plexus-interpolation-1.26.pom (2.7 kB at 95 kB/s)
[INFO] Downloading from central: https://repo.maven.apache.org/maven2/org/apache/maven/shared/maven-invoker/3.0.1/maven-invoker-3.0.1.jar
[INFO] Downloading from central: https://repo.maven.apache.org/maven2/commons-digester/commons-digester/1.8.1/commons-digester-1.8.1.jar
[INFO] Downloading from central: https://repo.maven.apache.org/maven2/commons-beanutils/commons-beanutils/1.8.3/commons-beanutils-1.8.3.jar
[INFO] Downloading from central: https://repo.maven.apache.org/maven2/commons-validator/commons-validator/1.4.1/commons-validator-1.4.1.jar
[INFO] Downloading from central: https://repo.maven.apache.org/maven2/org/apache/maven/reporting/maven-reporting-impl/2.4/maven-reporting-impl-2.4.jar
[INFO] Downloaded from central: https://repo.maven.apache.org/maven2/org/apache/maven/reporting/maven-reporting-impl/2.4/maven-reporting-impl-2.4.jar (20 kB at 188 kB/s)
[INFO] Downloaded from central: https://repo.maven.apache.org/maven2/org/apache/maven/shared/maven-invoker/3.0.1/maven-invoker-3.0.1.jar (33 kB at 309 kB/s)
[INFO] Downloaded from central: https://repo.maven.apache.org/maven2/commons-digester/commons-digester/1.8.1/commons-digester-1.8.1.jar (146 kB at 1.4 MB/s)
[INFO] Downloading from central: https://repo.maven.apache.org/maven2/commons-logging/commons-logging/1.2/commons-logging-1.2.jar
[INFO] Downloading from central: https://repo.maven.apache.org/maven2/org/apache/ant/ant/1.8.1/ant-1.8.1.jar
[INFO] Downloading from central: https://repo.maven.apache.org/maven2/org/apache/maven/shared/maven-script-interpreter/1.2/maven-script-interpreter-1.2.jar
[INFO] Downloaded from central: https://repo.maven.apache.org/maven2/commons-validator/commons-validator/1.4.1/commons-validator-1.4.1.jar (190 kB at 1.7 MB/s)
[INFO] Downloaded from central: https://repo.maven.apache.org/maven2/commons-beanutils/commons-beanutils/1.8.3/commons-beanutils-1.8.3.jar (232 kB at 2.1 MB/s)
[INFO] Downloading from central: https://repo.maven.apache.org/maven2/org/apache/maven/shared/maven-artifact-transfer/0.11.0/maven-artifact-transfer-0.11.0.jar
[INFO] Downloading from central: https://repo.maven.apache.org/maven2/org/apache/maven/shared/maven-common-artifact-filters/3.0.1/maven-common-artifact-filters-3.0.1.jar
[INFO] Downloaded from central: https://repo.maven.apache.org/maven2/org/apache/maven/shared/maven-script-interpreter/1.2/maven-script-interpreter-1.2.jar (22 kB at 154 kB/s)
[INFO] Downloaded from central: https://repo.maven.apache.org/maven2/commons-logging/commons-logging/1.2/commons-logging-1.2.jar (62 kB at 429 kB/s)
[INFO] Downloading from central: https://repo.maven.apache.org/maven2/org/apache/maven/doxia/doxia-sink-api/1.7/doxia-sink-api-1.7.jar
[INFO] Downloading from central: https://repo.maven.apache.org/maven2/org/apache/maven/doxia/doxia-logging-api/1.7/doxia-logging-api-1.7.jar
[INFO] Downloaded from central: https://repo.maven.apache.org/maven2/org/apache/maven/shared/maven-common-artifact-filters/3.0.1/maven-common-artifact-filters-3.0.1.jar (61 kB at 412 kB/s)
[INFO] Downloading from central: https://repo.maven.apache.org/maven2/org/apache/maven/doxia/doxia-site-renderer/1.7.4/doxia-site-renderer-1.7.4.jar
[INFO] Downloaded from central: https://repo.maven.apache.org/maven2/org/apache/maven/shared/maven-artifact-transfer/0.11.0/maven-artifact-transfer-0.11.0.jar (128 kB at 841 kB/s)
[INFO] Downloading from central: https://repo.maven.apache.org/maven2/org/apache/maven/doxia/doxia-decoration-model/1.7.4/doxia-decoration-model-1.7.4.jar
[INFO] Downloaded from central: https://repo.maven.apache.org/maven2/org/apache/maven/doxia/doxia-logging-api/1.7/doxia-logging-api-1.7.jar (12 kB at 65 kB/s)
[INFO] Downloaded from central: https://repo.maven.apache.org/maven2/org/apache/maven/doxia/doxia-sink-api/1.7/doxia-sink-api-1.7.jar (11 kB at 64 kB/s)
[INFO] Downloading from central: https://repo.maven.apache.org/maven2/org/apache/maven/doxia/doxia-skin-model/1.7.4/doxia-skin-model-1.7.4.jar
[INFO] Downloading from central: https://repo.maven.apache.org/maven2/org/apache/maven/doxia/doxia-module-xhtml/1.7/doxia-module-xhtml-1.7.jar
[INFO] Downloaded from central: https://repo.maven.apache.org/maven2/org/apache/ant/ant/1.8.1/ant-1.8.1.jar (1.5 MB at 8.2 MB/s)
[INFO] Downloaded from central: https://repo.maven.apache.org/maven2/org/apache/maven/doxia/doxia-site-renderer/1.7.4/doxia-site-renderer-1.7.4.jar (64 kB at 346 kB/s)
[INFO] Downloaded from central: https://repo.maven.apache.org/maven2/org/apache/maven/doxia/doxia-decoration-model/1.7.4/doxia-decoration-model-1.7.4.jar (61 kB at 328 kB/s)
[INFO] Downloading from central: https://repo.maven.apache.org/maven2/org/codehaus/plexus/plexus-interpolation/1.26/plexus-interpolation-1.26.jar
[INFO] Downloading from central: https://repo.maven.apache.org/maven2/org/codehaus/groovy/groovy-all/2.4.8/groovy-all-2.4.8.jar
[INFO] Downloaded from central: https://repo.maven.apache.org/maven2/org/apache/maven/doxia/doxia-module-xhtml/1.7/doxia-module-xhtml-1.7.jar (17 kB at 82 kB/s)
[INFO] Downloaded from central: https://repo.maven.apache.org/maven2/org/apache/maven/doxia/doxia-skin-model/1.7.4/doxia-skin-model-1.7.4.jar (16 kB at 75 kB/s)
[INFO] Downloaded from central: https://repo.maven.apache.org/maven2/org/codehaus/plexus/plexus-interpolation/1.26/plexus-interpolation-1.26.jar (85 kB at 379 kB/s)
[INFO] Downloaded from central: https://repo.maven.apache.org/maven2/org/codehaus/groovy/groovy-all/2.4.8/groovy-all-2.4.8.jar (7.0 MB at 19 MB/s)
[INFO] Installing F:\jenkins\jenkins-slave\712657a4\workspace\_maven-box_maven-resolver_master@2\m\maven-resolver-api\pom.xml to F:\jenkins\jenkins-slave\712657a4\workspace\_maven-box_maven-resolver_master@2\m\maven-resolver-demos\maven-resolver-demo-maven-plugin\target\local-repo\org\apache\maven\resolver\maven-resolver-api\1.7.0-SNAPSHOT\maven-resolver-api-1.7.0-SNAPSHOT.pom
[INFO] Installing F:\jenkins\jenkins-slave\712657a4\workspace\_maven-box_maven-resolver_master@2\m\maven-resolver-api\target\maven-resolver-api-1.7.0-SNAPSHOT.jar to F:\jenkins\jenkins-slave\712657a4\workspace\_maven-box_maven-resolver_master@2\m\maven-resolver-demos\maven-resolver-demo-maven-plugin\target\local-repo\org\apache\maven\resolver\maven-resolver-api\1.7.0-SNAPSHOT\maven-resolver-api-1.7.0-SNAPSHOT.jar
[INFO] Installing f:\jenkins\jenkins-slave\712657a4\workspace\_maven-box_maven-resolver_master@2\m\pom.xml to F:\jenkins\jenkins-slave\712657a4\workspace\_maven-box_maven-resolver_master@2\m\maven-resolver-demos\maven-resolver-demo-maven-plugin\target\local-repo\org\apache\maven\resolver\maven-resolver\1.7.0-SNAPSHOT\maven-resolver-1.7.0-SNAPSHOT.pom
[INFO] Installing F:\jenkins\jenkins-slave\712657a4\workspace\_maven-box_maven-resolver_master@2\m\maven-resolver-demos\pom.xml to F:\jenkins\jenkins-slave\712657a4\workspace\_maven-box_maven-resolver_master@2\m\maven-resolver-demos\maven-resolver-demo-maven-plugin\target\local-repo\org\apache\maven\resolver\maven-resolver-demos\1.7.0-SNAPSHOT\maven-resolver-demos-1.7.0-SNAPSHOT.pom
[INFO] Installing F:\jenkins\jenkins-slave\712657a4\workspace\_maven-box_maven-resolver_master@2\m\maven-resolver-demos\maven-resolver-demo-maven-plugin\pom.xml to F:\jenkins\jenkins-slave\712657a4\workspace\_maven-box_maven-resolver_master@2\m\maven-resolver-demos\maven-resolver-demo-maven-plugin\target\local-repo\org\apache\maven\resolver\resolver-demo-maven-plugin\1.7.0-SNAPSHOT\resolver-demo-maven-plugin-1.7.0-SNAPSHOT.pom
[INFO] Installing F:\jenkins\jenkins-slave\712657a4\workspace\_maven-box_maven-resolver_master@2\m\maven-resolver-demos\maven-resolver-demo-maven-plugin\target\resolver-demo-maven-plugin-1.7.0-SNAPSHOT.jar to F:\jenkins\jenkins-slave\712657a4\workspace\_maven-box_maven-resolver_master@2\m\maven-resolver-demos\maven-resolver-demo-maven-plugin\target\local-repo\org\apache\maven\resolver\resolver-demo-maven-plugin\1.7.0-SNAPSHOT\resolver-demo-maven-plugin-1.7.0-SNAPSHOT.jar
[INFO]
[INFO] --- maven-invoker-plugin:3.2.1:run (integration-test) @ resolver-demo-maven-plugin ---
[INFO] Building: resolve-artifact\pom.xml
[INFO]           resolve-artifact\pom.xml ......................... SUCCESS (4.5 s)
[INFO] -------------------------------------------------
[INFO] Build Summary:
[INFO]   Passed: 1, Failed: 0, Errors: 0, Skipped: 0
[INFO] -------------------------------------------------
[INFO]
[INFO] --- maven-checkstyle-plugin:3.0.0:check (checkstyle-check) @ resolver-demo-maven-plugin ---
[INFO] ------------------------------------------------------------------------
[INFO] Reactor Summary for Maven Artifact Resolver 1.7.0-SNAPSHOT:
[INFO]
[INFO] Maven Artifact Resolver ............................ SUCCESS [ 42.737 s]
[INFO] Maven Artifact Resolver API ........................ SUCCESS [ 22.170 s]
[INFO] Maven Artifact Resolver SPI ........................ SUCCESS [  3.603 s]
[INFO] Maven Artifact Resolver Test Utilities ............. SUCCESS [  4.198 s]
[INFO] Maven Artifact Resolver Utilities .................. SUCCESS [ 10.929 s]
[INFO] Maven Artifact Resolver Implementation ............. SUCCESS [ 26.745 s]
[INFO] Maven Artifact Resolver Connector Basic ............ SUCCESS [  9.174 s]
[INFO] Maven Artifact Resolver Transport Classpath ........ SUCCESS [  3.319 s]
[INFO] Maven Artifact Resolver Transport File ............. SUCCESS [  3.926 s]
[INFO] Maven Artifact Resolver Transport HTTP ............. SUCCESS [ 10.634 s]
[INFO] Maven Artifact Resolver Transport Wagon ............ SUCCESS [  6.859 s]
[INFO] Maven Artifact Resolver Sync Context Global ........ SUCCESS [  1.494 s]
[INFO] Maven Artifact Resolver Sync Context Redisson ...... SUCCESS [  6.671 s]
[INFO] Maven Artifact Resolver Demos ...................... SUCCESS [  1.142 s]
[INFO] Maven Artifact Resolver Demo Snippets .............. SUCCESS [  3.967 s]
[INFO] Maven Artifact Resolver Demo Maven Plugin .......... SUCCESS [ 12.431 s]
[INFO] ------------------------------------------------------------------------
[INFO] BUILD SUCCESS
[INFO] ------------------------------------------------------------------------
[INFO] Total time:  02:51 min
[INFO] Finished at: 2020-12-28T02:37:20-08:00
[INFO] ------------------------------------------------------------------------
[INFO] [jenkins-event-spy] Generated F:\jenkins\jenkins-slave\712657a4\workspace\_maven-box_maven-resolver_master@2@tmp\withMavenbd8fe234\maven-spy-20201228-023428-540273326530979761948.log
[Pipeline] }
[Pipeline] // dir
[Pipeline] }
[withMaven] openTasksPublisher - Scan Tasks for Maven artifact org.apache.maven.resolver:maven-resolver-api:jar:1.7.0-SNAPSHOT in source directory m/maven-resolver-api/src/main/java
[withMaven] openTasksPublisher - Scan Tasks for Maven artifact org.apache.maven.resolver:maven-resolver-spi:jar:1.7.0-SNAPSHOT in source directory m/maven-resolver-spi/src/main/java
[withMaven] junitPublisher - Archive test results for Maven artifact org.apache.maven.resolver:maven-resolver-api:jar:1.7.0-SNAPSHOT generated by maven-surefire-plugin:test (default-test): m\maven-resolver-api\target\surefire-reports\*.xml
[withMaven] junitPublisher - Archive test results for Maven artifact org.apache.maven.resolver:maven-resolver-spi:jar:1.7.0-SNAPSHOT generated by maven-surefire-plugin:test (default-test): m\maven-resolver-spi\target\surefire-reports\*.xml
[withMaven] junitPublisher - Archive test results for Maven artifact org.apache.maven.resolver:maven-resolver-test-util:jar:1.7.0-SNAPSHOT generated by maven-surefire-plugin:test (default-test): m\maven-resolver-test-util\target\surefire-reports\*.xml
[withMaven] junitPublisher - Archive test results for Maven artifact org.apache.maven.resolver:maven-resolver-util:jar:1.7.0-SNAPSHOT generated by maven-surefire-plugin:test (default-test): m\maven-resolver-util\target\surefire-reports\*.xml
[withMaven] junitPublisher - Archive test results for Maven artifact org.apache.maven.resolver:maven-resolver-impl:jar:1.7.0-SNAPSHOT generated by maven-surefire-plugin:test (default-test): m\maven-resolver-impl\target\surefire-reports\*.xml
[withMaven] junitPublisher - Archive test results for Maven artifact org.apache.maven.resolver:maven-resolver-connector-basic:jar:1.7.0-SNAPSHOT generated by maven-surefire-plugin:test (default-test): m\maven-resolver-connector-basic\target\surefire-reports\*.xml
[withMaven] junitPublisher - Archive test results for Maven artifact org.apache.maven.resolver:maven-resolver-transport-classpath:jar:1.7.0-SNAPSHOT generated by maven-surefire-plugin:test (default-test): m\maven-resolver-transport-classpath\target\surefire-reports\*.xml
[withMaven] junitPublisher - Archive test results for Maven artifact org.apache.maven.resolver:maven-resolver-transport-file:jar:1.7.0-SNAPSHOT generated by maven-surefire-plugin:test (default-test): m\maven-resolver-transport-file\target\surefire-reports\*.xml
[withMaven] junitPublisher - Archive test results for Maven artifact org.apache.maven.resolver:maven-resolver-transport-http:jar:1.7.0-SNAPSHOT generated by maven-surefire-plugin:test (default-test): m\maven-resolver-transport-http\target\surefire-reports\*.xml
[withMaven] junitPublisher - Archive test results for Maven artifact org.apache.maven.resolver:maven-resolver-transport-wagon:jar:1.7.0-SNAPSHOT generated by maven-surefire-plugin:test (default-test): m\maven-resolver-transport-wagon\target\surefire-reports\*.xml
[withMaven] junitPublisher - Archive test results for Maven artifact org.apache.maven.resolver:maven-resolver-synccontext-global:jar:1.7.0-SNAPSHOT generated by maven-surefire-plugin:test (default-test): m\maven-resolver-synccontext-global\target\surefire-reports\*.xml
[withMaven] junitPublisher - Archive test results for Maven artifact org.apache.maven.resolver:maven-resolver-synccontext-redisson:jar:1.7.0-SNAPSHOT generated by maven-surefire-plugin:test (default-test): m\maven-resolver-synccontext-redisson\target\surefire-reports\*.xml
[withMaven] junitPublisher - Archive test results for Maven artifact org.apache.maven.resolver:maven-resolver-demo-snippets:jar:1.7.0-SNAPSHOT generated by maven-surefire-plugin:test (default-test): m\maven-resolver-demos\maven-resolver-demo-snippets\target\surefire-reports\*.xml
[withMaven] junitPublisher - Archive test results for Maven artifact org.apache.maven.resolver:resolver-demo-maven-plugin:maven-plugin:1.7.0-SNAPSHOT generated by maven-surefire-plugin:test (default-test): m\maven-resolver-demos\maven-resolver-demo-maven-plugin\target\surefire-reports\*.xml
Recording test results
[withMaven] openTasksPublisher - Scan Tasks for Maven artifact org.apache.maven.resolver:maven-resolver-test-util:jar:1.7.0-SNAPSHOT in source directory m/maven-resolver-test-util/src/main/java
[withMaven] openTasksPublisher - Scan Tasks for Maven artifact org.apache.maven.resolver:maven-resolver-util:jar:1.7.0-SNAPSHOT in source directory m/maven-resolver-util/src/main/java
[withMaven] openTasksPublisher - Scan Tasks for Maven artifact org.apache.maven.resolver:maven-resolver-impl:jar:1.7.0-SNAPSHOT in source directory m/maven-resolver-impl/src/main/java
[withMaven] openTasksPublisher - Scan Tasks for Maven artifact org.apache.maven.resolver:maven-resolver-connector-basic:jar:1.7.0-SNAPSHOT in source directory m/maven-resolver-connector-basic/src/main/java
[withMaven] openTasksPublisher - Scan Tasks for Maven artifact org.apache.maven.resolver:maven-resolver-transport-classpath:jar:1.7.0-SNAPSHOT in source directory m/maven-resolver-transport-classpath/src/main/java
[withMaven] openTasksPublisher - Scan Tasks for Maven artifact org.apache.maven.resolver:maven-resolver-transport-file:jar:1.7.0-SNAPSHOT in source directory m/maven-resolver-transport-file/src/main/java
[withMaven] openTasksPublisher - Scan Tasks for Maven artifact org.apache.maven.resolver:maven-resolver-transport-http:jar:1.7.0-SNAPSHOT in source directory m/maven-resolver-transport-http/src/main/java
[withMaven] openTasksPublisher - Scan Tasks for Maven artifact org.apache.maven.resolver:maven-resolver-transport-wagon:jar:1.7.0-SNAPSHOT in source directory m/maven-resolver-transport-wagon/src/main/java
[withMaven] openTasksPublisher - Scan Tasks for Maven artifact org.apache.maven.resolver:maven-resolver-synccontext-global:jar:1.7.0-SNAPSHOT in source directory m/maven-resolver-synccontext-global/src/main/java
[withMaven] openTasksPublisher - Scan Tasks for Maven artifact org.apache.maven.resolver:maven-resolver-synccontext-redisson:jar:1.7.0-SNAPSHOT in source directory m/maven-resolver-synccontext-redisson/src/main/java
[withMaven] openTasksPublisher - Scan Tasks for Maven artifact org.apache.maven.resolver:maven-resolver-demo-snippets:jar:1.7.0-SNAPSHOT in source directory m/maven-resolver-demos/maven-resolver-demo-snippets/src/main/java
[withMaven] openTasksPublisher - Scan Tasks for Maven artifact org.apache.maven.resolver:resolver-demo-maven-plugin:maven-plugin:1.7.0-SNAPSHOT in source directory m/maven-resolver-demos/maven-resolver-demo-maven-plugin/src/main/java
[TASKS] Scanning folder '/home/jenkins/workspace/_maven-box_maven-resolver_master@2' for files matching the pattern 'm/maven-resolver-api/src/main/java/**/*,m/maven-resolver-spi/src/main/java/**/*,m/maven-resolver-test-util/src/main/java/**/*,m/maven-resolver-util/src/main/java/**/*,m/maven-resolver-impl/src/main/java/**/*,m/maven-resolver-connector-basic/src/main/java/**/*,m/maven-resolver-transport-classpath/src/main/java/**/*,m/maven-resolver-transport-file/src/main/java/**/*,m/maven-resolver-transport-http/src/main/java/**/*,m/maven-resolver-transport-wagon/src/main/java/**/*,m/maven-resolver-synccontext-global/src/main/java/**/*,m/maven-resolver-synccontext-redisson/src/main/java/**/*,m/maven-resolver-demos/maven-resolver-demo-snippets/src/main/java/**/*,m/maven-resolver-demos/maven-resolver-demo-maven-plugin/src/main/java/**/*' - excludes: null
[TASKS] Found 415 files to scan for tasks
[TASKS] Found 4 open tasks.
Skipping warnings blame since pipelines do not have an SCM link.%n
[TASKS] Computing warning deltas based on reference build #44
[withMaven] Publishers: Junit Publisher: 11100 ms
[Pipeline] // withMaven
[Pipeline] cleanWs
[WS-CLEANUP] Deleting project workspace...
[WS-CLEANUP] Deferred wipeout is used...
[WS-CLEANUP] done
[Pipeline] }
[Pipeline] // stage
[Pipeline] }
[Pipeline] // ws
[Pipeline] }
[Pipeline] // withEnv
[Pipeline] }
[Pipeline] // node
[Pipeline] }
[withMaven] Publishers: Generated Artifacts Publisher: 14958 ms, Junit Publisher: 59960 ms, Open Task Scanner Publisher: 3656 ms, Dependencies Fingerprint Publisher: 12390 ms, Pipeline Graph Publisher: 8 ms
[Pipeline] // withMaven
[Pipeline] cleanWs
[WS-CLEANUP] Deleting project workspace...
[WS-CLEANUP] Deferred wipeout is used...
[WS-CLEANUP] done
[Pipeline] }
[Pipeline] // stage
[Pipeline] }
[Pipeline] // ws
[Pipeline] }
[Pipeline] // withEnv
[Pipeline] }
[Pipeline] // node
[Pipeline] }
[Pipeline] // parallel
[Pipeline] echo
[FAILURE-003] AbortException hudson.AbortException: script returned exit code 1
[Pipeline] stage
[Pipeline] { (Notifications)
[Pipeline] echo
Build result: FAILURE
[Pipeline] jiraIssueSelector
[Pipeline] jiraComment
[Pipeline] echo
The authors of changes [tamas].
[Pipeline] echo
Sending email ...
[Pipeline] emailext
Reply | Threaded
Open this post in threaded view
|

Build succeeded in Jenkins: Maven » Maven TLP » maven-resolver » master #46

Apache Jenkins Server-2
See https://ci-builds.apache.org/job/Maven/job/maven-box/job/maven-resolver/job/master/46/

Changes:

* Next Maven version change 3.7.x -> 4.x.x
* Added Java 17

All tests passed