Build failed in Jenkins: Maven » Maven TLP » maven-resolver » master #21

Previous Topic Next Topic
 
classic Classic list List threaded Threaded
2 messages Options
Reply | Threaded
Open this post in threaded view
|

Build failed in Jenkins: Maven » Maven TLP » maven-resolver » master #21

Apache Jenkins Server-2
See https://ci-builds.apache.org/job/Maven/job/maven-box/job/maven-resolver/job/master/21/

Changes:

* [maven-release-plugin] prepare release maven-resolver-1.6.0

All tests passed

Build log:
[...truncated 18398 lines...]
[INFO] --- maven-compiler-plugin:3.8.1:testCompile (default-testCompile) @ maven-resolver-synccontext-global ---
[INFO] No sources to compile
[INFO]
[INFO] --- maven-surefire-plugin:2.22.0:test (default-test) @ maven-resolver-synccontext-global ---
[INFO]
[INFO] --- maven-jar-plugin:3.2.0:jar (default-jar) @ maven-resolver-synccontext-global ---
[INFO] Building jar: F:\jenkins\jenkins-slave\712657a4\workspace\_maven-box_maven-resolver_master\m\maven-resolver-synccontext-global\target\maven-resolver-synccontext-global-1.6.0.jar
[INFO]
[INFO] --- maven-site-plugin:3.7.1:attach-descriptor (attach-descriptor) @ maven-resolver-synccontext-global ---
[INFO] Skipping because packaging 'jar' is not pom.
[INFO]
[INFO] --- maven-checkstyle-plugin:3.0.0:check (checkstyle-check) @ maven-resolver-synccontext-global ---
[INFO]
[INFO] ---< org.apache.maven.resolver:maven-resolver-synccontext-redisson >----
[INFO] Building Maven Artifact Resolver Sync Context Redisson 1.6.0     [16/16]
[INFO] --------------------------------[ jar ]---------------------------------
[INFO] Downloading from central: https://repo.maven.apache.org/maven2/org/redisson/redisson/3.13.3/redisson-3.13.3.pom
[INFO] Downloaded from central: https://repo.maven.apache.org/maven2/org/redisson/redisson/3.13.3/redisson-3.13.3.pom (21 kB at 710 kB/s)
[INFO] Downloading from central: https://repo.maven.apache.org/maven2/org/redisson/redisson-parent/3.13.3/redisson-parent-3.13.3.pom
[INFO] Downloaded from central: https://repo.maven.apache.org/maven2/org/redisson/redisson-parent/3.13.3/redisson-parent-3.13.3.pom (12 kB at 534 kB/s)
[INFO] Downloading from central: https://repo.maven.apache.org/maven2/io/netty/netty-bom/4.1.51.Final/netty-bom-4.1.51.Final.pom
[INFO] Downloaded from central: https://repo.maven.apache.org/maven2/io/netty/netty-bom/4.1.51.Final/netty-bom-4.1.51.Final.pom (8.8 kB at 313 kB/s)
[INFO] Downloading from central: https://repo.maven.apache.org/maven2/com/fasterxml/jackson/jackson-bom/2.11.1/jackson-bom-2.11.1.pom
[INFO] Downloaded from central: https://repo.maven.apache.org/maven2/com/fasterxml/jackson/jackson-bom/2.11.1/jackson-bom-2.11.1.pom (13 kB at 455 kB/s)
[INFO] Downloading from central: https://repo.maven.apache.org/maven2/com/fasterxml/jackson/jackson-parent/2.11/jackson-parent-2.11.pom
[INFO] Downloaded from central: https://repo.maven.apache.org/maven2/com/fasterxml/jackson/jackson-parent/2.11/jackson-parent-2.11.pom (7.8 kB at 277 kB/s)
[INFO] Downloading from central: https://repo.maven.apache.org/maven2/com/fasterxml/oss-parent/38/oss-parent-38.pom
[INFO] Downloaded from central: https://repo.maven.apache.org/maven2/com/fasterxml/oss-parent/38/oss-parent-38.pom (23 kB at 1.0 MB/s)
[INFO] Downloading from central: https://repo.maven.apache.org/maven2/io/netty/netty-common/4.1.51.Final/netty-common-4.1.51.Final.pom
[INFO] Downloaded from central: https://repo.maven.apache.org/maven2/io/netty/netty-common/4.1.51.Final/netty-common-4.1.51.Final.pom (10 kB at 399 kB/s)
[INFO] Downloading from central: https://repo.maven.apache.org/maven2/io/netty/netty-parent/4.1.51.Final/netty-parent-4.1.51.Final.pom
[INFO] Downloaded from central: https://repo.maven.apache.org/maven2/io/netty/netty-parent/4.1.51.Final/netty-parent-4.1.51.Final.pom (58 kB at 2.2 MB/s)
[INFO] Downloading from central: https://repo.maven.apache.org/maven2/io/netty/netty-codec/4.1.51.Final/netty-codec-4.1.51.Final.pom
[INFO] Downloaded from central: https://repo.maven.apache.org/maven2/io/netty/netty-codec/4.1.51.Final/netty-codec-4.1.51.Final.pom (3.6 kB at 143 kB/s)
[INFO] Downloading from central: https://repo.maven.apache.org/maven2/io/netty/netty-buffer/4.1.51.Final/netty-buffer-4.1.51.Final.pom
[INFO] Downloaded from central: https://repo.maven.apache.org/maven2/io/netty/netty-buffer/4.1.51.Final/netty-buffer-4.1.51.Final.pom (1.6 kB at 66 kB/s)
[INFO] Downloading from central: https://repo.maven.apache.org/maven2/io/netty/netty-transport/4.1.51.Final/netty-transport-4.1.51.Final.pom
[INFO] Downloaded from central: https://repo.maven.apache.org/maven2/io/netty/netty-transport/4.1.51.Final/netty-transport-4.1.51.Final.pom (1.9 kB at 92 kB/s)
[INFO] Downloading from central: https://repo.maven.apache.org/maven2/io/netty/netty-resolver/4.1.51.Final/netty-resolver-4.1.51.Final.pom
[INFO] Downloaded from central: https://repo.maven.apache.org/maven2/io/netty/netty-resolver/4.1.51.Final/netty-resolver-4.1.51.Final.pom (1.6 kB at 75 kB/s)
[INFO] Downloading from central: https://repo.maven.apache.org/maven2/io/netty/netty-resolver-dns/4.1.51.Final/netty-resolver-dns-4.1.51.Final.pom
[INFO] Downloaded from central: https://repo.maven.apache.org/maven2/io/netty/netty-resolver-dns/4.1.51.Final/netty-resolver-dns-4.1.51.Final.pom (3.0 kB at 130 kB/s)
[INFO] Downloading from central: https://repo.maven.apache.org/maven2/io/netty/netty-codec-dns/4.1.51.Final/netty-codec-dns-4.1.51.Final.pom
[INFO] Downloaded from central: https://repo.maven.apache.org/maven2/io/netty/netty-codec-dns/4.1.51.Final/netty-codec-dns-4.1.51.Final.pom (2.1 kB at 93 kB/s)
[INFO] Downloading from central: https://repo.maven.apache.org/maven2/io/netty/netty-handler/4.1.51.Final/netty-handler-4.1.51.Final.pom
[INFO] Downloaded from central: https://repo.maven.apache.org/maven2/io/netty/netty-handler/4.1.51.Final/netty-handler-4.1.51.Final.pom (3.6 kB at 162 kB/s)
[INFO] Downloading from central: https://repo.maven.apache.org/maven2/javax/cache/cache-api/1.0.0/cache-api-1.0.0.pom
[INFO] Downloaded from central: https://repo.maven.apache.org/maven2/javax/cache/cache-api/1.0.0/cache-api-1.0.0.pom (11 kB at 519 kB/s)
[INFO] Downloading from central: https://repo.maven.apache.org/maven2/io/projectreactor/reactor-core/3.3.4.RELEASE/reactor-core-3.3.4.RELEASE.pom
[INFO] Downloaded from central: https://repo.maven.apache.org/maven2/io/projectreactor/reactor-core/3.3.4.RELEASE/reactor-core-3.3.4.RELEASE.pom (3.3 kB at 172 kB/s)
[INFO] Downloading from central: https://repo.maven.apache.org/maven2/org/reactivestreams/reactive-streams/1.0.3/reactive-streams-1.0.3.pom
[INFO] Downloaded from central: https://repo.maven.apache.org/maven2/org/reactivestreams/reactive-streams/1.0.3/reactive-streams-1.0.3.pom (1.2 kB at 41 kB/s)
[INFO] Downloading from central: https://repo.maven.apache.org/maven2/io/reactivex/rxjava2/rxjava/2.2.19/rxjava-2.2.19.pom
[INFO] Downloaded from central: https://repo.maven.apache.org/maven2/io/reactivex/rxjava2/rxjava/2.2.19/rxjava-2.2.19.pom (2.4 kB at 94 kB/s)
[INFO] Downloading from central: https://repo.maven.apache.org/maven2/org/jboss/marshalling/jboss-marshalling-river/2.0.9.Final/jboss-marshalling-river-2.0.9.Final.pom
[INFO] Downloaded from central: https://repo.maven.apache.org/maven2/org/jboss/marshalling/jboss-marshalling-river/2.0.9.Final/jboss-marshalling-river-2.0.9.Final.pom (1.6 kB at 54 kB/s)
[INFO] Downloading from central: https://repo.maven.apache.org/maven2/org/jboss/marshalling/jboss-marshalling-parent/2.0.9.Final/jboss-marshalling-parent-2.0.9.Final.pom
[INFO] Downloaded from central: https://repo.maven.apache.org/maven2/org/jboss/marshalling/jboss-marshalling-parent/2.0.9.Final/jboss-marshalling-parent-2.0.9.Final.pom (4.6 kB at 170 kB/s)
[INFO] Downloading from central: https://repo.maven.apache.org/maven2/org/jboss/jboss-parent/34/jboss-parent-34.pom
[INFO] Downloaded from central: https://repo.maven.apache.org/maven2/org/jboss/jboss-parent/34/jboss-parent-34.pom (65 kB at 2.1 MB/s)
[INFO] Downloading from central: https://repo.maven.apache.org/maven2/org/jboss/marshalling/jboss-marshalling/2.0.9.Final/jboss-marshalling-2.0.9.Final.pom
[INFO] Downloaded from central: https://repo.maven.apache.org/maven2/org/jboss/marshalling/jboss-marshalling/2.0.9.Final/jboss-marshalling-2.0.9.Final.pom (8.6 kB at 253 kB/s)
[INFO] Downloading from central: https://repo.maven.apache.org/maven2/org/yaml/snakeyaml/1.26/snakeyaml-1.26.pom
[INFO] Downloaded from central: https://repo.maven.apache.org/maven2/org/yaml/snakeyaml/1.26/snakeyaml-1.26.pom (38 kB at 1.1 MB/s)
[INFO] Downloading from central: https://repo.maven.apache.org/maven2/com/fasterxml/jackson/dataformat/jackson-dataformat-yaml/2.11.1/jackson-dataformat-yaml-2.11.1.pom
[INFO] Downloaded from central: https://repo.maven.apache.org/maven2/com/fasterxml/jackson/dataformat/jackson-dataformat-yaml/2.11.1/jackson-dataformat-yaml-2.11.1.pom (2.3 kB at 81 kB/s)
[INFO] Downloading from central: https://repo.maven.apache.org/maven2/com/fasterxml/jackson/dataformat/jackson-dataformats-text/2.11.1/jackson-dataformats-text-2.11.1.pom
[INFO] Downloaded from central: https://repo.maven.apache.org/maven2/com/fasterxml/jackson/dataformat/jackson-dataformats-text/2.11.1/jackson-dataformats-text-2.11.1.pom (3.0 kB at 103 kB/s)
[INFO] Downloading from central: https://repo.maven.apache.org/maven2/com/fasterxml/jackson/jackson-base/2.11.1/jackson-base-2.11.1.pom
[INFO] Downloaded from central: https://repo.maven.apache.org/maven2/com/fasterxml/jackson/jackson-base/2.11.1/jackson-base-2.11.1.pom (7.4 kB at 240 kB/s)
[INFO] Downloading from central: https://repo.maven.apache.org/maven2/com/fasterxml/jackson/core/jackson-databind/2.11.1/jackson-databind-2.11.1.pom
[INFO] Downloaded from central: https://repo.maven.apache.org/maven2/com/fasterxml/jackson/core/jackson-databind/2.11.1/jackson-databind-2.11.1.pom (7.4 kB at 254 kB/s)
[INFO] Downloading from central: https://repo.maven.apache.org/maven2/com/fasterxml/jackson/core/jackson-annotations/2.11.1/jackson-annotations-2.11.1.pom
[INFO] Downloaded from central: https://repo.maven.apache.org/maven2/com/fasterxml/jackson/core/jackson-annotations/2.11.1/jackson-annotations-2.11.1.pom (3.5 kB at 101 kB/s)
[INFO] Downloading from central: https://repo.maven.apache.org/maven2/com/fasterxml/jackson/core/jackson-core/2.11.1/jackson-core-2.11.1.pom
[INFO] Downloaded from central: https://repo.maven.apache.org/maven2/com/fasterxml/jackson/core/jackson-core/2.11.1/jackson-core-2.11.1.pom (4.9 kB at 147 kB/s)
[INFO] Downloading from central: https://repo.maven.apache.org/maven2/net/bytebuddy/byte-buddy/1.10.7/byte-buddy-1.10.7.pom
[INFO] Downloaded from central: https://repo.maven.apache.org/maven2/net/bytebuddy/byte-buddy/1.10.7/byte-buddy-1.10.7.pom (11 kB at 398 kB/s)
[INFO] Downloading from central: https://repo.maven.apache.org/maven2/net/bytebuddy/byte-buddy-parent/1.10.7/byte-buddy-parent-1.10.7.pom
[INFO] Downloaded from central: https://repo.maven.apache.org/maven2/net/bytebuddy/byte-buddy-parent/1.10.7/byte-buddy-parent-1.10.7.pom (40 kB at 1.3 MB/s)
[INFO] Downloading from central: https://repo.maven.apache.org/maven2/org/jodd/jodd-bean/5.0.13/jodd-bean-5.0.13.pom
[INFO] Downloaded from central: https://repo.maven.apache.org/maven2/org/jodd/jodd-bean/5.0.13/jodd-bean-5.0.13.pom (1.5 kB at 50 kB/s)
[INFO] Downloading from central: https://repo.maven.apache.org/maven2/org/jodd/jodd-core/5.0.13/jodd-core-5.0.13.pom
[INFO] Downloaded from central: https://repo.maven.apache.org/maven2/org/jodd/jodd-core/5.0.13/jodd-core-5.0.13.pom (1.3 kB at 45 kB/s)
[INFO] Downloading from central: https://repo.maven.apache.org/maven2/org/redisson/redisson/3.13.3/redisson-3.13.3.jar
[INFO] Downloading from central: https://repo.maven.apache.org/maven2/io/netty/netty-transport/4.1.51.Final/netty-transport-4.1.51.Final.jar
[INFO] Downloading from central: https://repo.maven.apache.org/maven2/io/netty/netty-buffer/4.1.51.Final/netty-buffer-4.1.51.Final.jar
[INFO] Downloading from central: https://repo.maven.apache.org/maven2/io/netty/netty-codec/4.1.51.Final/netty-codec-4.1.51.Final.jar
[INFO] Downloading from central: https://repo.maven.apache.org/maven2/io/netty/netty-common/4.1.51.Final/netty-common-4.1.51.Final.jar
[INFO] Downloaded from central: https://repo.maven.apache.org/maven2/io/netty/netty-buffer/4.1.51.Final/netty-buffer-4.1.51.Final.jar (290 kB at 6.0 MB/s)
[INFO] Downloaded from central: https://repo.maven.apache.org/maven2/io/netty/netty-codec/4.1.51.Final/netty-codec-4.1.51.Final.jar (320 kB at 6.5 MB/s)
[INFO] Downloading from central: https://repo.maven.apache.org/maven2/io/netty/netty-resolver-dns/4.1.51.Final/netty-resolver-dns-4.1.51.Final.jar
[INFO] Downloading from central: https://repo.maven.apache.org/maven2/io/netty/netty-resolver/4.1.51.Final/netty-resolver-4.1.51.Final.jar
[INFO] Downloaded from central: https://repo.maven.apache.org/maven2/io/netty/netty-transport/4.1.51.Final/netty-transport-4.1.51.Final.jar (473 kB at 9.7 MB/s)
[INFO] Downloading from central: https://repo.maven.apache.org/maven2/io/netty/netty-codec-dns/4.1.51.Final/netty-codec-dns-4.1.51.Final.jar
[INFO] Downloaded from central: https://repo.maven.apache.org/maven2/io/netty/netty-common/4.1.51.Final/netty-common-4.1.51.Final.jar (625 kB at 10 MB/s)
[INFO] Downloading from central: https://repo.maven.apache.org/maven2/io/netty/netty-handler/4.1.51.Final/netty-handler-4.1.51.Final.jar
[INFO] Downloaded from central: https://repo.maven.apache.org/maven2/io/netty/netty-codec-dns/4.1.51.Final/netty-codec-dns-4.1.51.Final.jar (61 kB at 840 kB/s)
[INFO] Downloading from central: https://repo.maven.apache.org/maven2/javax/cache/cache-api/1.0.0/cache-api-1.0.0.jar
[INFO] Downloaded from central: https://repo.maven.apache.org/maven2/io/netty/netty-resolver/4.1.51.Final/netty-resolver-4.1.51.Final.jar (33 kB at 409 kB/s)
[INFO] Downloading from central: https://repo.maven.apache.org/maven2/io/projectreactor/reactor-core/3.3.4.RELEASE/reactor-core-3.3.4.RELEASE.jar
[INFO] Downloaded from central: https://repo.maven.apache.org/maven2/io/netty/netty-resolver-dns/4.1.51.Final/netty-resolver-dns-4.1.51.Final.jar (152 kB at 1.8 MB/s)
[INFO] Downloading from central: https://repo.maven.apache.org/maven2/org/reactivestreams/reactive-streams/1.0.3/reactive-streams-1.0.3.jar
[INFO] Downloaded from central: https://repo.maven.apache.org/maven2/javax/cache/cache-api/1.0.0/cache-api-1.0.0.jar (50 kB at 461 kB/s)
[INFO] Downloading from central: https://repo.maven.apache.org/maven2/io/reactivex/rxjava2/rxjava/2.2.19/rxjava-2.2.19.jar
[INFO] Downloaded from central: https://repo.maven.apache.org/maven2/org/redisson/redisson/3.13.3/redisson-3.13.3.jar (2.0 MB at 18 MB/s)
[INFO] Downloaded from central: https://repo.maven.apache.org/maven2/io/netty/netty-handler/4.1.51.Final/netty-handler-4.1.51.Final.jar (457 kB at 4.0 MB/s)
[INFO] Downloading from central: https://repo.maven.apache.org/maven2/org/jboss/marshalling/jboss-marshalling-river/2.0.9.Final/jboss-marshalling-river-2.0.9.Final.jar
[INFO] Downloading from central: https://repo.maven.apache.org/maven2/org/jboss/marshalling/jboss-marshalling/2.0.9.Final/jboss-marshalling-2.0.9.Final.jar
[INFO] Downloaded from central: https://repo.maven.apache.org/maven2/org/reactivestreams/reactive-streams/1.0.3/reactive-streams-1.0.3.jar (11 kB at 97 kB/s)
[INFO] Downloading from central: https://repo.maven.apache.org/maven2/org/yaml/snakeyaml/1.26/snakeyaml-1.26.jar
[INFO] Downloaded from central: https://repo.maven.apache.org/maven2/org/jboss/marshalling/jboss-marshalling-river/2.0.9.Final/jboss-marshalling-river-2.0.9.Final.jar (86 kB at 538 kB/s)
[INFO] Downloaded from central: https://repo.maven.apache.org/maven2/org/jboss/marshalling/jboss-marshalling/2.0.9.Final/jboss-marshalling-2.0.9.Final.jar (223 kB at 1.4 MB/s)
[INFO] Downloaded from central: https://repo.maven.apache.org/maven2/org/yaml/snakeyaml/1.26/snakeyaml-1.26.jar (309 kB at 1.9 MB/s)
[INFO] Downloading from central: https://repo.maven.apache.org/maven2/com/fasterxml/jackson/dataformat/jackson-dataformat-yaml/2.11.1/jackson-dataformat-yaml-2.11.1.jar
[INFO] Downloading from central: https://repo.maven.apache.org/maven2/com/fasterxml/jackson/core/jackson-databind/2.11.1/jackson-databind-2.11.1.jar
[INFO] Downloading from central: https://repo.maven.apache.org/maven2/com/fasterxml/jackson/core/jackson-core/2.11.1/jackson-core-2.11.1.jar
[INFO] Downloaded from central: https://repo.maven.apache.org/maven2/io/projectreactor/reactor-core/3.3.4.RELEASE/reactor-core-3.3.4.RELEASE.jar (1.6 MB at 9.0 MB/s)
[INFO] Downloading from central: https://repo.maven.apache.org/maven2/com/fasterxml/jackson/core/jackson-annotations/2.11.1/jackson-annotations-2.11.1.jar
[INFO] Downloaded from central: https://repo.maven.apache.org/maven2/com/fasterxml/jackson/dataformat/jackson-dataformat-yaml/2.11.1/jackson-dataformat-yaml-2.11.1.jar (47 kB at 230 kB/s)
[INFO] Downloading from central: https://repo.maven.apache.org/maven2/net/bytebuddy/byte-buddy/1.10.7/byte-buddy-1.10.7.jar
[INFO] Downloaded from central: https://repo.maven.apache.org/maven2/com/fasterxml/jackson/core/jackson-core/2.11.1/jackson-core-2.11.1.jar (352 kB at 1.6 MB/s)
[INFO] Downloading from central: https://repo.maven.apache.org/maven2/org/jodd/jodd-bean/5.0.13/jodd-bean-5.0.13.jar
[INFO] Downloaded from central: https://repo.maven.apache.org/maven2/com/fasterxml/jackson/core/jackson-annotations/2.11.1/jackson-annotations-2.11.1.jar (68 kB at 308 kB/s)
[INFO] Downloading from central: https://repo.maven.apache.org/maven2/org/jodd/jodd-core/5.0.13/jodd-core-5.0.13.jar
[INFO] Downloaded from central: https://repo.maven.apache.org/maven2/io/reactivex/rxjava2/rxjava/2.2.19/rxjava-2.2.19.jar (2.4 MB at 10 MB/s)
[INFO] Downloaded from central: https://repo.maven.apache.org/maven2/org/jodd/jodd-bean/5.0.13/jodd-bean-5.0.13.jar (125 kB at 500 kB/s)
[INFO] Downloaded from central: https://repo.maven.apache.org/maven2/com/fasterxml/jackson/core/jackson-databind/2.11.1/jackson-databind-2.11.1.jar (1.4 MB at 5.6 MB/s)
[INFO] Downloaded from central: https://repo.maven.apache.org/maven2/org/jodd/jodd-core/5.0.13/jodd-core-5.0.13.jar (403 kB at 1.5 MB/s)
[INFO] Downloaded from central: https://repo.maven.apache.org/maven2/net/bytebuddy/byte-buddy/1.10.7/byte-buddy-1.10.7.jar (3.3 MB at 10 MB/s)
[INFO]
[INFO] --- maven-clean-plugin:3.1.0:clean (default-clean) @ maven-resolver-synccontext-redisson ---
[INFO]
[INFO] --- maven-enforcer-plugin:1.4.1:enforce (enforce-maven-version) @ maven-resolver-synccontext-redisson ---
[INFO]
[INFO] --- maven-enforcer-plugin:1.4.1:enforce (enforce-bytecode-version) @ maven-resolver-synccontext-redisson ---
[INFO] Adding ignore: module-info
[INFO]
[INFO] --- apache-rat-plugin:0.13:check (rat-check) @ maven-resolver-synccontext-redisson ---
[INFO] Enabled default license matchers.
[INFO] Will parse SCM ignores for exclusions...
[INFO] Finished adding exclusions from SCM ignore files.
[INFO] 62 implicit excludes (use -debug for more details).
[INFO] 9 explicit excludes (use -debug for more details).
[INFO] 5 resources included (use -debug for more details)
[INFO] Rat check: Summary over all files. Unapproved: 0, unknown: 0, generated: 0, approved: 5 licenses.
[INFO]
[INFO] --- maven-remote-resources-plugin:1.7.0:process (process-resource-bundles) @ maven-resolver-synccontext-redisson ---
[INFO] Preparing remote bundle org.apache:apache-jar-resource-bundle:1.4
[INFO] Copying 3 resources from 1 bundle.
[INFO]
[INFO] --- maven-resources-plugin:3.1.0:resources (default-resources) @ maven-resolver-synccontext-redisson ---
[INFO] Using 'UTF-8' encoding to copy filtered resources.
[INFO] skip non existing resourceDirectory F:\jenkins\jenkins-slave\712657a4\workspace\_maven-box_maven-resolver_master\m\maven-resolver-synccontext-redisson\src\main\resources
[INFO] Copying 3 resources
[INFO]
[INFO] --- maven-compiler-plugin:3.8.1:compile (default-compile) @ maven-resolver-synccontext-redisson ---
[INFO] Changes detected - recompiling the module!
[INFO] Compiling 2 source files to F:\jenkins\jenkins-slave\712657a4\workspace\_maven-box_maven-resolver_master\m\maven-resolver-synccontext-redisson\target\classes
[INFO]
[INFO] --- sisu-maven-plugin:0.3.4:main-index (generate-index) @ maven-resolver-synccontext-redisson ---
[INFO]
[INFO] --- maven-bundle-plugin:3.5.1:manifest (bundle-manifest) @ maven-resolver-synccontext-redisson ---
[INFO]
[INFO] --- maven-resources-plugin:3.1.0:testResources (default-testResources) @ maven-resolver-synccontext-redisson ---
[INFO] Using 'UTF-8' encoding to copy filtered resources.
[INFO] skip non existing resourceDirectory F:\jenkins\jenkins-slave\712657a4\workspace\_maven-box_maven-resolver_master\m\maven-resolver-synccontext-redisson\src\test\resources
[INFO] Copying 3 resources
[INFO]
[INFO] --- maven-compiler-plugin:3.8.1:testCompile (default-testCompile) @ maven-resolver-synccontext-redisson ---
[INFO] No sources to compile
[INFO]
[INFO] --- maven-surefire-plugin:2.22.0:test (default-test) @ maven-resolver-synccontext-redisson ---
[INFO]
[INFO] --- maven-jar-plugin:3.2.0:jar (default-jar) @ maven-resolver-synccontext-redisson ---
[INFO] Building jar: F:\jenkins\jenkins-slave\712657a4\workspace\_maven-box_maven-resolver_master\m\maven-resolver-synccontext-redisson\target\maven-resolver-synccontext-redisson-1.6.0.jar
[INFO]
[INFO] --- maven-site-plugin:3.7.1:attach-descriptor (attach-descriptor) @ maven-resolver-synccontext-redisson ---
[INFO] Skipping because packaging 'jar' is not pom.
[INFO]
[INFO] --- maven-checkstyle-plugin:3.0.0:check (checkstyle-check) @ maven-resolver-synccontext-redisson ---
[INFO] ------------------------------------------------------------------------
[INFO] Reactor Summary for Maven Artifact Resolver 1.6.0:
[INFO]
[INFO] Maven Artifact Resolver ............................ SUCCESS [ 52.240 s]
[INFO] Maven Artifact Resolver API ........................ SUCCESS [ 24.924 s]
[INFO] Maven Artifact Resolver SPI ........................ SUCCESS [  3.201 s]
[INFO] Maven Artifact Resolver Test Utilities ............. SUCCESS [  3.489 s]
[INFO] Maven Artifact Resolver Utilities .................. SUCCESS [ 10.147 s]
[INFO] Maven Artifact Resolver Implementation ............. SUCCESS [ 26.174 s]
[INFO] Maven Artifact Resolver Connector Basic ............ SUCCESS [  8.578 s]
[INFO] Maven Artifact Resolver Transport Classpath ........ SUCCESS [  2.115 s]
[INFO] Maven Artifact Resolver Transport File ............. SUCCESS [  3.057 s]
[INFO] Maven Artifact Resolver Transport HTTP ............. SUCCESS [  9.606 s]
[INFO] Maven Artifact Resolver Transport Wagon ............ SUCCESS [  6.166 s]
[INFO] Maven Artifact Resolver Demos ...................... SUCCESS [  0.453 s]
[INFO] Maven Artifact Resolver Demo Snippets .............. SUCCESS [  3.796 s]
[INFO] Maven Artifact Resolver Demo Maven Plugin .......... SUCCESS [ 12.500 s]
[INFO] Maven Artifact Resolver Sync Context Global ........ SUCCESS [  1.534 s]
[INFO] Maven Artifact Resolver Sync Context Redisson ...... SUCCESS [  5.921 s]
[INFO] ------------------------------------------------------------------------
[INFO] BUILD SUCCESS
[INFO] ------------------------------------------------------------------------
[INFO] Total time:  02:55 min
[INFO] Finished at: 2020-09-11T10:47:14-07:00
[INFO] ------------------------------------------------------------------------
[INFO] [jenkins-event-spy] Generated F:\jenkins\jenkins-slave\712657a4\workspace\_maven-box_maven-resolver_master@tmp\withMaven613cdd6b\maven-spy-20200911-104418-82914943094457485155607.log
[Pipeline] }
[Pipeline] // dir
[Pipeline] }
[withMaven] junitPublisher - Archive test results for Maven artifact org.apache.maven.resolver:maven-resolver-api:jar:1.6.0 generated by maven-surefire-plugin:test (default-test): m\maven-resolver-api\target\surefire-reports\*.xml
[withMaven] junitPublisher - Archive test results for Maven artifact org.apache.maven.resolver:maven-resolver-spi:jar:1.6.0 generated by maven-surefire-plugin:test (default-test): m\maven-resolver-spi\target\surefire-reports\*.xml
[withMaven] junitPublisher - Archive test results for Maven artifact org.apache.maven.resolver:maven-resolver-test-util:jar:1.6.0 generated by maven-surefire-plugin:test (default-test): m\maven-resolver-test-util\target\surefire-reports\*.xml
[withMaven] junitPublisher - Archive test results for Maven artifact org.apache.maven.resolver:maven-resolver-util:jar:1.6.0 generated by maven-surefire-plugin:test (default-test): m\maven-resolver-util\target\surefire-reports\*.xml
[withMaven] junitPublisher - Archive test results for Maven artifact org.apache.maven.resolver:maven-resolver-impl:jar:1.6.0 generated by maven-surefire-plugin:test (default-test): m\maven-resolver-impl\target\surefire-reports\*.xml
[withMaven] junitPublisher - Archive test results for Maven artifact org.apache.maven.resolver:maven-resolver-connector-basic:jar:1.6.0 generated by maven-surefire-plugin:test (default-test): m\maven-resolver-connector-basic\target\surefire-reports\*.xml
[withMaven] junitPublisher - Archive test results for Maven artifact org.apache.maven.resolver:maven-resolver-transport-classpath:jar:1.6.0 generated by maven-surefire-plugin:test (default-test): m\maven-resolver-transport-classpath\target\surefire-reports\*.xml
[withMaven] junitPublisher - Archive test results for Maven artifact org.apache.maven.resolver:maven-resolver-transport-file:jar:1.6.0 generated by maven-surefire-plugin:test (default-test): m\maven-resolver-transport-file\target\surefire-reports\*.xml
[withMaven] junitPublisher - Archive test results for Maven artifact org.apache.maven.resolver:maven-resolver-transport-http:jar:1.6.0 generated by maven-surefire-plugin:test (default-test): m\maven-resolver-transport-http\target\surefire-reports\*.xml
[withMaven] junitPublisher - Archive test results for Maven artifact org.apache.maven.resolver:maven-resolver-transport-wagon:jar:1.6.0 generated by maven-surefire-plugin:test (default-test): m\maven-resolver-transport-wagon\target\surefire-reports\*.xml
[withMaven] junitPublisher - Archive test results for Maven artifact org.apache.maven.resolver:maven-resolver-demo-snippets:jar:1.6.0 generated by maven-surefire-plugin:test (default-test): m\maven-resolver-demos\maven-resolver-demo-snippets\target\surefire-reports\*.xml
[withMaven] junitPublisher - Archive test results for Maven artifact org.apache.maven.resolver:maven-resolver-demo-maven-plugin:maven-plugin:1.6.0 generated by maven-surefire-plugin:test (default-test): m\maven-resolver-demos\maven-resolver-demo-maven-plugin\target\surefire-reports\*.xml
[withMaven] junitPublisher - Archive test results for Maven artifact org.apache.maven.resolver:maven-resolver-synccontext-global:jar:1.6.0 generated by maven-surefire-plugin:test (default-test): m\maven-resolver-synccontext-global\target\surefire-reports\*.xml
[withMaven] junitPublisher - Archive test results for Maven artifact org.apache.maven.resolver:maven-resolver-synccontext-redisson:jar:1.6.0 generated by maven-surefire-plugin:test (default-test): m\maven-resolver-synccontext-redisson\target\surefire-reports\*.xml
Recording test results
[withMaven] Publishers: Junit Publisher: 10961 ms
[Pipeline] // withMaven
[Pipeline] cleanWs
[WS-CLEANUP] Deleting project workspace...
[WS-CLEANUP] Deferred wipeout is used...
[WS-CLEANUP] done
[Pipeline] }
[Pipeline] // stage
[Pipeline] }
[Pipeline] // node
[Pipeline] }
[Pipeline] // parallel
[Pipeline] echo
[FAILURE-003] AbortException hudson.AbortException: script returned exit code 1
[Pipeline] stage
[Pipeline] { (Notifications)
[Pipeline] echo
Build result: FAILURE
[Pipeline] jiraIssueSelector
[Pipeline] echo
The authors of changes [michaelo].
[Pipeline] echo
Sending email ...
[Pipeline] emailext
Reply | Threaded
Open this post in threaded view
|

Build succeeded in Jenkins: Maven » Maven TLP » maven-resolver » master #22

Apache Jenkins Server-2
See https://ci-builds.apache.org/job/Maven/job/maven-box/job/maven-resolver/job/master/22/

Changes:

* [maven-release-plugin] prepare for next development iteration

All tests passed