Build failed in Jenkins: Maven » Maven TLP » maven-project-info-reports-plugin » master #14

Previous Topic Next Topic
 
classic Classic list List threaded Threaded
2 messages Options
Reply | Threaded
Open this post in threaded view
|

Build failed in Jenkins: Maven » Maven TLP » maven-project-info-reports-plugin » master #14

Apache Jenkins Server-2
See https://ci-builds.apache.org/job/Maven/job/maven-box/job/maven-project-info-reports-plugin/job/master/14/

Changes:

* [MPIR-398] Non-sense links created for mailing lists when mailto is empty

No tests ran.

Build log:
[...truncated 20576 lines...]
[INFO] -------------------------------------------------------------
[ERROR] COMPILATION ERROR :
[INFO] -------------------------------------------------------------
[ERROR] /f:/jenkins/jenkins-slave/712657a4/workspace/oject-info-reports-plugin_master@3/windows-jdk8-m3.6.x_build/src/main/java/org/apache/maven/report/projectinfo/MailingListsReport.java:[160,22] cannot find symbol
  symbol:   variable StringUtils
  location: class org.apache.maven.report.projectinfo.MailingListsReport.MailingListsRenderer
[ERROR] /f:/jenkins/jenkins-slave/712657a4/workspace/oject-info-reports-plugin_master@3/windows-jdk8-m3.6.x_build/src/main/java/org/apache/maven/report/projectinfo/MailingListsReport.java:[169,22] cannot find symbol
  symbol:   variable StringUtils
  location: class org.apache.maven.report.projectinfo.MailingListsReport.MailingListsRenderer
[ERROR] /f:/jenkins/jenkins-slave/712657a4/workspace/oject-info-reports-plugin_master@3/windows-jdk8-m3.6.x_build/src/main/java/org/apache/maven/report/projectinfo/MailingListsReport.java:[178,22] cannot find symbol
  symbol:   variable StringUtils
  location: class org.apache.maven.report.projectinfo.MailingListsReport.MailingListsRenderer
[ERROR] /f:/jenkins/jenkins-slave/712657a4/workspace/oject-info-reports-plugin_master@3/windows-jdk8-m3.6.x_build/src/main/java/org/apache/maven/report/projectinfo/MailingListsReport.java:[187,22] cannot find symbol
  symbol:   variable StringUtils
  location: class org.apache.maven.report.projectinfo.MailingListsReport.MailingListsRenderer
[INFO] 4 errors
[INFO] -------------------------------------------------------------
[INFO] ------------------------------------------------------------------------
[INFO] BUILD FAILURE
[INFO] ------------------------------------------------------------------------
[INFO] Total time:  36.552 s
[INFO] Finished at: 2020-08-30T10:26:34-07:00
[INFO] ------------------------------------------------------------------------
[INFO] [jenkins-event-spy] Generated F:\jenkins\jenkins-slave\712657a4\workspace\oject-info-reports-plugin_master@3@tmp\withMaven9bacaff1\maven-spy-20200830-102557-9862943471766472354245.log
[ERROR] Failed to execute goal org.apache.maven.plugins:maven-compiler-plugin:3.8.1:compile (default-compile) on project maven-project-info-reports-plugin: Compilation failure: Compilation failure:
[ERROR] /f:/jenkins/jenkins-slave/712657a4/workspace/oject-info-reports-plugin_master@3/windows-jdk8-m3.6.x_build/src/main/java/org/apache/maven/report/projectinfo/MailingListsReport.java:[160,22] cannot find symbol
[ERROR]   symbol:   variable StringUtils
[ERROR]   location: class org.apache.maven.report.projectinfo.MailingListsReport.MailingListsRenderer
[ERROR] /f:/jenkins/jenkins-slave/712657a4/workspace/oject-info-reports-plugin_master@3/windows-jdk8-m3.6.x_build/src/main/java/org/apache/maven/report/projectinfo/MailingListsReport.java:[169,22] cannot find symbol
[ERROR]   symbol:   variable StringUtils
[ERROR]   location: class org.apache.maven.report.projectinfo.MailingListsReport.MailingListsRenderer
[ERROR] /f:/jenkins/jenkins-slave/712657a4/workspace/oject-info-reports-plugin_master@3/windows-jdk8-m3.6.x_build/src/main/java/org/apache/maven/report/projectinfo/MailingListsReport.java:[178,22] cannot find symbol
[ERROR]   symbol:   variable StringUtils
[ERROR]   location: class org.apache.maven.report.projectinfo.MailingListsReport.MailingListsRenderer
[ERROR] /f:/jenkins/jenkins-slave/712657a4/workspace/oject-info-reports-plugin_master@3/windows-jdk8-m3.6.x_build/src/main/java/org/apache/maven/report/projectinfo/MailingListsReport.java:[187,22] cannot find symbol
[ERROR]   symbol:   variable StringUtils
[ERROR]   location: class org.apache.maven.report.projectinfo.MailingListsReport.MailingListsRenderer
[ERROR] -> [Help 1]
org.apache.maven.lifecycle.LifecycleExecutionException: Failed to execute goal org.apache.maven.plugins:maven-compiler-plugin:3.8.1:compile (default-compile) on project maven-project-info-reports-plugin: Compilation failure
    at org.apache.maven.lifecycle.internal.MojoExecutor.execute (MojoExecutor.java:215)
    at org.apache.maven.lifecycle.internal.MojoExecutor.execute (MojoExecutor.java:156)
    at org.apache.maven.lifecycle.internal.MojoExecutor.execute (MojoExecutor.java:148)
    at org.apache.maven.lifecycle.internal.LifecycleModuleBuilder.buildProject (LifecycleModuleBuilder.java:117)
    at org.apache.maven.lifecycle.internal.LifecycleModuleBuilder.buildProject (LifecycleModuleBuilder.java:81)
    at org.apache.maven.lifecycle.internal.builder.singlethreaded.SingleThreadedBuilder.build (SingleThreadedBuilder.java:56)
    at org.apache.maven.lifecycle.internal.LifecycleStarter.execute (LifecycleStarter.java:128)
    at org.apache.maven.DefaultMaven.doExecute (DefaultMaven.java:305)
    at org.apache.maven.DefaultMaven.doExecute (DefaultMaven.java:192)
    at org.apache.maven.DefaultMaven.execute (DefaultMaven.java:105)
    at org.apache.maven.cli.MavenCli.execute (MavenCli.java:956)
    at org.apache.maven.cli.MavenCli.doMain (MavenCli.java:288)
    at org.apache.maven.cli.MavenCli.main (MavenCli.java:192)
    at sun.reflect.NativeMethodAccessorImpl.invoke0 (Native Method)
    at sun.reflect.NativeMethodAccessorImpl.invoke (NativeMethodAccessorImpl.java:62)
    at sun.reflect.DelegatingMethodAccessorImpl.invoke (DelegatingMethodAccessorImpl.java:43)
    at java.lang.reflect.Method.invoke (Method.java:498)
    at org.codehaus.plexus.classworlds.launcher.Launcher.launchEnhanced (Launcher.java:282)
    at org.codehaus.plexus.classworlds.launcher.Launcher.launch (Launcher.java:225)
    at org.codehaus.plexus.classworlds.launcher.Launcher.mainWithExitCode (Launcher.java:406)
    at org.codehaus.plexus.classworlds.launcher.Launcher.main (Launcher.java:347)
Caused by: org.apache.maven.plugin.compiler.CompilationFailureException: Compilation failure
    at org.apache.maven.plugin.compiler.AbstractCompilerMojo.execute (AbstractCompilerMojo.java:1220)
    at org.apache.maven.plugin.compiler.CompilerMojo.execute (CompilerMojo.java:187)
    at org.apache.maven.plugin.DefaultBuildPluginManager.executeMojo (DefaultBuildPluginManager.java:137)
    at org.apache.maven.lifecycle.internal.MojoExecutor.execute (MojoExecutor.java:210)
    at org.apache.maven.lifecycle.internal.MojoExecutor.execute (MojoExecutor.java:156)
    at org.apache.maven.lifecycle.internal.MojoExecutor.execute (MojoExecutor.java:148)
    at org.apache.maven.lifecycle.internal.LifecycleModuleBuilder.buildProject (LifecycleModuleBuilder.java:117)
    at org.apache.maven.lifecycle.internal.LifecycleModuleBuilder.buildProject (LifecycleModuleBuilder.java:81)
    at org.apache.maven.lifecycle.internal.builder.singlethreaded.SingleThreadedBuilder.build (SingleThreadedBuilder.java:56)
    at org.apache.maven.lifecycle.internal.LifecycleStarter.execute (LifecycleStarter.java:128)
    at org.apache.maven.DefaultMaven.doExecute (DefaultMaven.java:305)
    at org.apache.maven.DefaultMaven.doExecute (DefaultMaven.java:192)
    at org.apache.maven.DefaultMaven.execute (DefaultMaven.java:105)
    at org.apache.maven.cli.MavenCli.execute (MavenCli.java:956)
    at org.apache.maven.cli.MavenCli.doMain (MavenCli.java:288)
    at org.apache.maven.cli.MavenCli.main (MavenCli.java:192)
    at sun.reflect.NativeMethodAccessorImpl.invoke0 (Native Method)
    at sun.reflect.NativeMethodAccessorImpl.invoke (NativeMethodAccessorImpl.java:62)
    at sun.reflect.DelegatingMethodAccessorImpl.invoke (DelegatingMethodAccessorImpl.java:43)
    at java.lang.reflect.Method.invoke (Method.java:498)
    at org.codehaus.plexus.classworlds.launcher.Launcher.launchEnhanced (Launcher.java:282)
    at org.codehaus.plexus.classworlds.launcher.Launcher.launch (Launcher.java:225)
    at org.codehaus.plexus.classworlds.launcher.Launcher.mainWithExitCode (Launcher.java:406)
    at org.codehaus.plexus.classworlds.launcher.Launcher.main (Launcher.java:347)
[ERROR]
[ERROR] Re-run Maven using the -X switch to enable full debug logging.
[ERROR]
[ERROR] For more information about the errors and possible solutions, please read the following articles:
[ERROR] [Help 1] http://cwiki.apache.org/confluence/display/MAVEN/MojoFailureException
Picked up JAVA_TOOL_OPTIONS: -Dmaven.ext.class.path="f:\jenkins\jenkins-slave\712657a4\workspace\oject-info-reports-plugin_master@3@tmp\withMaven9bacaff1\pipeline-maven-spy.jar" -Dorg.jenkinsci.plugins.pipeline.maven.reportsFolder="f:\jenkins\jenkins-slave\712657a4\workspace\oject-info-reports-plugin_master@3@tmp\withMaven9bacaff1"
[Pipeline] }
[Pipeline] // dir
[Pipeline] }
[INFO] /f:/jenkins/jenkins-slave/712657a4/workspace/oject-info-reports-plugin_master@2@2/windows-jdk11-m3.6.x_build/src/main/java/org/apache/maven/report/projectinfo/DependencyManagementReport.java: Some input files use or override a deprecated API.
[INFO] /f:/jenkins/jenkins-slave/712657a4/workspace/oject-info-reports-plugin_master@2@2/windows-jdk11-m3.6.x_build/src/main/java/org/apache/maven/report/projectinfo/DependencyManagementReport.java: Recompile with -Xlint:deprecation for details.
[INFO] -------------------------------------------------------------
[ERROR] COMPILATION ERROR :
[INFO] -------------------------------------------------------------
[ERROR] /f:/jenkins/jenkins-slave/712657a4/workspace/oject-info-reports-plugin_master@2@2/windows-jdk11-m3.6.x_build/src/main/java/org/apache/maven/report/projectinfo/MailingListsReport.java:[160,22] cannot find symbol
  symbol:   variable StringUtils
  location: class org.apache.maven.report.projectinfo.MailingListsReport.MailingListsRenderer
[ERROR] /f:/jenkins/jenkins-slave/712657a4/workspace/oject-info-reports-plugin_master@2@2/windows-jdk11-m3.6.x_build/src/main/java/org/apache/maven/report/projectinfo/MailingListsReport.java:[169,22] cannot find symbol
  symbol:   variable StringUtils
  location: class org.apache.maven.report.projectinfo.MailingListsReport.MailingListsRenderer
[ERROR] /f:/jenkins/jenkins-slave/712657a4/workspace/oject-info-reports-plugin_master@2@2/windows-jdk11-m3.6.x_build/src/main/java/org/apache/maven/report/projectinfo/MailingListsReport.java:[178,22] cannot find symbol
  symbol:   variable StringUtils
  location: class org.apache.maven.report.projectinfo.MailingListsReport.MailingListsRenderer
[ERROR] /f:/jenkins/jenkins-slave/712657a4/workspace/oject-info-reports-plugin_master@2@2/windows-jdk11-m3.6.x_build/src/main/java/org/apache/maven/report/projectinfo/MailingListsReport.java:[187,22] cannot find symbol
  symbol:   variable StringUtils
  location: class org.apache.maven.report.projectinfo.MailingListsReport.MailingListsRenderer
[INFO] 4 errors
[INFO] -------------------------------------------------------------
[INFO] ------------------------------------------------------------------------
[INFO] BUILD FAILURE
[INFO] ------------------------------------------------------------------------
[INFO] Total time:  36.559 s
[INFO] Finished at: 2020-08-30T10:26:34-07:00
[INFO] ------------------------------------------------------------------------
[INFO] [jenkins-event-spy] Generated F:\jenkins\jenkins-slave\712657a4\workspace\oject-info-reports-plugin_master@2@2@tmp\withMaven9d22af8d\maven-spy-20200830-102558-2312455067754146641783.log
[ERROR] Failed to execute goal org.apache.maven.plugins:maven-compiler-plugin:3.8.1:compile (default-compile) on project maven-project-info-reports-plugin: Compilation failure: Compilation failure:
[ERROR] /f:/jenkins/jenkins-slave/712657a4/workspace/oject-info-reports-plugin_master@2@2/windows-jdk11-m3.6.x_build/src/main/java/org/apache/maven/report/projectinfo/MailingListsReport.java:[160,22] cannot find symbol
[ERROR]   symbol:   variable StringUtils
[ERROR]   location: class org.apache.maven.report.projectinfo.MailingListsReport.MailingListsRenderer
[ERROR] /f:/jenkins/jenkins-slave/712657a4/workspace/oject-info-reports-plugin_master@2@2/windows-jdk11-m3.6.x_build/src/main/java/org/apache/maven/report/projectinfo/MailingListsReport.java:[169,22] cannot find symbol
[ERROR]   symbol:   variable StringUtils
[ERROR]   location: class org.apache.maven.report.projectinfo.MailingListsReport.MailingListsRenderer
[ERROR] /f:/jenkins/jenkins-slave/712657a4/workspace/oject-info-reports-plugin_master@2@2/windows-jdk11-m3.6.x_build/src/main/java/org/apache/maven/report/projectinfo/MailingListsReport.java:[178,22] cannot find symbol
[ERROR]   symbol:   variable StringUtils
[ERROR]   location: class org.apache.maven.report.projectinfo.MailingListsReport.MailingListsRenderer
[ERROR] /f:/jenkins/jenkins-slave/712657a4/workspace/oject-info-reports-plugin_master@2@2/windows-jdk11-m3.6.x_build/src/main/java/org/apache/maven/report/projectinfo/MailingListsReport.java:[187,22] cannot find symbol
[ERROR]   symbol:   variable StringUtils
[ERROR]   location: class org.apache.maven.report.projectinfo.MailingListsReport.MailingListsRenderer
[ERROR] -> [Help 1]
org.apache.maven.lifecycle.LifecycleExecutionException: Failed to execute goal org.apache.maven.plugins:maven-compiler-plugin:3.8.1:compile (default-compile) on project maven-project-info-reports-plugin: Compilation failure
    at org.apache.maven.lifecycle.internal.MojoExecutor.execute (MojoExecutor.java:215)
    at org.apache.maven.lifecycle.internal.MojoExecutor.execute (MojoExecutor.java:156)
    at org.apache.maven.lifecycle.internal.MojoExecutor.execute (MojoExecutor.java:148)
    at org.apache.maven.lifecycle.internal.LifecycleModuleBuilder.buildProject (LifecycleModuleBuilder.java:117)
    at org.apache.maven.lifecycle.internal.LifecycleModuleBuilder.buildProject (LifecycleModuleBuilder.java:81)
    at org.apache.maven.lifecycle.internal.builder.singlethreaded.SingleThreadedBuilder.build (SingleThreadedBuilder.java:56)
    at org.apache.maven.lifecycle.internal.LifecycleStarter.execute (LifecycleStarter.java:128)
    at org.apache.maven.DefaultMaven.doExecute (DefaultMaven.java:305)
    at org.apache.maven.DefaultMaven.doExecute (DefaultMaven.java:192)
    at org.apache.maven.DefaultMaven.execute (DefaultMaven.java:105)
    at org.apache.maven.cli.MavenCli.execute (MavenCli.java:956)
    at org.apache.maven.cli.MavenCli.doMain (MavenCli.java:288)
    at org.apache.maven.cli.MavenCli.main (MavenCli.java:192)
    at jdk.internal.reflect.NativeMethodAccessorImpl.invoke0 (Native Method)
    at jdk.internal.reflect.NativeMethodAccessorImpl.invoke (NativeMethodAccessorImpl.java:62)
    at jdk.internal.reflect.DelegatingMethodAccessorImpl.invoke (DelegatingMethodAccessorImpl.java:43)
    at java.lang.reflect.Method.invoke (Method.java:566)
    at org.codehaus.plexus.classworlds.launcher.Launcher.launchEnhanced (Launcher.java:282)
    at org.codehaus.plexus.classworlds.launcher.Launcher.launch (Launcher.java:225)
    at org.codehaus.plexus.classworlds.launcher.Launcher.mainWithExitCode (Launcher.java:406)
    at org.codehaus.plexus.classworlds.launcher.Launcher.main (Launcher.java:347)
Caused by: org.apache.maven.plugin.compiler.CompilationFailureException: Compilation failure
    at org.apache.maven.plugin.compiler.AbstractCompilerMojo.execute (AbstractCompilerMojo.java:1220)
    at org.apache.maven.plugin.compiler.CompilerMojo.execute (CompilerMojo.java:187)
    at org.apache.maven.plugin.DefaultBuildPluginManager.executeMojo (DefaultBuildPluginManager.java:137)
    at org.apache.maven.lifecycle.internal.MojoExecutor.execute (MojoExecutor.java:210)
    at org.apache.maven.lifecycle.internal.MojoExecutor.execute (MojoExecutor.java:156)
    at org.apache.maven.lifecycle.internal.MojoExecutor.execute (MojoExecutor.java:148)
    at org.apache.maven.lifecycle.internal.LifecycleModuleBuilder.buildProject (LifecycleModuleBuilder.java:117)
    at org.apache.maven.lifecycle.internal.LifecycleModuleBuilder.buildProject (LifecycleModuleBuilder.java:81)
    at org.apache.maven.lifecycle.internal.builder.singlethreaded.SingleThreadedBuilder.build (SingleThreadedBuilder.java:56)
    at org.apache.maven.lifecycle.internal.LifecycleStarter.execute (LifecycleStarter.java:128)
    at org.apache.maven.DefaultMaven.doExecute (DefaultMaven.java:305)
    at org.apache.maven.DefaultMaven.doExecute (DefaultMaven.java:192)
    at org.apache.maven.DefaultMaven.execute (DefaultMaven.java:105)
    at org.apache.maven.cli.MavenCli.execute (MavenCli.java:956)
    at org.apache.maven.cli.MavenCli.doMain (MavenCli.java:288)
    at org.apache.maven.cli.MavenCli.main (MavenCli.java:192)
    at jdk.internal.reflect.NativeMethodAccessorImpl.invoke0 (Native Method)
    at jdk.internal.reflect.NativeMethodAccessorImpl.invoke (NativeMethodAccessorImpl.java:62)
    at jdk.internal.reflect.DelegatingMethodAccessorImpl.invoke (DelegatingMethodAccessorImpl.java:43)
    at java.lang.reflect.Method.invoke (Method.java:566)
    at org.codehaus.plexus.classworlds.launcher.Launcher.launchEnhanced (Launcher.java:282)
    at org.codehaus.plexus.classworlds.launcher.Launcher.launch (Launcher.java:225)
    at org.codehaus.plexus.classworlds.launcher.Launcher.mainWithExitCode (Launcher.java:406)
    at org.codehaus.plexus.classworlds.launcher.Launcher.main (Launcher.java:347)
[ERROR]
[ERROR] Re-run Maven using the -X switch to enable full debug logging.
[ERROR]
[ERROR] For more information about the errors and possible solutions, please read the following articles:
[ERROR] [Help 1] http://cwiki.apache.org/confluence/display/MAVEN/MojoFailureException
[Pipeline] }
[Pipeline] // dir
[Pipeline] }
[withMaven] openTasksPublisher - Scan Tasks for Maven artifact org.apache.maven.plugins:maven-project-info-reports-plugin:maven-plugin:3.1.1-SNAPSHOT in source directory windows-jdk8-m3.6.x_build\src\main\java
[withMaven] openTasksPublisher - Scan Tasks for Maven artifact org.apache.maven.plugins:maven-project-info-reports-plugin:maven-plugin:3.1.1-SNAPSHOT in source directory windows-jdk11-m3.6.x_build\src\main\java
[TASKS] Scanning folder 'f:\jenkins\jenkins-slave\712657a4\workspace\oject-info-reports-plugin_master@2@2' for files matching the pattern 'windows-jdk11-m3.6.x_build\src\main\java\**\*' - excludes: null
[TASKS] Found 27 files to scan for tasks
[TASKS] Found 12 open tasks.
Skipping warnings blame since pipelines do not have an SCM link.%n
[TASKS] Scanning folder 'f:\jenkins\jenkins-slave\712657a4\workspace\oject-info-reports-plugin_master@3' for files matching the pattern 'windows-jdk8-m3.6.x_build\src\main\java\**\*' - excludes: null
[TASKS] Found 27 files to scan for tasks
[TASKS] Found 12 open tasks.
Skipping warnings blame since pipelines do not have an SCM link.%n
[TASKS] Computing warning deltas based on reference build #13
[TASKS] Computing warning deltas based on reference build #13
[withMaven] Publishers: Generated Artifacts Publisher: 1529 ms, Open Task Scanner Publisher: 1172 ms
[withMaven] Publishers: Generated Artifacts Publisher: 1528 ms, Open Task Scanner Publisher: 1172 ms
[Pipeline] // withMaven
[Pipeline] // withMaven
[Pipeline] cleanWs
[WS-CLEANUP] Deleting project workspace...
[WS-CLEANUP] Deferred wipeout is used...
[WS-CLEANUP] done
[Pipeline] cleanWs
[WS-CLEANUP] Deleting project workspace...
[WS-CLEANUP] Deferred wipeout is used...
[WS-CLEANUP] done
[Pipeline] cleanWs
[Pipeline] cleanWs
[WS-CLEANUP] Deleting project workspace...
[WS-CLEANUP] Deferred wipeout is used...
[WS-CLEANUP] Deleting project workspace...
[WS-CLEANUP] Deferred wipeout is used...
[WS-CLEANUP] done
[WS-CLEANUP] done
[Pipeline] }
[Pipeline] }
[Pipeline] // stage
[Pipeline] // stage
[Pipeline] }
[Pipeline] }
[Pipeline] // ws
[Pipeline] // ws
[Pipeline] }
[Pipeline] }
[Pipeline] // node
[Pipeline] // node
[Pipeline] }
Failed in branch windows-jdk8-m3.6.x_build
[Pipeline] }
Failed in branch windows-jdk11-m3.6.x_build
[Pipeline] // parallel
[Pipeline] stage
[Pipeline] { (Notifications)
[Pipeline] echo
Build result: FAILURE
[Pipeline] jiraIssueSelector
[Pipeline] jiraComment
[Pipeline] echo
The authors of changes [michaelo].
[Pipeline] echo
Sending email ...
[Pipeline] emailext
Reply | Threaded
Open this post in threaded view
|

Build succeeded in Jenkins: Maven » Maven TLP » maven-project-info-reports-plugin » master #15

Apache Jenkins Server-2