Build failed in Jenkins: Maven » Maven TLP » maven » master #92

Previous Topic Next Topic
 
classic Classic list List threaded Threaded
2 messages Options
Reply | Threaded
Open this post in threaded view
|

Build failed in Jenkins: Maven » Maven TLP » maven » master #92

Apache Jenkins Server-2
See https://ci-builds.apache.org/job/Maven/job/maven-box/job/maven/job/master/92/

Changes:

* [MNG-6967] Improve the command line output from maven-artifact.

All tests passed

Build log:
[...truncated 3373 lines...]
[INFO] Downloaded from central: https://repo.maven.apache.org/maven2/org/apache/maven/shared/maven-common-artifact-filters/3.1.0/maven-common-artifact-filters-3.1.0.pom (5.3 kB at 440 kB/s)
[INFO] Downloading from central: https://repo.maven.apache.org/maven2/org/apache/maven/shared/maven-artifact-transfer/0.11.0/maven-artifact-transfer-0.11.0.pom
[INFO] Downloaded from central: https://repo.maven.apache.org/maven2/org/apache/maven/shared/maven-artifact-transfer/0.11.0/maven-artifact-transfer-0.11.0.pom (11 kB at 954 kB/s)
[INFO] Downloading from central: https://repo.maven.apache.org/maven2/org/codehaus/plexus/plexus-utils/3.1.1/plexus-utils-3.1.1.pom
[INFO] Downloaded from central: https://repo.maven.apache.org/maven2/org/codehaus/plexus/plexus-utils/3.1.1/plexus-utils-3.1.1.pom (5.1 kB at 422 kB/s)
[INFO] Downloading from central: https://repo.maven.apache.org/maven2/org/codehaus/plexus/plexus-component-annotations/2.0.0/plexus-component-annotations-2.0.0.jar
[INFO] Downloading from central: https://repo.maven.apache.org/maven2/org/apache/maven/shared/maven-artifact-transfer/0.11.0/maven-artifact-transfer-0.11.0.jar
[INFO] Downloading from central: https://repo.maven.apache.org/maven2/org/apache/maven/shared/maven-common-artifact-filters/3.1.0/maven-common-artifact-filters-3.1.0.jar
[INFO] Downloaded from central: https://repo.maven.apache.org/maven2/org/codehaus/plexus/plexus-component-annotations/2.0.0/plexus-component-annotations-2.0.0.jar (4.2 kB at 302 kB/s)
[INFO] Downloaded from central: https://repo.maven.apache.org/maven2/org/apache/maven/shared/maven-common-artifact-filters/3.1.0/maven-common-artifact-filters-3.1.0.jar (61 kB at 3.4 MB/s)
[INFO] Downloaded from central: https://repo.maven.apache.org/maven2/org/apache/maven/shared/maven-artifact-transfer/0.11.0/maven-artifact-transfer-0.11.0.jar (128 kB at 6.1 MB/s)
[INFO] Reading assembly descriptor: src/assembly/wrapper/script.xml
[INFO] Reading assembly descriptor: src/assembly/wrapper/bin.xml
[INFO] Reading assembly descriptor: src/assembly/wrapper/source.xml
[INFO] Building tar: /home/jenkins/jenkins-agent/workspace/Maven_maven-box_maven_master/build/apache-maven/target/apache-maven-wrapper-4.0.0-alpha-1-SNAPSHOT-script.tar.gz
[INFO] Building zip: /home/jenkins/jenkins-agent/workspace/Maven_maven-box_maven_master/build/apache-maven/target/apache-maven-wrapper-4.0.0-alpha-1-SNAPSHOT-script.zip
[INFO] Building tar: /home/jenkins/jenkins-agent/workspace/Maven_maven-box_maven_master/build/apache-maven/target/apache-maven-wrapper-4.0.0-alpha-1-SNAPSHOT-bin.tar.gz
[INFO] Building zip: /home/jenkins/jenkins-agent/workspace/Maven_maven-box_maven_master/build/apache-maven/target/apache-maven-wrapper-4.0.0-alpha-1-SNAPSHOT-bin.zip
[INFO] Building tar: /home/jenkins/jenkins-agent/workspace/Maven_maven-box_maven_master/build/apache-maven/target/apache-maven-wrapper-4.0.0-alpha-1-SNAPSHOT-source.tar.gz
[INFO] Building zip: /home/jenkins/jenkins-agent/workspace/Maven_maven-box_maven_master/build/apache-maven/target/apache-maven-wrapper-4.0.0-alpha-1-SNAPSHOT-source.zip
[WARNING] [jenkins-event-spy] Unexpected Maven project file name 'maven-wrapper.pom', problems may occur
[WARNING] [jenkins-event-spy] Unexpected Maven project file name 'maven-wrapper.pom', problems may occur
[INFO]
[INFO] --- maven-checkstyle-plugin:3.0.0:check (checkstyle-check) @ apache-maven-wrapper ---
[WARNING] [jenkins-event-spy] Unexpected Maven project file name 'maven-wrapper.pom', problems may occur
[WARNING] [jenkins-event-spy] Unexpected Maven project file name 'maven-wrapper.pom', problems may occur
[INFO]
[INFO] --- maven-install-plugin:2.5.2:install (default-install) @ apache-maven-wrapper ---
[INFO] Installing /home/jenkins/jenkins-agent/workspace/Maven_maven-box_maven_master/build/apache-maven/maven-wrapper.pom to /home/jenkins/jenkins-agent/workspace/Maven_maven-box_maven_master/build/.repository/org/apache/maven/apache-maven-wrapper/4.0.0-alpha-1-SNAPSHOT/apache-maven-wrapper-4.0.0-alpha-1-SNAPSHOT.pom
[INFO] Installing /home/jenkins/jenkins-agent/workspace/Maven_maven-box_maven_master/build/apache-maven/target/apache-maven-wrapper-4.0.0-alpha-1-SNAPSHOT-site.xml to /home/jenkins/jenkins-agent/workspace/Maven_maven-box_maven_master/build/.repository/org/apache/maven/apache-maven-wrapper/4.0.0-alpha-1-SNAPSHOT/apache-maven-wrapper-4.0.0-alpha-1-SNAPSHOT-site.xml
[INFO] Installing /home/jenkins/jenkins-agent/workspace/Maven_maven-box_maven_master/build/apache-maven/target/apache-maven-wrapper-4.0.0-alpha-1-SNAPSHOT-script.tar.gz to /home/jenkins/jenkins-agent/workspace/Maven_maven-box_maven_master/build/.repository/org/apache/maven/apache-maven-wrapper/4.0.0-alpha-1-SNAPSHOT/apache-maven-wrapper-4.0.0-alpha-1-SNAPSHOT-script.tar.gz
[INFO] Installing /home/jenkins/jenkins-agent/workspace/Maven_maven-box_maven_master/build/apache-maven/target/apache-maven-wrapper-4.0.0-alpha-1-SNAPSHOT-script.zip to /home/jenkins/jenkins-agent/workspace/Maven_maven-box_maven_master/build/.repository/org/apache/maven/apache-maven-wrapper/4.0.0-alpha-1-SNAPSHOT/apache-maven-wrapper-4.0.0-alpha-1-SNAPSHOT-script.zip
[INFO] Installing /home/jenkins/jenkins-agent/workspace/Maven_maven-box_maven_master/build/apache-maven/target/apache-maven-wrapper-4.0.0-alpha-1-SNAPSHOT-bin.tar.gz to /home/jenkins/jenkins-agent/workspace/Maven_maven-box_maven_master/build/.repository/org/apache/maven/apache-maven-wrapper/4.0.0-alpha-1-SNAPSHOT/apache-maven-wrapper-4.0.0-alpha-1-SNAPSHOT-bin.tar.gz
[INFO] Installing /home/jenkins/jenkins-agent/workspace/Maven_maven-box_maven_master/build/apache-maven/target/apache-maven-wrapper-4.0.0-alpha-1-SNAPSHOT-bin.zip to /home/jenkins/jenkins-agent/workspace/Maven_maven-box_maven_master/build/.repository/org/apache/maven/apache-maven-wrapper/4.0.0-alpha-1-SNAPSHOT/apache-maven-wrapper-4.0.0-alpha-1-SNAPSHOT-bin.zip
[INFO] Installing /home/jenkins/jenkins-agent/workspace/Maven_maven-box_maven_master/build/apache-maven/target/apache-maven-wrapper-4.0.0-alpha-1-SNAPSHOT-source.tar.gz to /home/jenkins/jenkins-agent/workspace/Maven_maven-box_maven_master/build/.repository/org/apache/maven/apache-maven-wrapper/4.0.0-alpha-1-SNAPSHOT/apache-maven-wrapper-4.0.0-alpha-1-SNAPSHOT-source.tar.gz
[INFO] Installing /home/jenkins/jenkins-agent/workspace/Maven_maven-box_maven_master/build/apache-maven/target/apache-maven-wrapper-4.0.0-alpha-1-SNAPSHOT-source.zip to /home/jenkins/jenkins-agent/workspace/Maven_maven-box_maven_master/build/.repository/org/apache/maven/apache-maven-wrapper/4.0.0-alpha-1-SNAPSHOT/apache-maven-wrapper-4.0.0-alpha-1-SNAPSHOT-source.zip
[WARNING] [jenkins-event-spy] Unexpected Maven project file name 'maven-wrapper.pom', problems may occur
[WARNING] [jenkins-event-spy] Unexpected Maven project file name 'maven-wrapper.pom', problems may occur
[INFO]
[INFO] --- maven-deploy-plugin:2.8.2:deploy (default-deploy) @ apache-maven-wrapper ---
[INFO] Downloading from apache.snapshots.https: https://repository.apache.org/content/repositories/snapshots/org/apache/maven/apache-maven-wrapper/4.0.0-alpha-1-SNAPSHOT/maven-metadata.xml
[INFO] Downloaded from apache.snapshots.https: https://repository.apache.org/content/repositories/snapshots/org/apache/maven/apache-maven-wrapper/4.0.0-alpha-1-SNAPSHOT/maven-metadata.xml (2.2 kB at 4.6 kB/s)
[INFO] Uploading to apache.snapshots.https: https://repository.apache.org/content/repositories/snapshots/org/apache/maven/apache-maven-wrapper/4.0.0-alpha-1-SNAPSHOT/apache-maven-wrapper-4.0.0-alpha-1-20210111.142551-32.pom
[INFO] Uploaded to apache.snapshots.https: https://repository.apache.org/content/repositories/snapshots/org/apache/maven/apache-maven-wrapper/4.0.0-alpha-1-SNAPSHOT/apache-maven-wrapper-4.0.0-alpha-1-20210111.142551-32.pom (5.4 kB at 4.5 kB/s)
[INFO] Downloading from apache.snapshots.https: https://repository.apache.org/content/repositories/snapshots/org/apache/maven/apache-maven-wrapper/maven-metadata.xml
[INFO] Downloaded from apache.snapshots.https: https://repository.apache.org/content/repositories/snapshots/org/apache/maven/apache-maven-wrapper/maven-metadata.xml (412 B at 955 B/s)
[INFO] Uploading to apache.snapshots.https: https://repository.apache.org/content/repositories/snapshots/org/apache/maven/apache-maven-wrapper/4.0.0-alpha-1-SNAPSHOT/maven-metadata.xml
[INFO] Uploaded to apache.snapshots.https: https://repository.apache.org/content/repositories/snapshots/org/apache/maven/apache-maven-wrapper/4.0.0-alpha-1-SNAPSHOT/maven-metadata.xml (2.2 kB at 2.3 kB/s)
[INFO] Uploading to apache.snapshots.https: https://repository.apache.org/content/repositories/snapshots/org/apache/maven/apache-maven-wrapper/maven-metadata.xml
[INFO] Uploaded to apache.snapshots.https: https://repository.apache.org/content/repositories/snapshots/org/apache/maven/apache-maven-wrapper/maven-metadata.xml (412 B at 401 B/s)
[INFO] Uploading to apache.snapshots.https: https://repository.apache.org/content/repositories/snapshots/org/apache/maven/apache-maven-wrapper/4.0.0-alpha-1-SNAPSHOT/apache-maven-wrapper-4.0.0-alpha-1-20210111.142551-32-site.xml
[INFO] Uploaded to apache.snapshots.https: https://repository.apache.org/content/repositories/snapshots/org/apache/maven/apache-maven-wrapper/4.0.0-alpha-1-SNAPSHOT/apache-maven-wrapper-4.0.0-alpha-1-20210111.142551-32-site.xml (1.1 kB at 1.1 kB/s)
[INFO] Uploading to apache.snapshots.https: https://repository.apache.org/content/repositories/snapshots/org/apache/maven/apache-maven-wrapper/4.0.0-alpha-1-SNAPSHOT/maven-metadata.xml
[INFO] Uploaded to apache.snapshots.https: https://repository.apache.org/content/repositories/snapshots/org/apache/maven/apache-maven-wrapper/4.0.0-alpha-1-SNAPSHOT/maven-metadata.xml (2.2 kB at 2.3 kB/s)
[INFO] Uploading to apache.snapshots.https: https://repository.apache.org/content/repositories/snapshots/org/apache/maven/apache-maven-wrapper/4.0.0-alpha-1-SNAPSHOT/apache-maven-wrapper-4.0.0-alpha-1-20210111.142551-32-script.tar.gz
[INFO] Uploaded to apache.snapshots.https: https://repository.apache.org/content/repositories/snapshots/org/apache/maven/apache-maven-wrapper/4.0.0-alpha-1-SNAPSHOT/apache-maven-wrapper-4.0.0-alpha-1-20210111.142551-32-script.tar.gz (5.2 kB at 5.3 kB/s)
[INFO] Uploading to apache.snapshots.https: https://repository.apache.org/content/repositories/snapshots/org/apache/maven/apache-maven-wrapper/4.0.0-alpha-1-SNAPSHOT/maven-metadata.xml
[INFO] Uploaded to apache.snapshots.https: https://repository.apache.org/content/repositories/snapshots/org/apache/maven/apache-maven-wrapper/4.0.0-alpha-1-SNAPSHOT/maven-metadata.xml (2.2 kB at 829 B/s)
[INFO] Uploading to apache.snapshots.https: https://repository.apache.org/content/repositories/snapshots/org/apache/maven/apache-maven-wrapper/4.0.0-alpha-1-SNAPSHOT/apache-maven-wrapper-4.0.0-alpha-1-20210111.142551-32-script.zip
[INFO] Uploaded to apache.snapshots.https: https://repository.apache.org/content/repositories/snapshots/org/apache/maven/apache-maven-wrapper/4.0.0-alpha-1-SNAPSHOT/apache-maven-wrapper-4.0.0-alpha-1-20210111.142551-32-script.zip (8.4 kB at 2.8 kB/s)
[INFO] Uploading to apache.snapshots.https: https://repository.apache.org/content/repositories/snapshots/org/apache/maven/apache-maven-wrapper/4.0.0-alpha-1-SNAPSHOT/maven-metadata.xml
[INFO] Uploaded to apache.snapshots.https: https://repository.apache.org/content/repositories/snapshots/org/apache/maven/apache-maven-wrapper/4.0.0-alpha-1-SNAPSHOT/maven-metadata.xml (2.2 kB at 2.3 kB/s)
[INFO] Uploading to apache.snapshots.https: https://repository.apache.org/content/repositories/snapshots/org/apache/maven/apache-maven-wrapper/4.0.0-alpha-1-SNAPSHOT/apache-maven-wrapper-4.0.0-alpha-1-20210111.142551-32-bin.tar.gz
[INFO] Uploaded to apache.snapshots.https: https://repository.apache.org/content/repositories/snapshots/org/apache/maven/apache-maven-wrapper/4.0.0-alpha-1-SNAPSHOT/apache-maven-wrapper-4.0.0-alpha-1-20210111.142551-32-bin.tar.gz (32 kB at 29 kB/s)
[INFO] Uploading to apache.snapshots.https: https://repository.apache.org/content/repositories/snapshots/org/apache/maven/apache-maven-wrapper/4.0.0-alpha-1-SNAPSHOT/maven-metadata.xml
[INFO] Uploaded to apache.snapshots.https: https://repository.apache.org/content/repositories/snapshots/org/apache/maven/apache-maven-wrapper/4.0.0-alpha-1-SNAPSHOT/maven-metadata.xml (2.2 kB at 2.3 kB/s)
[INFO] Uploading to apache.snapshots.https: https://repository.apache.org/content/repositories/snapshots/org/apache/maven/apache-maven-wrapper/4.0.0-alpha-1-SNAPSHOT/apache-maven-wrapper-4.0.0-alpha-1-20210111.142551-32-bin.zip
[INFO] Uploaded to apache.snapshots.https: https://repository.apache.org/content/repositories/snapshots/org/apache/maven/apache-maven-wrapper/4.0.0-alpha-1-SNAPSHOT/apache-maven-wrapper-4.0.0-alpha-1-20210111.142551-32-bin.zip (34 kB at 23 kB/s)
[INFO] Uploading to apache.snapshots.https: https://repository.apache.org/content/repositories/snapshots/org/apache/maven/apache-maven-wrapper/4.0.0-alpha-1-SNAPSHOT/maven-metadata.xml
[INFO] Uploaded to apache.snapshots.https: https://repository.apache.org/content/repositories/snapshots/org/apache/maven/apache-maven-wrapper/4.0.0-alpha-1-SNAPSHOT/maven-metadata.xml (2.2 kB at 2.2 kB/s)
[INFO] Uploading to apache.snapshots.https: https://repository.apache.org/content/repositories/snapshots/org/apache/maven/apache-maven-wrapper/4.0.0-alpha-1-SNAPSHOT/apache-maven-wrapper-4.0.0-alpha-1-20210111.142551-32-source.tar.gz
[INFO] Uploaded to apache.snapshots.https: https://repository.apache.org/content/repositories/snapshots/org/apache/maven/apache-maven-wrapper/4.0.0-alpha-1-SNAPSHOT/apache-maven-wrapper-4.0.0-alpha-1-20210111.142551-32-source.tar.gz (6.2 kB at 6.6 kB/s)
[INFO] Uploading to apache.snapshots.https: https://repository.apache.org/content/repositories/snapshots/org/apache/maven/apache-maven-wrapper/4.0.0-alpha-1-SNAPSHOT/maven-metadata.xml
[INFO] Uploaded to apache.snapshots.https: https://repository.apache.org/content/repositories/snapshots/org/apache/maven/apache-maven-wrapper/4.0.0-alpha-1-SNAPSHOT/maven-metadata.xml (2.2 kB at 2.3 kB/s)
[INFO] Uploading to apache.snapshots.https: https://repository.apache.org/content/repositories/snapshots/org/apache/maven/apache-maven-wrapper/4.0.0-alpha-1-SNAPSHOT/apache-maven-wrapper-4.0.0-alpha-1-20210111.142551-32-source.zip
[INFO] Uploaded to apache.snapshots.https: https://repository.apache.org/content/repositories/snapshots/org/apache/maven/apache-maven-wrapper/4.0.0-alpha-1-SNAPSHOT/apache-maven-wrapper-4.0.0-alpha-1-20210111.142551-32-source.zip (9.8 kB at 10 kB/s)
[INFO] Uploading to apache.snapshots.https: https://repository.apache.org/content/repositories/snapshots/org/apache/maven/apache-maven-wrapper/4.0.0-alpha-1-SNAPSHOT/maven-metadata.xml
[INFO] Uploaded to apache.snapshots.https: https://repository.apache.org/content/repositories/snapshots/org/apache/maven/apache-maven-wrapper/4.0.0-alpha-1-SNAPSHOT/maven-metadata.xml (2.2 kB at 2.3 kB/s)
[WARNING] [jenkins-event-spy] Unexpected Maven project file name 'maven-wrapper.pom', problems may occur
[WARNING] [jenkins-event-spy] Unexpected Maven project file name 'maven-wrapper.pom', problems may occur
[INFO] ------------------------------------------------------------------------
[INFO] Reactor Summary for Apache Maven 4.0.0-alpha-1-SNAPSHOT:
[INFO]
[INFO] Apache Maven ....................................... SUCCESS [ 22.213 s]
[INFO] Maven Model ........................................ SUCCESS [ 14.681 s]
[INFO] Maven Artifact ..................................... FAILURE [  4.295 s]
[INFO] Maven Plugin API ................................... SKIPPED
[INFO] Maven Builder Support .............................. SUCCESS [  9.742 s]
[INFO] Maven XML .......................................... SUCCESS [  8.944 s]
[INFO] Maven Model Builder ................................ SKIPPED
[INFO] Maven Settings ..................................... SUCCESS [  6.623 s]
[INFO] Maven Settings Builder ............................. SUCCESS [  8.115 s]
[INFO] Maven Repository Metadata Model .................... SUCCESS [  6.414 s]
[INFO] Maven Artifact Resolver Provider ................... SKIPPED
[INFO] Maven Core ......................................... SKIPPED
[INFO] Maven SLF4J Wrapper ................................ SUCCESS [  8.948 s]
[INFO] Maven SLF4J Simple Provider ........................ SUCCESS [  8.018 s]
[INFO] Maven Embedder ..................................... SKIPPED
[INFO] Maven Compat ....................................... SKIPPED
[INFO] Apache Maven Distribution .......................... SKIPPED
[INFO] Maven Wrapper ...................................... SUCCESS [  8.590 s]
[INFO] Apache Maven Wrapper Distribution .................. SUCCESS [ 23.865 s]
[INFO] ------------------------------------------------------------------------
[INFO] BUILD FAILURE
[INFO] ------------------------------------------------------------------------
[INFO] Total time:  02:10 min
[INFO] Finished at: 2021-01-11T14:26:12Z
[INFO] ------------------------------------------------------------------------
[WARNING] [jenkins-event-spy] Unexpected Maven project file name 'maven-wrapper.pom', problems may occur
[INFO] [jenkins-event-spy] Generated /home/jenkins/jenkins-agent/workspace/Maven_maven-box_maven_master/build@tmp/withMavene24e04d8/maven-spy-20210111-142401-6965279387196590211674.log
[ERROR] Failed to execute goal org.apache.maven.plugins:maven-checkstyle-plugin:3.0.0:check (checkstyle-check) on project maven-artifact: You have 1 Checkstyle violation. -> [Help 1]
org.apache.maven.lifecycle.LifecycleExecutionException: Failed to execute goal org.apache.maven.plugins:maven-checkstyle-plugin:3.0.0:check (checkstyle-check) on project maven-artifact: You have 1 Checkstyle violation.
    at org.apache.maven.lifecycle.internal.MojoExecutor.execute (MojoExecutor.java:215)
    at org.apache.maven.lifecycle.internal.MojoExecutor.execute (MojoExecutor.java:156)
    at org.apache.maven.lifecycle.internal.MojoExecutor.execute (MojoExecutor.java:148)
    at org.apache.maven.lifecycle.internal.LifecycleModuleBuilder.buildProject (LifecycleModuleBuilder.java:117)
    at org.apache.maven.lifecycle.internal.LifecycleModuleBuilder.buildProject (LifecycleModuleBuilder.java:81)
    at org.apache.maven.lifecycle.internal.builder.singlethreaded.SingleThreadedBuilder.build (SingleThreadedBuilder.java:56)
    at org.apache.maven.lifecycle.internal.LifecycleStarter.execute (LifecycleStarter.java:128)
    at org.apache.maven.DefaultMaven.doExecute (DefaultMaven.java:305)
    at org.apache.maven.DefaultMaven.doExecute (DefaultMaven.java:192)
    at org.apache.maven.DefaultMaven.execute (DefaultMaven.java:105)
    at org.apache.maven.cli.MavenCli.execute (MavenCli.java:957)
    at org.apache.maven.cli.MavenCli.doMain (MavenCli.java:289)
    at org.apache.maven.cli.MavenCli.main (MavenCli.java:193)
    at sun.reflect.NativeMethodAccessorImpl.invoke0 (Native Method)
    at sun.reflect.NativeMethodAccessorImpl.invoke (NativeMethodAccessorImpl.java:62)
    at sun.reflect.DelegatingMethodAccessorImpl.invoke (DelegatingMethodAccessorImpl.java:43)
    at java.lang.reflect.Method.invoke (Method.java:498)
    at org.codehaus.plexus.classworlds.launcher.Launcher.launchEnhanced (Launcher.java:282)
    at org.codehaus.plexus.classworlds.launcher.Launcher.launch (Launcher.java:225)
    at org.codehaus.plexus.classworlds.launcher.Launcher.mainWithExitCode (Launcher.java:406)
    at org.codehaus.plexus.classworlds.launcher.Launcher.main (Launcher.java:347)
Caused by: org.apache.maven.plugin.MojoFailureException: You have 1 Checkstyle violation.
    at org.apache.maven.plugins.checkstyle.CheckstyleViolationCheckMojo.execute (CheckstyleViolationCheckMojo.java:576)
    at org.apache.maven.plugin.DefaultBuildPluginManager.executeMojo (DefaultBuildPluginManager.java:137)
    at org.apache.maven.lifecycle.internal.MojoExecutor.execute (MojoExecutor.java:210)
    at org.apache.maven.lifecycle.internal.MojoExecutor.execute (MojoExecutor.java:156)
    at org.apache.maven.lifecycle.internal.MojoExecutor.execute (MojoExecutor.java:148)
    at org.apache.maven.lifecycle.internal.LifecycleModuleBuilder.buildProject (LifecycleModuleBuilder.java:117)
    at org.apache.maven.lifecycle.internal.LifecycleModuleBuilder.buildProject (LifecycleModuleBuilder.java:81)
    at org.apache.maven.lifecycle.internal.builder.singlethreaded.SingleThreadedBuilder.build (SingleThreadedBuilder.java:56)
    at org.apache.maven.lifecycle.internal.LifecycleStarter.execute (LifecycleStarter.java:128)
    at org.apache.maven.DefaultMaven.doExecute (DefaultMaven.java:305)
    at org.apache.maven.DefaultMaven.doExecute (DefaultMaven.java:192)
    at org.apache.maven.DefaultMaven.execute (DefaultMaven.java:105)
    at org.apache.maven.cli.MavenCli.execute (MavenCli.java:957)
    at org.apache.maven.cli.MavenCli.doMain (MavenCli.java:289)
    at org.apache.maven.cli.MavenCli.main (MavenCli.java:193)
    at sun.reflect.NativeMethodAccessorImpl.invoke0 (Native Method)
    at sun.reflect.NativeMethodAccessorImpl.invoke (NativeMethodAccessorImpl.java:62)
    at sun.reflect.DelegatingMethodAccessorImpl.invoke (DelegatingMethodAccessorImpl.java:43)
    at java.lang.reflect.Method.invoke (Method.java:498)
    at org.codehaus.plexus.classworlds.launcher.Launcher.launchEnhanced (Launcher.java:282)
    at org.codehaus.plexus.classworlds.launcher.Launcher.launch (Launcher.java:225)
    at org.codehaus.plexus.classworlds.launcher.Launcher.mainWithExitCode (Launcher.java:406)
    at org.codehaus.plexus.classworlds.launcher.Launcher.main (Launcher.java:347)
[ERROR]
[ERROR] Re-run Maven using the -X switch to enable full debug logging.
[ERROR]
[ERROR] For more information about the errors and possible solutions, please read the following articles:
[ERROR] [Help 1] http://cwiki.apache.org/confluence/display/MAVEN/MojoFailureException
[ERROR]
[ERROR] After correcting the problems, you can resume the build with the command
[ERROR]   mvn <args> -rf :maven-artifact
[Pipeline] }
[withMaven] artifactsPublisher - Archive artifact pom.xml under org/apache/maven/maven/4.0.0-alpha-1-SNAPSHOT/maven-4.0.0-alpha-1-SNAPSHOT.pom
[withMaven] artifactsPublisher - Archive artifact maven-model/pom.xml under org/apache/maven/maven-model/4.0.0-alpha-1-SNAPSHOT/maven-model-4.0.0-alpha-1-SNAPSHOT.pom
[withMaven] artifactsPublisher - Archive artifact maven-artifact/pom.xml under org/apache/maven/maven-artifact/4.0.0-alpha-1-SNAPSHOT/maven-artifact-4.0.0-alpha-1-SNAPSHOT.pom
[withMaven] artifactsPublisher - Archive artifact maven-plugin-api/pom.xml under org/apache/maven/maven-plugin-api/4.0.0-alpha-1-SNAPSHOT/maven-plugin-api-4.0.0-alpha-1-SNAPSHOT.pom
[withMaven] artifactsPublisher - Archive artifact maven-builder-support/pom.xml under org/apache/maven/maven-builder-support/4.0.0-alpha-1-SNAPSHOT/maven-builder-support-4.0.0-alpha-1-SNAPSHOT.pom
[withMaven] artifactsPublisher - Archive artifact maven-xml/pom.xml under org/apache/maven/maven-xml/4.0.0-alpha-1-SNAPSHOT/maven-xml-4.0.0-alpha-1-SNAPSHOT.pom
[withMaven] artifactsPublisher - Archive artifact maven-model-builder/pom.xml under org/apache/maven/maven-model-builder/4.0.0-alpha-1-SNAPSHOT/maven-model-builder-4.0.0-alpha-1-SNAPSHOT.pom
[withMaven] artifactsPublisher - Archive artifact maven-settings/pom.xml under org/apache/maven/maven-settings/4.0.0-alpha-1-SNAPSHOT/maven-settings-4.0.0-alpha-1-SNAPSHOT.pom
[withMaven] artifactsPublisher - Archive artifact maven-settings-builder/pom.xml under org/apache/maven/maven-settings-builder/4.0.0-alpha-1-SNAPSHOT/maven-settings-builder-4.0.0-alpha-1-SNAPSHOT.pom
[withMaven] artifactsPublisher - Archive artifact maven-repository-metadata/pom.xml under org/apache/maven/maven-repository-metadata/4.0.0-alpha-1-SNAPSHOT/maven-repository-metadata-4.0.0-alpha-1-SNAPSHOT.pom
[withMaven] artifactsPublisher - Archive artifact maven-resolver-provider/pom.xml under org/apache/maven/maven-resolver-provider/4.0.0-alpha-1-SNAPSHOT/maven-resolver-provider-4.0.0-alpha-1-SNAPSHOT.pom
[withMaven] artifactsPublisher - Archive artifact maven-core/pom.xml under org/apache/maven/maven-core/4.0.0-alpha-1-SNAPSHOT/maven-core-4.0.0-alpha-1-SNAPSHOT.pom
[withMaven] artifactsPublisher - Archive artifact maven-slf4j-wrapper/pom.xml under org/apache/maven/maven-slf4j-wrapper/4.0.0-alpha-1-SNAPSHOT/maven-slf4j-wrapper-4.0.0-alpha-1-SNAPSHOT.pom
[withMaven] artifactsPublisher - Archive artifact maven-slf4j-provider/pom.xml under org/apache/maven/maven-slf4j-provider/4.0.0-alpha-1-SNAPSHOT/maven-slf4j-provider-4.0.0-alpha-1-SNAPSHOT.pom
[withMaven] artifactsPublisher - Archive artifact maven-embedder/pom.xml under org/apache/maven/maven-embedder/4.0.0-alpha-1-SNAPSHOT/maven-embedder-4.0.0-alpha-1-SNAPSHOT.pom
[withMaven] artifactsPublisher - Archive artifact maven-compat/pom.xml under org/apache/maven/maven-compat/4.0.0-alpha-1-SNAPSHOT/maven-compat-4.0.0-alpha-1-SNAPSHOT.pom
[withMaven] artifactsPublisher - Archive artifact apache-maven/pom.xml under org/apache/maven/apache-maven/4.0.0-alpha-1-SNAPSHOT/apache-maven-4.0.0-alpha-1-SNAPSHOT.pom
[withMaven] artifactsPublisher - Archive artifact maven-wrapper/pom.xml under org/apache/maven/maven-wrapper/4.0.0-alpha-1-SNAPSHOT/maven-wrapper-4.0.0-alpha-1-SNAPSHOT.pom
[withMaven] artifactsPublisher - Archive artifact apache-maven/maven-wrapper.pom under org/apache/maven/apache-maven-wrapper/4.0.0-alpha-1-SNAPSHOT/apache-maven-wrapper-4.0.0-alpha-1-SNAPSHOT.pom
[withMaven] Publishers: Generated Artifacts Publisher: 11906 ms, Pipeline Graph Publisher: 8 ms
[withMaven] artifactsPublisher - Archive artifact pom.xml under org/apache/maven/maven/4.0.0-alpha-1-SNAPSHOT/maven-4.0.0-alpha-1-SNAPSHOT.pom
[withMaven] artifactsPublisher - Archive artifact target/maven-4.0.0-alpha-1-SNAPSHOT-site.xml under org/apache/maven/maven/4.0.0-alpha-1-SNAPSHOT/maven-4.0.0-alpha-1-SNAPSHOT-site.xml
[withMaven] artifactsPublisher - Archive artifact maven-model/pom.xml under org/apache/maven/maven-model/4.0.0-alpha-1-SNAPSHOT/maven-model-4.0.0-alpha-1-SNAPSHOT.pom
[withMaven] artifactsPublisher - Archive artifact maven-model/target/maven-model-4.0.0-alpha-1-SNAPSHOT.jar under org/apache/maven/maven-model/4.0.0-alpha-1-SNAPSHOT/maven-model-4.0.0-alpha-1-SNAPSHOT.jar
[withMaven] artifactsPublisher - Archive artifact maven-builder-support/pom.xml under org/apache/maven/maven-builder-support/4.0.0-alpha-1-SNAPSHOT/maven-builder-support-4.0.0-alpha-1-SNAPSHOT.pom
[withMaven] artifactsPublisher - Archive artifact maven-builder-support/target/maven-builder-support-4.0.0-alpha-1-SNAPSHOT.jar under org/apache/maven/maven-builder-support/4.0.0-alpha-1-SNAPSHOT/maven-builder-support-4.0.0-alpha-1-SNAPSHOT.jar
[withMaven] artifactsPublisher - Archive artifact maven-xml/pom.xml under org/apache/maven/maven-xml/4.0.0-alpha-1-SNAPSHOT/maven-xml-4.0.0-alpha-1-SNAPSHOT.pom
[withMaven] artifactsPublisher - Archive artifact maven-xml/target/maven-xml-4.0.0-alpha-1-SNAPSHOT.jar under org/apache/maven/maven-xml/4.0.0-alpha-1-SNAPSHOT/maven-xml-4.0.0-alpha-1-SNAPSHOT.jar
[withMaven] artifactsPublisher - Archive artifact maven-settings/pom.xml under org/apache/maven/maven-settings/4.0.0-alpha-1-SNAPSHOT/maven-settings-4.0.0-alpha-1-SNAPSHOT.pom
[withMaven] artifactsPublisher - Archive artifact maven-settings/target/maven-settings-4.0.0-alpha-1-SNAPSHOT.jar under org/apache/maven/maven-settings/4.0.0-alpha-1-SNAPSHOT/maven-settings-4.0.0-alpha-1-SNAPSHOT.jar
[withMaven] artifactsPublisher - Archive artifact maven-settings-builder/pom.xml under org/apache/maven/maven-settings-builder/4.0.0-alpha-1-SNAPSHOT/maven-settings-builder-4.0.0-alpha-1-SNAPSHOT.pom
[withMaven] artifactsPublisher - Archive artifact maven-settings-builder/target/maven-settings-builder-4.0.0-alpha-1-SNAPSHOT.jar under org/apache/maven/maven-settings-builder/4.0.0-alpha-1-SNAPSHOT/maven-settings-builder-4.0.0-alpha-1-SNAPSHOT.jar
[withMaven] artifactsPublisher - Archive artifact maven-repository-metadata/pom.xml under org/apache/maven/maven-repository-metadata/4.0.0-alpha-1-SNAPSHOT/maven-repository-metadata-4.0.0-alpha-1-SNAPSHOT.pom
[withMaven] artifactsPublisher - Archive artifact maven-repository-metadata/target/maven-repository-metadata-4.0.0-alpha-1-SNAPSHOT.jar under org/apache/maven/maven-repository-metadata/4.0.0-alpha-1-SNAPSHOT/maven-repository-metadata-4.0.0-alpha-1-SNAPSHOT.jar
[withMaven] artifactsPublisher - Archive artifact maven-slf4j-wrapper/pom.xml under org/apache/maven/maven-slf4j-wrapper/4.0.0-alpha-1-SNAPSHOT/maven-slf4j-wrapper-4.0.0-alpha-1-SNAPSHOT.pom
[withMaven] artifactsPublisher - Archive artifact maven-slf4j-wrapper/target/maven-slf4j-wrapper-4.0.0-alpha-1-SNAPSHOT.jar under org/apache/maven/maven-slf4j-wrapper/4.0.0-alpha-1-SNAPSHOT/maven-slf4j-wrapper-4.0.0-alpha-1-SNAPSHOT.jar
[withMaven] artifactsPublisher - Archive artifact maven-slf4j-provider/pom.xml under org/apache/maven/maven-slf4j-provider/4.0.0-alpha-1-SNAPSHOT/maven-slf4j-provider-4.0.0-alpha-1-SNAPSHOT.pom
[withMaven] artifactsPublisher - Archive artifact maven-slf4j-provider/target/maven-slf4j-provider-4.0.0-alpha-1-SNAPSHOT.jar under org/apache/maven/maven-slf4j-provider/4.0.0-alpha-1-SNAPSHOT/maven-slf4j-provider-4.0.0-alpha-1-SNAPSHOT.jar
[withMaven] artifactsPublisher - Archive artifact maven-wrapper/pom.xml under org/apache/maven/maven-wrapper/4.0.0-alpha-1-SNAPSHOT/maven-wrapper-4.0.0-alpha-1-SNAPSHOT.pom
[withMaven] artifactsPublisher - Archive artifact maven-wrapper/target/maven-wrapper.jar under org/apache/maven/maven-wrapper/4.0.0-alpha-1-SNAPSHOT/maven-wrapper-4.0.0-alpha-1-SNAPSHOT.jar
[withMaven] artifactsPublisher - Archive artifact apache-maven/maven-wrapper.pom under org/apache/maven/apache-maven-wrapper/4.0.0-alpha-1-SNAPSHOT/apache-maven-wrapper-4.0.0-alpha-1-SNAPSHOT.pom
[withMaven] artifactsPublisher - Archive artifact apache-maven/target/apache-maven-wrapper-4.0.0-alpha-1-SNAPSHOT-site.xml under org/apache/maven/apache-maven-wrapper/4.0.0-alpha-1-SNAPSHOT/apache-maven-wrapper-4.0.0-alpha-1-SNAPSHOT-site.xml
[withMaven] artifactsPublisher - Archive artifact apache-maven/target/apache-maven-wrapper-4.0.0-alpha-1-SNAPSHOT-script.tar.gz under org/apache/maven/apache-maven-wrapper/4.0.0-alpha-1-SNAPSHOT/apache-maven-wrapper-4.0.0-alpha-1-SNAPSHOT-script.tar.gz
[withMaven] artifactsPublisher - Archive artifact apache-maven/target/apache-maven-wrapper-4.0.0-alpha-1-SNAPSHOT-script.zip under org/apache/maven/apache-maven-wrapper/4.0.0-alpha-1-SNAPSHOT/apache-maven-wrapper-4.0.0-alpha-1-SNAPSHOT-script.zip
[withMaven] artifactsPublisher - Archive artifact apache-maven/target/apache-maven-wrapper-4.0.0-alpha-1-SNAPSHOT-bin.tar.gz under org/apache/maven/apache-maven-wrapper/4.0.0-alpha-1-SNAPSHOT/apache-maven-wrapper-4.0.0-alpha-1-SNAPSHOT-bin.tar.gz
[withMaven] artifactsPublisher - Archive artifact apache-maven/target/apache-maven-wrapper-4.0.0-alpha-1-SNAPSHOT-bin.zip under org/apache/maven/apache-maven-wrapper/4.0.0-alpha-1-SNAPSHOT/apache-maven-wrapper-4.0.0-alpha-1-SNAPSHOT-bin.zip
[withMaven] artifactsPublisher - Archive artifact apache-maven/target/apache-maven-wrapper-4.0.0-alpha-1-SNAPSHOT-source.tar.gz under org/apache/maven/apache-maven-wrapper/4.0.0-alpha-1-SNAPSHOT/apache-maven-wrapper-4.0.0-alpha-1-SNAPSHOT-source.tar.gz
[withMaven] artifactsPublisher - Archive artifact apache-maven/target/apache-maven-wrapper-4.0.0-alpha-1-SNAPSHOT-source.zip under org/apache/maven/apache-maven-wrapper/4.0.0-alpha-1-SNAPSHOT/apache-maven-wrapper-4.0.0-alpha-1-SNAPSHOT-source.zip
[Fast Archiver] Compressed 568.29 KB of artifacts by 73.2% relative to #91
[withMaven] junitPublisher - Archive test results for Maven artifact org.apache.maven:maven-model:jar:4.0.0-alpha-1-SNAPSHOT generated by maven-surefire-plugin:test (default-test): maven-model/target/surefire-reports/*.xml
[withMaven] junitPublisher - Archive test results for Maven artifact org.apache.maven:maven-artifact:jar:4.0.0-alpha-1-SNAPSHOT generated by maven-surefire-plugin:test (default-test): maven-artifact/target/surefire-reports/*.xml
[withMaven] junitPublisher - Archive test results for Maven artifact org.apache.maven:maven-builder-support:jar:4.0.0-alpha-1-SNAPSHOT generated by maven-surefire-plugin:test (default-test): maven-builder-support/target/surefire-reports/*.xml
[withMaven] junitPublisher - Archive test results for Maven artifact org.apache.maven:maven-xml:jar:4.0.0-alpha-1-SNAPSHOT generated by maven-surefire-plugin:test (default-test): maven-xml/target/surefire-reports/*.xml
[withMaven] junitPublisher - Archive test results for Maven artifact org.apache.maven:maven-settings:jar:4.0.0-alpha-1-SNAPSHOT generated by maven-surefire-plugin:test (default-test): maven-settings/target/surefire-reports/*.xml
[withMaven] junitPublisher - Archive test results for Maven artifact org.apache.maven:maven-settings-builder:jar:4.0.0-alpha-1-SNAPSHOT generated by maven-surefire-plugin:test (default-test): maven-settings-builder/target/surefire-reports/*.xml
[withMaven] junitPublisher - Archive test results for Maven artifact org.apache.maven:maven-repository-metadata:jar:4.0.0-alpha-1-SNAPSHOT generated by maven-surefire-plugin:test (default-test): maven-repository-metadata/target/surefire-reports/*.xml
[withMaven] junitPublisher - Archive test results for Maven artifact org.apache.maven:maven-slf4j-wrapper:jar:4.0.0-alpha-1-SNAPSHOT generated by maven-surefire-plugin:test (default-test): maven-slf4j-wrapper/target/surefire-reports/*.xml
[withMaven] junitPublisher - Archive test results for Maven artifact org.apache.maven:maven-slf4j-provider:jar:4.0.0-alpha-1-SNAPSHOT generated by maven-surefire-plugin:test (default-test): maven-slf4j-provider/target/surefire-reports/*.xml
[withMaven] junitPublisher - Archive test results for Maven artifact org.apache.maven:maven-wrapper:jar:4.0.0-alpha-1-SNAPSHOT generated by maven-surefire-plugin:test (default-test): maven-wrapper/target/surefire-reports/*.xml
Recording test results
[withMaven] junitPublisher - Archive test results for Maven artifact org.apache.maven:maven-artifact:jar:4.0.0-alpha-1-SNAPSHOT generated by maven-failsafe-plugin:integration-test (default): maven-artifact/target/failsafe-reports/*.xml
Recording test results
[withMaven] Publishers: Generated Artifacts Publisher: 12519 ms, Junit Publisher: 37790 ms, Dependencies Fingerprint Publisher: 1662 ms, Pipeline Graph Publisher: 3 ms
[Pipeline] // withMaven
[Pipeline] }
[Pipeline] // stage
[Pipeline] }
[Pipeline] // dir
[Pipeline] }
[Pipeline] // node
[Pipeline] echo
[FAILURE-003] AbortException hudson.AbortException: script returned exit code 1
[Pipeline] stage
[Pipeline] { (Notifications)
[Pipeline] echo
Build result: FAILURE
[Pipeline] jiraIssueSelector
[Pipeline] jiraComment
[Pipeline] echo
The authors of changes [dennisl].
[Pipeline] echo
Sending email ...
[Pipeline] emailext
Reply | Threaded
Open this post in threaded view
|

Build succeeded in Jenkins: Maven » Maven TLP » maven » master #93

Apache Jenkins Server-2
See https://ci-builds.apache.org/job/Maven/job/maven-box/job/maven/job/master/93/

Changes:

* Fix Checkstyle violation.

All tests passed