Build failed in Jenkins: Maven » Maven TLP » maven » master #89

Previous Topic Next Topic
 
classic Classic list List threaded Threaded
3 messages Options
Reply | Threaded
Open this post in threaded view
|

Build failed in Jenkins: Maven » Maven TLP » maven » master #89

Apache Jenkins Server-2
See https://ci-builds.apache.org/job/Maven/job/maven-box/job/maven/job/master/89/

Changes:

* Fix Javadoc errors

All tests passed

Build log:
[...truncated 3493 lines...]
[INFO] Downloaded from central: https://repo.maven.apache.org/maven2/org/apache/maven/shared/maven-artifact-transfer/0.11.0/maven-artifact-transfer-0.11.0.pom (11 kB at 881 kB/s)
[INFO] Downloading from central: https://repo.maven.apache.org/maven2/org/codehaus/plexus/plexus-utils/3.1.1/plexus-utils-3.1.1.pom
[INFO] Downloaded from central: https://repo.maven.apache.org/maven2/org/codehaus/plexus/plexus-utils/3.1.1/plexus-utils-3.1.1.pom (5.1 kB at 422 kB/s)
[INFO] Downloading from central: https://repo.maven.apache.org/maven2/org/codehaus/plexus/plexus-component-annotations/2.0.0/plexus-component-annotations-2.0.0.jar
[INFO] Downloading from central: https://repo.maven.apache.org/maven2/org/apache/maven/shared/maven-artifact-transfer/0.11.0/maven-artifact-transfer-0.11.0.jar
[INFO] Downloading from central: https://repo.maven.apache.org/maven2/org/apache/maven/shared/maven-common-artifact-filters/3.1.0/maven-common-artifact-filters-3.1.0.jar
[INFO] Downloaded from central: https://repo.maven.apache.org/maven2/org/codehaus/plexus/plexus-component-annotations/2.0.0/plexus-component-annotations-2.0.0.jar (4.2 kB at 352 kB/s)
[INFO] Downloaded from central: https://repo.maven.apache.org/maven2/org/apache/maven/shared/maven-common-artifact-filters/3.1.0/maven-common-artifact-filters-3.1.0.jar (61 kB at 3.6 MB/s)
[INFO] Downloaded from central: https://repo.maven.apache.org/maven2/org/apache/maven/shared/maven-artifact-transfer/0.11.0/maven-artifact-transfer-0.11.0.jar (128 kB at 7.1 MB/s)
[INFO] Reading assembly descriptor: src/assembly/wrapper/script.xml
[INFO] Reading assembly descriptor: src/assembly/wrapper/bin.xml
[INFO] Reading assembly descriptor: src/assembly/wrapper/source.xml
[INFO] Building tar: /home/jenkins/jenkins-agent/workspace/Maven_maven-box_maven_master/build/apache-maven/target/apache-maven-wrapper-4.0.0-alpha-1-SNAPSHOT-script.tar.gz
[INFO] Building zip: /home/jenkins/jenkins-agent/workspace/Maven_maven-box_maven_master/build/apache-maven/target/apache-maven-wrapper-4.0.0-alpha-1-SNAPSHOT-script.zip
[INFO] Building tar: /home/jenkins/jenkins-agent/workspace/Maven_maven-box_maven_master/build/apache-maven/target/apache-maven-wrapper-4.0.0-alpha-1-SNAPSHOT-bin.tar.gz
[INFO] Building zip: /home/jenkins/jenkins-agent/workspace/Maven_maven-box_maven_master/build/apache-maven/target/apache-maven-wrapper-4.0.0-alpha-1-SNAPSHOT-bin.zip
[INFO] Building tar: /home/jenkins/jenkins-agent/workspace/Maven_maven-box_maven_master/build/apache-maven/target/apache-maven-wrapper-4.0.0-alpha-1-SNAPSHOT-source.tar.gz
[INFO] Building zip: /home/jenkins/jenkins-agent/workspace/Maven_maven-box_maven_master/build/apache-maven/target/apache-maven-wrapper-4.0.0-alpha-1-SNAPSHOT-source.zip
[WARNING] [jenkins-event-spy] Unexpected Maven project file name 'maven-wrapper.pom', problems may occur
[WARNING] [jenkins-event-spy] Unexpected Maven project file name 'maven-wrapper.pom', problems may occur
[INFO]
[INFO] --- maven-checkstyle-plugin:3.0.0:check (checkstyle-check) @ apache-maven-wrapper ---
[WARNING] [jenkins-event-spy] Unexpected Maven project file name 'maven-wrapper.pom', problems may occur
[WARNING] [jenkins-event-spy] Unexpected Maven project file name 'maven-wrapper.pom', problems may occur
[INFO]
[INFO] --- maven-install-plugin:2.5.2:install (default-install) @ apache-maven-wrapper ---
[INFO] Installing /home/jenkins/jenkins-agent/workspace/Maven_maven-box_maven_master/build/apache-maven/maven-wrapper.pom to /home/jenkins/jenkins-agent/workspace/Maven_maven-box_maven_master/build/.repository/org/apache/maven/apache-maven-wrapper/4.0.0-alpha-1-SNAPSHOT/apache-maven-wrapper-4.0.0-alpha-1-SNAPSHOT.pom
[INFO] Installing /home/jenkins/jenkins-agent/workspace/Maven_maven-box_maven_master/build/apache-maven/target/apache-maven-wrapper-4.0.0-alpha-1-SNAPSHOT-site.xml to /home/jenkins/jenkins-agent/workspace/Maven_maven-box_maven_master/build/.repository/org/apache/maven/apache-maven-wrapper/4.0.0-alpha-1-SNAPSHOT/apache-maven-wrapper-4.0.0-alpha-1-SNAPSHOT-site.xml
[INFO] Installing /home/jenkins/jenkins-agent/workspace/Maven_maven-box_maven_master/build/apache-maven/target/apache-maven-wrapper-4.0.0-alpha-1-SNAPSHOT-script.tar.gz to /home/jenkins/jenkins-agent/workspace/Maven_maven-box_maven_master/build/.repository/org/apache/maven/apache-maven-wrapper/4.0.0-alpha-1-SNAPSHOT/apache-maven-wrapper-4.0.0-alpha-1-SNAPSHOT-script.tar.gz
[INFO] Installing /home/jenkins/jenkins-agent/workspace/Maven_maven-box_maven_master/build/apache-maven/target/apache-maven-wrapper-4.0.0-alpha-1-SNAPSHOT-script.zip to /home/jenkins/jenkins-agent/workspace/Maven_maven-box_maven_master/build/.repository/org/apache/maven/apache-maven-wrapper/4.0.0-alpha-1-SNAPSHOT/apache-maven-wrapper-4.0.0-alpha-1-SNAPSHOT-script.zip
[INFO] Installing /home/jenkins/jenkins-agent/workspace/Maven_maven-box_maven_master/build/apache-maven/target/apache-maven-wrapper-4.0.0-alpha-1-SNAPSHOT-bin.tar.gz to /home/jenkins/jenkins-agent/workspace/Maven_maven-box_maven_master/build/.repository/org/apache/maven/apache-maven-wrapper/4.0.0-alpha-1-SNAPSHOT/apache-maven-wrapper-4.0.0-alpha-1-SNAPSHOT-bin.tar.gz
[INFO] Installing /home/jenkins/jenkins-agent/workspace/Maven_maven-box_maven_master/build/apache-maven/target/apache-maven-wrapper-4.0.0-alpha-1-SNAPSHOT-bin.zip to /home/jenkins/jenkins-agent/workspace/Maven_maven-box_maven_master/build/.repository/org/apache/maven/apache-maven-wrapper/4.0.0-alpha-1-SNAPSHOT/apache-maven-wrapper-4.0.0-alpha-1-SNAPSHOT-bin.zip
[INFO] Installing /home/jenkins/jenkins-agent/workspace/Maven_maven-box_maven_master/build/apache-maven/target/apache-maven-wrapper-4.0.0-alpha-1-SNAPSHOT-source.tar.gz to /home/jenkins/jenkins-agent/workspace/Maven_maven-box_maven_master/build/.repository/org/apache/maven/apache-maven-wrapper/4.0.0-alpha-1-SNAPSHOT/apache-maven-wrapper-4.0.0-alpha-1-SNAPSHOT-source.tar.gz
[INFO] Installing /home/jenkins/jenkins-agent/workspace/Maven_maven-box_maven_master/build/apache-maven/target/apache-maven-wrapper-4.0.0-alpha-1-SNAPSHOT-source.zip to /home/jenkins/jenkins-agent/workspace/Maven_maven-box_maven_master/build/.repository/org/apache/maven/apache-maven-wrapper/4.0.0-alpha-1-SNAPSHOT/apache-maven-wrapper-4.0.0-alpha-1-SNAPSHOT-source.zip
[WARNING] [jenkins-event-spy] Unexpected Maven project file name 'maven-wrapper.pom', problems may occur
[WARNING] [jenkins-event-spy] Unexpected Maven project file name 'maven-wrapper.pom', problems may occur
[INFO]
[INFO] --- maven-deploy-plugin:2.8.2:deploy (default-deploy) @ apache-maven-wrapper ---
[INFO] Downloading from apache.snapshots.https: https://repository.apache.org/content/repositories/snapshots/org/apache/maven/apache-maven-wrapper/4.0.0-alpha-1-SNAPSHOT/maven-metadata.xml
[INFO] Downloaded from apache.snapshots.https: https://repository.apache.org/content/repositories/snapshots/org/apache/maven/apache-maven-wrapper/4.0.0-alpha-1-SNAPSHOT/maven-metadata.xml (2.2 kB at 6.9 kB/s)
[INFO] Uploading to apache.snapshots.https: https://repository.apache.org/content/repositories/snapshots/org/apache/maven/apache-maven-wrapper/4.0.0-alpha-1-SNAPSHOT/apache-maven-wrapper-4.0.0-alpha-1-20210105.221022-29.pom
[INFO] Uploaded to apache.snapshots.https: https://repository.apache.org/content/repositories/snapshots/org/apache/maven/apache-maven-wrapper/4.0.0-alpha-1-SNAPSHOT/apache-maven-wrapper-4.0.0-alpha-1-20210105.221022-29.pom (5.4 kB at 5.7 kB/s)
[INFO] Downloading from apache.snapshots.https: https://repository.apache.org/content/repositories/snapshots/org/apache/maven/apache-maven-wrapper/maven-metadata.xml
[INFO] Downloaded from apache.snapshots.https: https://repository.apache.org/content/repositories/snapshots/org/apache/maven/apache-maven-wrapper/maven-metadata.xml (412 B at 1.3 kB/s)
[INFO] Uploading to apache.snapshots.https: https://repository.apache.org/content/repositories/snapshots/org/apache/maven/apache-maven-wrapper/4.0.0-alpha-1-SNAPSHOT/maven-metadata.xml
[INFO] Uploaded to apache.snapshots.https: https://repository.apache.org/content/repositories/snapshots/org/apache/maven/apache-maven-wrapper/4.0.0-alpha-1-SNAPSHOT/maven-metadata.xml (2.2 kB at 2.3 kB/s)
[INFO] Uploading to apache.snapshots.https: https://repository.apache.org/content/repositories/snapshots/org/apache/maven/apache-maven-wrapper/maven-metadata.xml
[INFO] Uploaded to apache.snapshots.https: https://repository.apache.org/content/repositories/snapshots/org/apache/maven/apache-maven-wrapper/maven-metadata.xml (412 B at 145 B/s)
[INFO] Uploading to apache.snapshots.https: https://repository.apache.org/content/repositories/snapshots/org/apache/maven/apache-maven-wrapper/4.0.0-alpha-1-SNAPSHOT/apache-maven-wrapper-4.0.0-alpha-1-20210105.221022-29-site.xml
[INFO] Uploaded to apache.snapshots.https: https://repository.apache.org/content/repositories/snapshots/org/apache/maven/apache-maven-wrapper/4.0.0-alpha-1-SNAPSHOT/apache-maven-wrapper-4.0.0-alpha-1-20210105.221022-29-site.xml (1.1 kB at 1.2 kB/s)
[INFO] Uploading to apache.snapshots.https: https://repository.apache.org/content/repositories/snapshots/org/apache/maven/apache-maven-wrapper/4.0.0-alpha-1-SNAPSHOT/maven-metadata.xml
[INFO] Uploaded to apache.snapshots.https: https://repository.apache.org/content/repositories/snapshots/org/apache/maven/apache-maven-wrapper/4.0.0-alpha-1-SNAPSHOT/maven-metadata.xml (2.2 kB at 2.3 kB/s)
[INFO] Uploading to apache.snapshots.https: https://repository.apache.org/content/repositories/snapshots/org/apache/maven/apache-maven-wrapper/4.0.0-alpha-1-SNAPSHOT/apache-maven-wrapper-4.0.0-alpha-1-20210105.221022-29-script.tar.gz
[INFO] Uploaded to apache.snapshots.https: https://repository.apache.org/content/repositories/snapshots/org/apache/maven/apache-maven-wrapper/4.0.0-alpha-1-SNAPSHOT/apache-maven-wrapper-4.0.0-alpha-1-20210105.221022-29-script.tar.gz (5.2 kB at 5.6 kB/s)
[INFO] Uploading to apache.snapshots.https: https://repository.apache.org/content/repositories/snapshots/org/apache/maven/apache-maven-wrapper/4.0.0-alpha-1-SNAPSHOT/maven-metadata.xml
[INFO] Uploaded to apache.snapshots.https: https://repository.apache.org/content/repositories/snapshots/org/apache/maven/apache-maven-wrapper/4.0.0-alpha-1-SNAPSHOT/maven-metadata.xml (2.2 kB at 1.7 kB/s)
[INFO] Uploading to apache.snapshots.https: https://repository.apache.org/content/repositories/snapshots/org/apache/maven/apache-maven-wrapper/4.0.0-alpha-1-SNAPSHOT/apache-maven-wrapper-4.0.0-alpha-1-20210105.221022-29-script.zip
[INFO] Uploaded to apache.snapshots.https: https://repository.apache.org/content/repositories/snapshots/org/apache/maven/apache-maven-wrapper/4.0.0-alpha-1-SNAPSHOT/apache-maven-wrapper-4.0.0-alpha-1-20210105.221022-29-script.zip (8.4 kB at 9.0 kB/s)
[INFO] Uploading to apache.snapshots.https: https://repository.apache.org/content/repositories/snapshots/org/apache/maven/apache-maven-wrapper/4.0.0-alpha-1-SNAPSHOT/maven-metadata.xml
[INFO] Uploaded to apache.snapshots.https: https://repository.apache.org/content/repositories/snapshots/org/apache/maven/apache-maven-wrapper/4.0.0-alpha-1-SNAPSHOT/maven-metadata.xml (2.2 kB at 2.3 kB/s)
[INFO] Uploading to apache.snapshots.https: https://repository.apache.org/content/repositories/snapshots/org/apache/maven/apache-maven-wrapper/4.0.0-alpha-1-SNAPSHOT/apache-maven-wrapper-4.0.0-alpha-1-20210105.221022-29-bin.tar.gz
[INFO] Uploaded to apache.snapshots.https: https://repository.apache.org/content/repositories/snapshots/org/apache/maven/apache-maven-wrapper/4.0.0-alpha-1-SNAPSHOT/apache-maven-wrapper-4.0.0-alpha-1-20210105.221022-29-bin.tar.gz (32 kB at 29 kB/s)
[INFO] Uploading to apache.snapshots.https: https://repository.apache.org/content/repositories/snapshots/org/apache/maven/apache-maven-wrapper/4.0.0-alpha-1-SNAPSHOT/maven-metadata.xml
[INFO] Uploaded to apache.snapshots.https: https://repository.apache.org/content/repositories/snapshots/org/apache/maven/apache-maven-wrapper/4.0.0-alpha-1-SNAPSHOT/maven-metadata.xml (2.2 kB at 2.3 kB/s)
[INFO] Uploading to apache.snapshots.https: https://repository.apache.org/content/repositories/snapshots/org/apache/maven/apache-maven-wrapper/4.0.0-alpha-1-SNAPSHOT/apache-maven-wrapper-4.0.0-alpha-1-20210105.221022-29-bin.zip
[INFO] Uploaded to apache.snapshots.https: https://repository.apache.org/content/repositories/snapshots/org/apache/maven/apache-maven-wrapper/4.0.0-alpha-1-SNAPSHOT/apache-maven-wrapper-4.0.0-alpha-1-20210105.221022-29-bin.zip (34 kB at 36 kB/s)
[INFO] Uploading to apache.snapshots.https: https://repository.apache.org/content/repositories/snapshots/org/apache/maven/apache-maven-wrapper/4.0.0-alpha-1-SNAPSHOT/maven-metadata.xml
[INFO] Uploaded to apache.snapshots.https: https://repository.apache.org/content/repositories/snapshots/org/apache/maven/apache-maven-wrapper/4.0.0-alpha-1-SNAPSHOT/maven-metadata.xml (2.2 kB at 2.3 kB/s)
[INFO] Uploading to apache.snapshots.https: https://repository.apache.org/content/repositories/snapshots/org/apache/maven/apache-maven-wrapper/4.0.0-alpha-1-SNAPSHOT/apache-maven-wrapper-4.0.0-alpha-1-20210105.221022-29-source.tar.gz
[INFO] Uploaded to apache.snapshots.https: https://repository.apache.org/content/repositories/snapshots/org/apache/maven/apache-maven-wrapper/4.0.0-alpha-1-SNAPSHOT/apache-maven-wrapper-4.0.0-alpha-1-20210105.221022-29-source.tar.gz (6.2 kB at 6.6 kB/s)
[INFO] Uploading to apache.snapshots.https: https://repository.apache.org/content/repositories/snapshots/org/apache/maven/apache-maven-wrapper/4.0.0-alpha-1-SNAPSHOT/maven-metadata.xml
[INFO] Uploaded to apache.snapshots.https: https://repository.apache.org/content/repositories/snapshots/org/apache/maven/apache-maven-wrapper/4.0.0-alpha-1-SNAPSHOT/maven-metadata.xml (2.2 kB at 2.3 kB/s)
[INFO] Uploading to apache.snapshots.https: https://repository.apache.org/content/repositories/snapshots/org/apache/maven/apache-maven-wrapper/4.0.0-alpha-1-SNAPSHOT/apache-maven-wrapper-4.0.0-alpha-1-20210105.221022-29-source.zip
[INFO] Uploaded to apache.snapshots.https: https://repository.apache.org/content/repositories/snapshots/org/apache/maven/apache-maven-wrapper/4.0.0-alpha-1-SNAPSHOT/apache-maven-wrapper-4.0.0-alpha-1-20210105.221022-29-source.zip (9.8 kB at 10 kB/s)
[INFO] Uploading to apache.snapshots.https: https://repository.apache.org/content/repositories/snapshots/org/apache/maven/apache-maven-wrapper/4.0.0-alpha-1-SNAPSHOT/maven-metadata.xml
[INFO] Uploaded to apache.snapshots.https: https://repository.apache.org/content/repositories/snapshots/org/apache/maven/apache-maven-wrapper/4.0.0-alpha-1-SNAPSHOT/maven-metadata.xml (2.2 kB at 2.3 kB/s)
[WARNING] [jenkins-event-spy] Unexpected Maven project file name 'maven-wrapper.pom', problems may occur
[WARNING] [jenkins-event-spy] Unexpected Maven project file name 'maven-wrapper.pom', problems may occur
[INFO] ------------------------------------------------------------------------
[INFO] Reactor Summary for Apache Maven 4.0.0-alpha-1-SNAPSHOT:
[INFO]
[INFO] Apache Maven ....................................... SUCCESS [ 21.839 s]
[INFO] Maven Model ........................................ SUCCESS [ 14.674 s]
[INFO] Maven Artifact ..................................... SUCCESS [ 14.125 s]
[INFO] Maven Plugin API ................................... SUCCESS [ 11.012 s]
[INFO] Maven Builder Support .............................. SUCCESS [  6.689 s]
[INFO] Maven XML .......................................... FAILURE [  4.149 s]
[INFO] Maven Model Builder ................................ SKIPPED
[INFO] Maven Settings ..................................... SUCCESS [  6.287 s]
[INFO] Maven Settings Builder ............................. SUCCESS [  7.766 s]
[INFO] Maven Repository Metadata Model .................... SUCCESS [  8.595 s]
[INFO] Maven Artifact Resolver Provider ................... SKIPPED
[INFO] Maven Core ......................................... SKIPPED
[INFO] Maven SLF4J Wrapper ................................ SUCCESS [  6.710 s]
[INFO] Maven SLF4J Simple Provider ........................ SUCCESS [  7.877 s]
[INFO] Maven Embedder ..................................... SKIPPED
[INFO] Maven Compat ....................................... SKIPPED
[INFO] Apache Maven Distribution .......................... SKIPPED
[INFO] Maven Wrapper ...................................... SUCCESS [  8.394 s]
[INFO] Apache Maven Wrapper Distribution .................. SUCCESS [ 20.746 s]
[INFO] ------------------------------------------------------------------------
[INFO] BUILD FAILURE
[INFO] ------------------------------------------------------------------------
[INFO] Total time:  02:19 min
[INFO] Finished at: 2021-01-05T22:10:41Z
[INFO] ------------------------------------------------------------------------
[WARNING] [jenkins-event-spy] Unexpected Maven project file name 'maven-wrapper.pom', problems may occur
[INFO] [jenkins-event-spy] Generated /home/jenkins/jenkins-agent/workspace/Maven_maven-box_maven_master/build@tmp/withMavenb8cfffff/maven-spy-20210105-220822-2124059008039006868018.log
[ERROR] Failed to execute goal org.apache.maven.plugins:maven-checkstyle-plugin:3.0.0:check (checkstyle-check) on project maven-xml: You have 1 Checkstyle violation. -> [Help 1]
org.apache.maven.lifecycle.LifecycleExecutionException: Failed to execute goal org.apache.maven.plugins:maven-checkstyle-plugin:3.0.0:check (checkstyle-check) on project maven-xml: You have 1 Checkstyle violation.
    at org.apache.maven.lifecycle.internal.MojoExecutor.execute (MojoExecutor.java:215)
    at org.apache.maven.lifecycle.internal.MojoExecutor.execute (MojoExecutor.java:156)
    at org.apache.maven.lifecycle.internal.MojoExecutor.execute (MojoExecutor.java:148)
    at org.apache.maven.lifecycle.internal.LifecycleModuleBuilder.buildProject (LifecycleModuleBuilder.java:117)
    at org.apache.maven.lifecycle.internal.LifecycleModuleBuilder.buildProject (LifecycleModuleBuilder.java:81)
    at org.apache.maven.lifecycle.internal.builder.singlethreaded.SingleThreadedBuilder.build (SingleThreadedBuilder.java:56)
    at org.apache.maven.lifecycle.internal.LifecycleStarter.execute (LifecycleStarter.java:128)
    at org.apache.maven.DefaultMaven.doExecute (DefaultMaven.java:305)
    at org.apache.maven.DefaultMaven.doExecute (DefaultMaven.java:192)
    at org.apache.maven.DefaultMaven.execute (DefaultMaven.java:105)
    at org.apache.maven.cli.MavenCli.execute (MavenCli.java:957)
    at org.apache.maven.cli.MavenCli.doMain (MavenCli.java:289)
    at org.apache.maven.cli.MavenCli.main (MavenCli.java:193)
    at sun.reflect.NativeMethodAccessorImpl.invoke0 (Native Method)
    at sun.reflect.NativeMethodAccessorImpl.invoke (NativeMethodAccessorImpl.java:62)
    at sun.reflect.DelegatingMethodAccessorImpl.invoke (DelegatingMethodAccessorImpl.java:43)
    at java.lang.reflect.Method.invoke (Method.java:498)
    at org.codehaus.plexus.classworlds.launcher.Launcher.launchEnhanced (Launcher.java:282)
    at org.codehaus.plexus.classworlds.launcher.Launcher.launch (Launcher.java:225)
    at org.codehaus.plexus.classworlds.launcher.Launcher.mainWithExitCode (Launcher.java:406)
    at org.codehaus.plexus.classworlds.launcher.Launcher.main (Launcher.java:347)
Caused by: org.apache.maven.plugin.MojoFailureException: You have 1 Checkstyle violation.
    at org.apache.maven.plugins.checkstyle.CheckstyleViolationCheckMojo.execute (CheckstyleViolationCheckMojo.java:576)
    at org.apache.maven.plugin.DefaultBuildPluginManager.executeMojo (DefaultBuildPluginManager.java:137)
    at org.apache.maven.lifecycle.internal.MojoExecutor.execute (MojoExecutor.java:210)
    at org.apache.maven.lifecycle.internal.MojoExecutor.execute (MojoExecutor.java:156)
    at org.apache.maven.lifecycle.internal.MojoExecutor.execute (MojoExecutor.java:148)
    at org.apache.maven.lifecycle.internal.LifecycleModuleBuilder.buildProject (LifecycleModuleBuilder.java:117)
    at org.apache.maven.lifecycle.internal.LifecycleModuleBuilder.buildProject (LifecycleModuleBuilder.java:81)
    at org.apache.maven.lifecycle.internal.builder.singlethreaded.SingleThreadedBuilder.build (SingleThreadedBuilder.java:56)
    at org.apache.maven.lifecycle.internal.LifecycleStarter.execute (LifecycleStarter.java:128)
    at org.apache.maven.DefaultMaven.doExecute (DefaultMaven.java:305)
    at org.apache.maven.DefaultMaven.doExecute (DefaultMaven.java:192)
    at org.apache.maven.DefaultMaven.execute (DefaultMaven.java:105)
    at org.apache.maven.cli.MavenCli.execute (MavenCli.java:957)
    at org.apache.maven.cli.MavenCli.doMain (MavenCli.java:289)
    at org.apache.maven.cli.MavenCli.main (MavenCli.java:193)
    at sun.reflect.NativeMethodAccessorImpl.invoke0 (Native Method)
    at sun.reflect.NativeMethodAccessorImpl.invoke (NativeMethodAccessorImpl.java:62)
    at sun.reflect.DelegatingMethodAccessorImpl.invoke (DelegatingMethodAccessorImpl.java:43)
    at java.lang.reflect.Method.invoke (Method.java:498)
    at org.codehaus.plexus.classworlds.launcher.Launcher.launchEnhanced (Launcher.java:282)
    at org.codehaus.plexus.classworlds.launcher.Launcher.launch (Launcher.java:225)
    at org.codehaus.plexus.classworlds.launcher.Launcher.mainWithExitCode (Launcher.java:406)
    at org.codehaus.plexus.classworlds.launcher.Launcher.main (Launcher.java:347)
[ERROR]
[ERROR] Re-run Maven using the -X switch to enable full debug logging.
[ERROR]
[ERROR] For more information about the errors and possible solutions, please read the following articles:
[ERROR] [Help 1] http://cwiki.apache.org/confluence/display/MAVEN/MojoFailureException
[ERROR]
[ERROR] After correcting the problems, you can resume the build with the command
[ERROR]   mvn <args> -rf :maven-xml
[Pipeline] }
[withMaven] artifactsPublisher - Archive artifact pom.xml under org/apache/maven/maven/4.0.0-alpha-1-SNAPSHOT/maven-4.0.0-alpha-1-SNAPSHOT.pom
[withMaven] artifactsPublisher - Archive artifact maven-model/pom.xml under org/apache/maven/maven-model/4.0.0-alpha-1-SNAPSHOT/maven-model-4.0.0-alpha-1-SNAPSHOT.pom
[withMaven] artifactsPublisher - Archive artifact maven-artifact/pom.xml under org/apache/maven/maven-artifact/4.0.0-alpha-1-SNAPSHOT/maven-artifact-4.0.0-alpha-1-SNAPSHOT.pom
[withMaven] artifactsPublisher - Archive artifact maven-plugin-api/pom.xml under org/apache/maven/maven-plugin-api/4.0.0-alpha-1-SNAPSHOT/maven-plugin-api-4.0.0-alpha-1-SNAPSHOT.pom
[withMaven] artifactsPublisher - Archive artifact maven-builder-support/pom.xml under org/apache/maven/maven-builder-support/4.0.0-alpha-1-SNAPSHOT/maven-builder-support-4.0.0-alpha-1-SNAPSHOT.pom
[withMaven] artifactsPublisher - Archive artifact maven-xml/pom.xml under org/apache/maven/maven-xml/4.0.0-alpha-1-SNAPSHOT/maven-xml-4.0.0-alpha-1-SNAPSHOT.pom
[withMaven] artifactsPublisher - Archive artifact maven-model-builder/pom.xml under org/apache/maven/maven-model-builder/4.0.0-alpha-1-SNAPSHOT/maven-model-builder-4.0.0-alpha-1-SNAPSHOT.pom
[withMaven] artifactsPublisher - Archive artifact maven-settings/pom.xml under org/apache/maven/maven-settings/4.0.0-alpha-1-SNAPSHOT/maven-settings-4.0.0-alpha-1-SNAPSHOT.pom
[withMaven] artifactsPublisher - Archive artifact maven-settings-builder/pom.xml under org/apache/maven/maven-settings-builder/4.0.0-alpha-1-SNAPSHOT/maven-settings-builder-4.0.0-alpha-1-SNAPSHOT.pom
[withMaven] artifactsPublisher - Archive artifact maven-repository-metadata/pom.xml under org/apache/maven/maven-repository-metadata/4.0.0-alpha-1-SNAPSHOT/maven-repository-metadata-4.0.0-alpha-1-SNAPSHOT.pom
[withMaven] artifactsPublisher - Archive artifact maven-resolver-provider/pom.xml under org/apache/maven/maven-resolver-provider/4.0.0-alpha-1-SNAPSHOT/maven-resolver-provider-4.0.0-alpha-1-SNAPSHOT.pom
[withMaven] artifactsPublisher - Archive artifact maven-core/pom.xml under org/apache/maven/maven-core/4.0.0-alpha-1-SNAPSHOT/maven-core-4.0.0-alpha-1-SNAPSHOT.pom
[withMaven] artifactsPublisher - Archive artifact maven-slf4j-wrapper/pom.xml under org/apache/maven/maven-slf4j-wrapper/4.0.0-alpha-1-SNAPSHOT/maven-slf4j-wrapper-4.0.0-alpha-1-SNAPSHOT.pom
[withMaven] artifactsPublisher - Archive artifact maven-slf4j-provider/pom.xml under org/apache/maven/maven-slf4j-provider/4.0.0-alpha-1-SNAPSHOT/maven-slf4j-provider-4.0.0-alpha-1-SNAPSHOT.pom
[withMaven] artifactsPublisher - Archive artifact maven-embedder/pom.xml under org/apache/maven/maven-embedder/4.0.0-alpha-1-SNAPSHOT/maven-embedder-4.0.0-alpha-1-SNAPSHOT.pom
[withMaven] artifactsPublisher - Archive artifact maven-compat/pom.xml under org/apache/maven/maven-compat/4.0.0-alpha-1-SNAPSHOT/maven-compat-4.0.0-alpha-1-SNAPSHOT.pom
[withMaven] artifactsPublisher - Archive artifact apache-maven/pom.xml under org/apache/maven/apache-maven/4.0.0-alpha-1-SNAPSHOT/apache-maven-4.0.0-alpha-1-SNAPSHOT.pom
[withMaven] artifactsPublisher - Archive artifact maven-wrapper/pom.xml under org/apache/maven/maven-wrapper/4.0.0-alpha-1-SNAPSHOT/maven-wrapper-4.0.0-alpha-1-SNAPSHOT.pom
[withMaven] artifactsPublisher - Archive artifact apache-maven/maven-wrapper.pom under org/apache/maven/apache-maven-wrapper/4.0.0-alpha-1-SNAPSHOT/apache-maven-wrapper-4.0.0-alpha-1-SNAPSHOT.pom
[withMaven] Publishers: Generated Artifacts Publisher: 17811 ms, Pipeline Graph Publisher: 8 ms
[withMaven] artifactsPublisher - Archive artifact pom.xml under org/apache/maven/maven/4.0.0-alpha-1-SNAPSHOT/maven-4.0.0-alpha-1-SNAPSHOT.pom
[withMaven] artifactsPublisher - Archive artifact target/maven-4.0.0-alpha-1-SNAPSHOT-site.xml under org/apache/maven/maven/4.0.0-alpha-1-SNAPSHOT/maven-4.0.0-alpha-1-SNAPSHOT-site.xml
[withMaven] artifactsPublisher - Archive artifact maven-model/pom.xml under org/apache/maven/maven-model/4.0.0-alpha-1-SNAPSHOT/maven-model-4.0.0-alpha-1-SNAPSHOT.pom
[withMaven] artifactsPublisher - Archive artifact maven-model/target/maven-model-4.0.0-alpha-1-SNAPSHOT.jar under org/apache/maven/maven-model/4.0.0-alpha-1-SNAPSHOT/maven-model-4.0.0-alpha-1-SNAPSHOT.jar
[withMaven] artifactsPublisher - Archive artifact maven-artifact/pom.xml under org/apache/maven/maven-artifact/4.0.0-alpha-1-SNAPSHOT/maven-artifact-4.0.0-alpha-1-SNAPSHOT.pom
[withMaven] artifactsPublisher - Archive artifact maven-artifact/target/maven-artifact-4.0.0-alpha-1-SNAPSHOT.jar under org/apache/maven/maven-artifact/4.0.0-alpha-1-SNAPSHOT/maven-artifact-4.0.0-alpha-1-SNAPSHOT.jar
[withMaven] artifactsPublisher - Archive artifact maven-plugin-api/pom.xml under org/apache/maven/maven-plugin-api/4.0.0-alpha-1-SNAPSHOT/maven-plugin-api-4.0.0-alpha-1-SNAPSHOT.pom
[withMaven] artifactsPublisher - Archive artifact maven-plugin-api/target/maven-plugin-api-4.0.0-alpha-1-SNAPSHOT.jar under org/apache/maven/maven-plugin-api/4.0.0-alpha-1-SNAPSHOT/maven-plugin-api-4.0.0-alpha-1-SNAPSHOT.jar
[withMaven] artifactsPublisher - Archive artifact maven-builder-support/pom.xml under org/apache/maven/maven-builder-support/4.0.0-alpha-1-SNAPSHOT/maven-builder-support-4.0.0-alpha-1-SNAPSHOT.pom
[withMaven] artifactsPublisher - Archive artifact maven-builder-support/target/maven-builder-support-4.0.0-alpha-1-SNAPSHOT.jar under org/apache/maven/maven-builder-support/4.0.0-alpha-1-SNAPSHOT/maven-builder-support-4.0.0-alpha-1-SNAPSHOT.jar
[withMaven] artifactsPublisher - Archive artifact maven-settings/pom.xml under org/apache/maven/maven-settings/4.0.0-alpha-1-SNAPSHOT/maven-settings-4.0.0-alpha-1-SNAPSHOT.pom
[withMaven] artifactsPublisher - Archive artifact maven-settings/target/maven-settings-4.0.0-alpha-1-SNAPSHOT.jar under org/apache/maven/maven-settings/4.0.0-alpha-1-SNAPSHOT/maven-settings-4.0.0-alpha-1-SNAPSHOT.jar
[withMaven] artifactsPublisher - Archive artifact maven-settings-builder/pom.xml under org/apache/maven/maven-settings-builder/4.0.0-alpha-1-SNAPSHOT/maven-settings-builder-4.0.0-alpha-1-SNAPSHOT.pom
[withMaven] artifactsPublisher - Archive artifact maven-settings-builder/target/maven-settings-builder-4.0.0-alpha-1-SNAPSHOT.jar under org/apache/maven/maven-settings-builder/4.0.0-alpha-1-SNAPSHOT/maven-settings-builder-4.0.0-alpha-1-SNAPSHOT.jar
[withMaven] artifactsPublisher - Archive artifact maven-repository-metadata/pom.xml under org/apache/maven/maven-repository-metadata/4.0.0-alpha-1-SNAPSHOT/maven-repository-metadata-4.0.0-alpha-1-SNAPSHOT.pom
[withMaven] artifactsPublisher - Archive artifact maven-repository-metadata/target/maven-repository-metadata-4.0.0-alpha-1-SNAPSHOT.jar under org/apache/maven/maven-repository-metadata/4.0.0-alpha-1-SNAPSHOT/maven-repository-metadata-4.0.0-alpha-1-SNAPSHOT.jar
[withMaven] artifactsPublisher - Archive artifact maven-slf4j-wrapper/pom.xml under org/apache/maven/maven-slf4j-wrapper/4.0.0-alpha-1-SNAPSHOT/maven-slf4j-wrapper-4.0.0-alpha-1-SNAPSHOT.pom
[withMaven] artifactsPublisher - Archive artifact maven-slf4j-wrapper/target/maven-slf4j-wrapper-4.0.0-alpha-1-SNAPSHOT.jar under org/apache/maven/maven-slf4j-wrapper/4.0.0-alpha-1-SNAPSHOT/maven-slf4j-wrapper-4.0.0-alpha-1-SNAPSHOT.jar
[withMaven] artifactsPublisher - Archive artifact maven-slf4j-provider/pom.xml under org/apache/maven/maven-slf4j-provider/4.0.0-alpha-1-SNAPSHOT/maven-slf4j-provider-4.0.0-alpha-1-SNAPSHOT.pom
[withMaven] artifactsPublisher - Archive artifact maven-slf4j-provider/target/maven-slf4j-provider-4.0.0-alpha-1-SNAPSHOT.jar under org/apache/maven/maven-slf4j-provider/4.0.0-alpha-1-SNAPSHOT/maven-slf4j-provider-4.0.0-alpha-1-SNAPSHOT.jar
[withMaven] artifactsPublisher - Archive artifact maven-wrapper/pom.xml under org/apache/maven/maven-wrapper/4.0.0-alpha-1-SNAPSHOT/maven-wrapper-4.0.0-alpha-1-SNAPSHOT.pom
[withMaven] artifactsPublisher - Archive artifact maven-wrapper/target/maven-wrapper.jar under org/apache/maven/maven-wrapper/4.0.0-alpha-1-SNAPSHOT/maven-wrapper-4.0.0-alpha-1-SNAPSHOT.jar
[withMaven] artifactsPublisher - Archive artifact apache-maven/maven-wrapper.pom under org/apache/maven/apache-maven-wrapper/4.0.0-alpha-1-SNAPSHOT/apache-maven-wrapper-4.0.0-alpha-1-SNAPSHOT.pom
[withMaven] artifactsPublisher - Archive artifact apache-maven/target/apache-maven-wrapper-4.0.0-alpha-1-SNAPSHOT-site.xml under org/apache/maven/apache-maven-wrapper/4.0.0-alpha-1-SNAPSHOT/apache-maven-wrapper-4.0.0-alpha-1-SNAPSHOT-site.xml
[withMaven] artifactsPublisher - Archive artifact apache-maven/target/apache-maven-wrapper-4.0.0-alpha-1-SNAPSHOT-script.tar.gz under org/apache/maven/apache-maven-wrapper/4.0.0-alpha-1-SNAPSHOT/apache-maven-wrapper-4.0.0-alpha-1-SNAPSHOT-script.tar.gz
[withMaven] artifactsPublisher - Archive artifact apache-maven/target/apache-maven-wrapper-4.0.0-alpha-1-SNAPSHOT-script.zip under org/apache/maven/apache-maven-wrapper/4.0.0-alpha-1-SNAPSHOT/apache-maven-wrapper-4.0.0-alpha-1-SNAPSHOT-script.zip
[withMaven] artifactsPublisher - Archive artifact apache-maven/target/apache-maven-wrapper-4.0.0-alpha-1-SNAPSHOT-bin.tar.gz under org/apache/maven/apache-maven-wrapper/4.0.0-alpha-1-SNAPSHOT/apache-maven-wrapper-4.0.0-alpha-1-SNAPSHOT-bin.tar.gz
[withMaven] artifactsPublisher - Archive artifact apache-maven/target/apache-maven-wrapper-4.0.0-alpha-1-SNAPSHOT-bin.zip under org/apache/maven/apache-maven-wrapper/4.0.0-alpha-1-SNAPSHOT/apache-maven-wrapper-4.0.0-alpha-1-SNAPSHOT-bin.zip
[withMaven] artifactsPublisher - Archive artifact apache-maven/target/apache-maven-wrapper-4.0.0-alpha-1-SNAPSHOT-source.tar.gz under org/apache/maven/apache-maven-wrapper/4.0.0-alpha-1-SNAPSHOT/apache-maven-wrapper-4.0.0-alpha-1-SNAPSHOT-source.tar.gz
[withMaven] artifactsPublisher - Archive artifact apache-maven/target/apache-maven-wrapper-4.0.0-alpha-1-SNAPSHOT-source.zip under org/apache/maven/apache-maven-wrapper/4.0.0-alpha-1-SNAPSHOT/apache-maven-wrapper-4.0.0-alpha-1-SNAPSHOT-source.zip
[Fast Archiver] Compressed 641.33 KB of artifacts by 64.9% relative to #87
[withMaven] junitPublisher - Archive test results for Maven artifact org.apache.maven:maven-model:jar:4.0.0-alpha-1-SNAPSHOT generated by maven-surefire-plugin:test (default-test): maven-model/target/surefire-reports/*.xml
[withMaven] junitPublisher - Archive test results for Maven artifact org.apache.maven:maven-artifact:jar:4.0.0-alpha-1-SNAPSHOT generated by maven-surefire-plugin:test (default-test): maven-artifact/target/surefire-reports/*.xml
[withMaven] junitPublisher - Archive test results for Maven artifact org.apache.maven:maven-plugin-api:jar:4.0.0-alpha-1-SNAPSHOT generated by maven-surefire-plugin:test (default-test): maven-plugin-api/target/surefire-reports/*.xml
[withMaven] junitPublisher - Archive test results for Maven artifact org.apache.maven:maven-builder-support:jar:4.0.0-alpha-1-SNAPSHOT generated by maven-surefire-plugin:test (default-test): maven-builder-support/target/surefire-reports/*.xml
[withMaven] junitPublisher - Archive test results for Maven artifact org.apache.maven:maven-xml:jar:4.0.0-alpha-1-SNAPSHOT generated by maven-surefire-plugin:test (default-test): maven-xml/target/surefire-reports/*.xml
[withMaven] junitPublisher - Archive test results for Maven artifact org.apache.maven:maven-settings:jar:4.0.0-alpha-1-SNAPSHOT generated by maven-surefire-plugin:test (default-test): maven-settings/target/surefire-reports/*.xml
[withMaven] junitPublisher - Archive test results for Maven artifact org.apache.maven:maven-settings-builder:jar:4.0.0-alpha-1-SNAPSHOT generated by maven-surefire-plugin:test (default-test): maven-settings-builder/target/surefire-reports/*.xml
[withMaven] junitPublisher - Archive test results for Maven artifact org.apache.maven:maven-repository-metadata:jar:4.0.0-alpha-1-SNAPSHOT generated by maven-surefire-plugin:test (default-test): maven-repository-metadata/target/surefire-reports/*.xml
[withMaven] junitPublisher - Archive test results for Maven artifact org.apache.maven:maven-slf4j-wrapper:jar:4.0.0-alpha-1-SNAPSHOT generated by maven-surefire-plugin:test (default-test): maven-slf4j-wrapper/target/surefire-reports/*.xml
[withMaven] junitPublisher - Archive test results for Maven artifact org.apache.maven:maven-slf4j-provider:jar:4.0.0-alpha-1-SNAPSHOT generated by maven-surefire-plugin:test (default-test): maven-slf4j-provider/target/surefire-reports/*.xml
[withMaven] junitPublisher - Archive test results for Maven artifact org.apache.maven:maven-wrapper:jar:4.0.0-alpha-1-SNAPSHOT generated by maven-surefire-plugin:test (default-test): maven-wrapper/target/surefire-reports/*.xml
Recording test results
[withMaven] junitPublisher - Archive test results for Maven artifact org.apache.maven:maven-artifact:jar:4.0.0-alpha-1-SNAPSHOT generated by maven-failsafe-plugin:integration-test (default): maven-artifact/target/failsafe-reports/*.xml
Recording test results
[withMaven] Publishers: Generated Artifacts Publisher: 21050 ms, Junit Publisher: 60137 ms, Dependencies Fingerprint Publisher: 3725 ms, Pipeline Graph Publisher: 7 ms
[Pipeline] // withMaven
[Pipeline] }
[Pipeline] // stage
[Pipeline] }
[Pipeline] // dir
[Pipeline] }
[Pipeline] // node
[Pipeline] echo
[FAILURE-003] AbortException hudson.AbortException: script returned exit code 1
[Pipeline] stage
[Pipeline] { (Notifications)
[Pipeline] echo
Build result: FAILURE
[Pipeline] jiraIssueSelector
[Pipeline] echo
The authors of changes [michaelo].
[Pipeline] echo
Sending email ...
[Pipeline] emailext
Reply | Threaded
Open this post in threaded view
|

Build unstable in Jenkins: Maven » Maven TLP » maven » master #90

Apache Jenkins Server-2
See https://ci-builds.apache.org/job/Maven/job/maven-box/job/maven/job/master/90/

Changes:

* Next Maven version change 3.7.x -> 4.x.x
* Added Java 17
* Fix checkstyle error

2 tests failed.
FAILED:  org.apache.maven.it.MavenITmng6972AllowAccessToGraphPackageTest.windows-jdk11 / Run ITs Windows Java 11 / testit

Error Message:
Exit code was non-zero: 1; command line and log =
C:\mvn-it-0.tmp\core-it-suite\target\apache-maven\bin\mvn --global-settings C:\mvn-it-0.tmp\core-it-suite\target\test-classes\settings.xml -e --batch-mode -Dmaven.repo.local=c:\mvn-it-0.tmp\it-local-repo install
[INFO] [jenkins-event-spy] Jenkins Maven Event Spy is disabled
[INFO] Error stacktraces are turned on.
[INFO] Scanning for projects...
[INFO] Maven detected that the requested POM file is part of a multi module project, but could not find a pom.xml file in the multi module root directory 'C:\mvn-it-0.tmp\core-it-suite\target\test-classes\mng-6972-allow-access-to-graph-package'.
[INFO] The reactor is limited to all projects under: C:\mvn-it-0.tmp\core-it-suite\target\test-classes\mng-6972-allow-access-to-graph-package\build-plugin
[INFO]
[INFO] --------< mng-6972-allow-access-to-graph-package:build-plugin >---------
[INFO] Building build-plugin 1.0
[INFO] --------------------------------[ jar ]---------------------------------
[WARNING] Version not locked for default bindings plugins [maven-resources-plugin, maven-compiler-plugin, maven-surefire-plugin, maven-jar-plugin, maven-install-plugin], you should define versions in pluginManagement section of your pom.xml or parent
[INFO]
[INFO] --- maven-resources-plugin:3.2.0:resources (default-resources) @ build-plugin ---
[INFO] Using 'UTF-8' encoding to copy filtered resources.
[INFO] Using 'UTF-8' encoding to copy filtered properties files.
[INFO] skip non existing resourceDirectory C:\mvn-it-0.tmp\core-it-suite\target\test-classes\mng-6972-allow-access-to-graph-package\build-plugin\src\main\resources
[INFO] skip non existing resourceDirectory C:\mvn-it-0.tmp\core-it-suite\target\test-classes\mng-6972-allow-access-to-graph-package\build-plugin\src\main\resources-filtered
[INFO]
[INFO] --- maven-compiler-plugin:3.8.1:compile (default-compile) @ build-plugin ---
[INFO] Changes detected - recompiling the module!
[INFO] Compiling 1 source file to C:\mvn-it-0.tmp\core-it-suite\target\test-classes\mng-6972-allow-access-to-graph-package\build-plugin\target\classes
[INFO] -------------------------------------------------------------
[ERROR] COMPILATION ERROR :
[INFO] -------------------------------------------------------------
[ERROR] /C:/mvn-it-0.tmp/core-it-suite/target/test-classes/mng-6972-allow-access-to-graph-package/build-plugin/src/main/java/com/example/BuildExtensionUsingGraphPackage.java:[4,17] cannot find symbol
  symbol:   class Objects
  location: package java.util
[INFO] 1 error
[INFO] -------------------------------------------------------------
[INFO] ------------------------------------------------------------------------
[INFO] BUILD FAILURE
[INFO] ------------------------------------------------------------------------
[INFO] Total time:  0.869 s
[INFO] Finished at: 2021-01-06T03:23:49-08:00
[INFO] ------------------------------------------------------------------------
[ERROR] Failed to execute goal org.apache.maven.plugins:maven-compiler-plugin:3.8.1:compile (default-compile) on project build-plugin: Compilation failure
[ERROR] /C:/mvn-it-0.tmp/core-it-suite/target/test-classes/mng-6972-allow-access-to-graph-package/build-plugin/src/main/java/com/example/BuildExtensionUsingGraphPackage.java:[4,17] cannot find symbol
[ERROR]   symbol:   class Objects
[ERROR]   location: package java.util
[ERROR] -> [Help 1]
org.apache.maven.lifecycle.LifecycleExecutionException: Failed to execute goal org.apache.maven.plugins:maven-compiler-plugin:3.8.1:compile (default-compile) on project build-plugin: Compilation failure
/C:/mvn-it-0.tmp/core-it-suite/target/test-classes/mng-6972-allow-access-to-graph-package/build-plugin/src/main/java/com/example/BuildExtensionUsingGraphPackage.java:[4,17] cannot find symbol
  symbol:   class Objects
  location: package java.util

    at org.apache.maven.lifecycle.internal.MojoExecutor.execute (MojoExecutor.java:218)
    at org.apache.maven.lifecycle.internal.MojoExecutor.execute (MojoExecutor.java:159)
    at org.apache.maven.lifecycle.internal.MojoExecutor.execute (MojoExecutor.java:151)
    at org.apache.maven.lifecycle.internal.LifecycleModuleBuilder.buildProject (LifecycleModuleBuilder.java:115)
    at org.apache.maven.lifecycle.internal.LifecycleModuleBuilder.buildProject (LifecycleModuleBuilder.java:79)
    at org.apache.maven.lifecycle.internal.builder.singlethreaded.SingleThreadedBuilder.build (SingleThreadedBuilder.java:64)
    at org.apache.maven.lifecycle.internal.LifecycleStarter.execute (LifecycleStarter.java:131)
    at org.apache.maven.DefaultMaven.doExecute (DefaultMaven.java:321)
    at org.apache.maven.DefaultMaven.doExecute (DefaultMaven.java:206)
    at org.apache.maven.DefaultMaven.execute (DefaultMaven.java:119)
    at org.apache.maven.cli.MavenCli.execute (MavenCli.java:979)
    at org.apache.maven.cli.MavenCli.doMain (MavenCli.java:293)
    at org.apache.maven.cli.MavenCli.doMain (MavenCli.java:248)
    at jdk.internal.reflect.NativeMethodAccessorImpl.invoke0 (Native Method)
    at jdk.internal.reflect.NativeMethodAccessorImpl.invoke (NativeMethodAccessorImpl.java:62)
    at jdk.internal.reflect.DelegatingMethodAccessorImpl.invoke (DelegatingMethodAccessorImpl.java:43)
    at java.lang.reflect.Method.invoke (Method.java:566)
    at org.apache.maven.it.Embedded3xLauncher.run (Embedded3xLauncher.java:215)
    at org.apache.maven.it.Verifier.executeGoals (Verifier.java:1339)
    at org.apache.maven.it.Verifier.executeGoal (Verifier.java:1239)
    at org.apache.maven.it.Verifier.executeGoal (Verifier.java:1233)
    at org.apache.maven.it.MavenITmng6972AllowAccessToGraphPackageTest.testit (MavenITmng6972AllowAccessToGraphPackageTest.java:60)
    at jdk.internal.reflect.NativeMethodAccessorImpl.invoke0 (Native Method)
    at jdk.internal.reflect.NativeMethodAccessorImpl.invoke (NativeMethodAccessorImpl.java:62)
    at jdk.internal.reflect.DelegatingMethodAccessorImpl.invoke (DelegatingMethodAccessorImpl.java:43)
    at java.lang.reflect.Method.invoke (Method.java:566)
    at junit.framework.TestCase.runTest (TestCase.java:176)
    at org.apache.maven.it.AbstractMavenIntegrationTestCase.runTest (AbstractMavenIntegrationTestCase.java:255)
    at junit.framework.TestCase.runBare (TestCase.java:141)
    at junit.framework.TestResult$1.protect (TestResult.java:122)
    at junit.framework.TestResult.runProtected (TestResult.java:142)
    at junit.framework.TestResult.run (TestResult.java:125)
    at junit.framework.TestCase.run (TestCase.java:129)
    at junit.framework.TestSuite.runTest (TestSuite.java:252)
    at junit.framework.TestSuite.run (TestSuite.java:247)
    at junit.framework.TestSuite.runTest (TestSuite.java:252)
    at junit.framework.TestSuite.run (TestSuite.java:247)
    at org.junit.internal.runners.JUnit38ClassRunner.run (JUnit38ClassRunner.java:86)
    at org.apache.maven.surefire.junit4.JUnit4Provider.execute (JUnit4Provider.java:365)
    at org.apache.maven.surefire.junit4.JUnit4Provider.executeWithRerun (JUnit4Provider.java:273)
    at org.apache.maven.surefire.junit4.JUnit4Provider.executeTestSet (JUnit4Provider.java:238)
    at org.apache.maven.surefire.junit4.JUnit4Provider.invoke (JUnit4Provider.java:159)
    at org.apache.maven.surefire.booter.ForkedBooter.invokeProviderInSameClassLoader (ForkedBooter.java:383)
    at org.apache.maven.surefire.booter.ForkedBooter.runSuitesInProcess (ForkedBooter.java:344)
    at org.apache.maven.surefire.booter.ForkedBooter.execute (ForkedBooter.java:125)
    at org.apache.maven.surefire.booter.ForkedBooter.main (ForkedBooter.java:417)
Caused by: org.apache.maven.plugin.compiler.CompilationFailureException: Compilation failure
/C:/mvn-it-0.tmp/core-it-suite/target/test-classes/mng-6972-allow-access-to-graph-package/build-plugin/src/main/java/com/example/BuildExtensionUsingGraphPackage.java:[4,17] cannot find symbol
  symbol:   class Objects
  location: package java.util

    at org.apache.maven.plugin.compiler.AbstractCompilerMojo.execute (AbstractCompilerMojo.java:1220)
    at org.apache.maven.plugin.compiler.CompilerMojo.execute (CompilerMojo.java:187)
    at org.apache.maven.plugin.DefaultBuildPluginManager.executeMojo (DefaultBuildPluginManager.java:136)
    at org.apache.maven.lifecycle.internal.MojoExecutor.execute (MojoExecutor.java:213)
    at org.apache.maven.lifecycle.internal.MojoExecutor.execute (MojoExecutor.java:159)
    at org.apache.maven.lifecycle.internal.MojoExecutor.execute (MojoExecutor.java:151)
    at org.apache.maven.lifecycle.internal.LifecycleModuleBuilder.buildProject (LifecycleModuleBuilder.java:115)
    at org.apache.maven.lifecycle.internal.LifecycleModuleBuilder.buildProject (LifecycleModuleBuilder.java:79)
    at org.apache.maven.lifecycle.internal.builder.singlethreaded.SingleThreadedBuilder.build (SingleThreadedBuilder.java:64)
    at org.apache.maven.lifecycle.internal.LifecycleStarter.execute (LifecycleStarter.java:131)
    at org.apache.maven.DefaultMaven.doExecute (DefaultMaven.java:321)
    at org.apache.maven.DefaultMaven.doExecute (DefaultMaven.java:206)
    at org.apache.maven.DefaultMaven.execute (DefaultMaven.java:119)
    at org.apache.maven.cli.MavenCli.execute (MavenCli.java:979)
    at org.apache.maven.cli.MavenCli.doMain (MavenCli.java:293)
    at org.apache.maven.cli.MavenCli.doMain (MavenCli.java:248)
    at jdk.internal.reflect.NativeMethodAccessorImpl.invoke0 (Native Method)
    at jdk.internal.reflect.NativeMethodAccessorImpl.invoke (NativeMethodAccessorImpl.java:62)
    at jdk.internal.reflect.DelegatingMethodAccessorImpl.invoke (DelegatingMethodAccessorImpl.java:43)
    at java.lang.reflect.Method.invoke (Method.java:566)
    at org.apache.maven.it.Embedded3xLauncher.run (Embedded3xLauncher.java:215)
    at org.apache.maven.it.Verifier.executeGoals (Verifier.java:1339)
    at org.apache.maven.it.Verifier.executeGoal (Verifier.java:1239)
    at org.apache.maven.it.Verifier.executeGoal (Verifier.java:1233)
    at org.apache.maven.it.MavenITmng6972AllowAccessToGraphPackageTest.testit (MavenITmng6972AllowAccessToGraphPackageTest.java:60)
    at jdk.internal.reflect.NativeMethodAccessorImpl.invoke0 (Native Method)
    at jdk.internal.reflect.NativeMethodAccessorImpl.invoke (NativeMethodAccessorImpl.java:62)
    at jdk.internal.reflect.DelegatingMethodAccessorImpl.invoke (DelegatingMethodAccessorImpl.java:43)
    at java.lang.reflect.Method.invoke (Method.java:566)
    at junit.framework.TestCase.runTest (TestCase.java:176)
    at org.apache.maven.it.AbstractMavenIntegrationTestCase.runTest (AbstractMavenIntegrationTestCase.java:255)
    at junit.framework.TestCase.runBare (TestCase.java:141)
    at junit.framework.TestResult$1.protect (TestResult.java:122)
    at junit.framework.TestResult.runProtected (TestResult.java:142)
    at junit.framework.TestResult.run (TestResult.java:125)
    at junit.framework.TestCase.run (TestCase.java:129)
    at junit.framework.TestSuite.runTest (TestSuite.java:252)
    at junit.framework.TestSuite.run (TestSuite.java:247)
    at junit.framework.TestSuite.runTest (TestSuite.java:252)
    at junit.framework.TestSuite.run (TestSuite.java:247)
    at org.junit.internal.runners.JUnit38ClassRunner.run (JUnit38ClassRunner.java:86)
    at org.apache.maven.surefire.junit4.JUnit4Provider.execute (JUnit4Provider.java:365)
    at org.apache.maven.surefire.junit4.JUnit4Provider.executeWithRerun (JUnit4Provider.java:273)
    at org.apache.maven.surefire.junit4.JUnit4Provider.executeTestSet (JUnit4Provider.java:238)
    at org.apache.maven.surefire.junit4.JUnit4Provider.invoke (JUnit4Provider.java:159)
    at org.apache.maven.surefire.booter.ForkedBooter.invokeProviderInSameClassLoader (ForkedBooter.java:383)
    at org.apache.maven.surefire.booter.ForkedBooter.runSuitesInProcess (ForkedBooter.java:344)
    at org.apache.maven.surefire.booter.ForkedBooter.execute (ForkedBooter.java:125)
    at org.apache.maven.surefire.booter.ForkedBooter.main (ForkedBooter.java:417)
[ERROR]
[ERROR] Re-run Maven using the '-X' switch to enable full debug logging.
[ERROR]
[ERROR] For more information about the errors and possible solutions, please read the following articles:
[ERROR] [Help 1] http://cwiki.apache.org/confluence/display/MAVEN/MojoFailureException


Stack Trace:
org.apache.maven.it.VerificationException:
Exit code was non-zero: 1; command line and log =
C:\mvn-it-0.tmp\core-it-suite\target\apache-maven\bin\mvn --global-settings C:\mvn-it-0.tmp\core-it-suite\target\test-classes\settings.xml -e --batch-mode -Dmaven.repo.local=c:\mvn-it-0.tmp\it-local-repo install
[INFO] [jenkins-event-spy] Jenkins Maven Event Spy is disabled
[INFO] Error stacktraces are turned on.
[INFO] Scanning for projects...
[INFO] Maven detected that the requested POM file is part of a multi module project, but could not find a pom.xml file in the multi module root directory 'C:\mvn-it-0.tmp\core-it-suite\target\test-classes\mng-6972-allow-access-to-graph-package'.
[INFO] The reactor is limited to all projects under: C:\mvn-it-0.tmp\core-it-suite\target\test-classes\mng-6972-allow-access-to-graph-package\build-plugin
[INFO]
[INFO] --------< mng-6972-allow-access-to-graph-package:build-plugin >---------
[INFO] Building build-plugin 1.0
[INFO] --------------------------------[ jar ]---------------------------------
[WARNING] Version not locked for default bindings plugins [maven-resources-plugin, maven-compiler-plugin, maven-surefire-plugin, maven-jar-plugin, maven-install-plugin], you should define versions in pluginManagement section of your pom.xml or parent
[INFO]
[INFO] --- maven-resources-plugin:3.2.0:resources (default-resources) @ build-plugin ---
[INFO] Using 'UTF-8' encoding to copy filtered resources.
[INFO] Using 'UTF-8' encoding to copy filtered properties files.
[INFO] skip non existing resourceDirectory C:\mvn-it-0.tmp\core-it-suite\target\test-classes\mng-6972-allow-access-to-graph-package\build-plugin\src\main\resources
[INFO] skip non existing resourceDirectory C:\mvn-it-0.tmp\core-it-suite\target\test-classes\mng-6972-allow-access-to-graph-package\build-plugin\src\main\resources-filtered
[INFO]
[INFO] --- maven-compiler-plugin:3.8.1:compile (default-compile) @ build-plugin ---
[INFO] Changes detected - recompiling the module!
[INFO] Compiling 1 source file to C:\mvn-it-0.tmp\core-it-suite\target\test-classes\mng-6972-allow-access-to-graph-package\build-plugin\target\classes
[INFO] -------------------------------------------------------------
[ERROR] COMPILATION ERROR :
[INFO] -------------------------------------------------------------
[ERROR] /C:/mvn-it-0.tmp/core-it-suite/target/test-classes/mng-6972-allow-access-to-graph-package/build-plugin/src/main/java/com/example/BuildExtensionUsingGraphPackage.java:[4,17] cannot find symbol
  symbol:   class Objects
  location: package java.util
[INFO] 1 error
[INFO] -------------------------------------------------------------
[INFO] ------------------------------------------------------------------------
[INFO] BUILD FAILURE
[INFO] ------------------------------------------------------------------------
[INFO] Total time:  0.869 s
[INFO] Finished at: 2021-01-06T03:23:49-08:00
[INFO] ------------------------------------------------------------------------
[ERROR] Failed to execute goal org.apache.maven.plugins:maven-compiler-plugin:3.8.1:compile (default-compile) on project build-plugin: Compilation failure
[ERROR] /C:/mvn-it-0.tmp/core-it-suite/target/test-classes/mng-6972-allow-access-to-graph-package/build-plugin/src/main/java/com/example/BuildExtensionUsingGraphPackage.java:[4,17] cannot find symbol
[ERROR]   symbol:   class Objects
[ERROR]   location: package java.util
[ERROR] -> [Help 1]
org.apache.maven.lifecycle.LifecycleExecutionException: Failed to execute goal org.apache.maven.plugins:maven-compiler-plugin:3.8.1:compile (default-compile) on project build-plugin: Compilation failure
/C:/mvn-it-0.tmp/core-it-suite/target/test-classes/mng-6972-allow-access-to-graph-package/build-plugin/src/main/java/com/example/BuildExtensionUsingGraphPackage.java:[4,17] cannot find symbol
  symbol:   class Objects
  location: package java.util

    at org.apache.maven.lifecycle.internal.MojoExecutor.execute (MojoExecutor.java:218)
    at org.apache.maven.lifecycle.internal.MojoExecutor.execute (MojoExecutor.java:159)
    at org.apache.maven.lifecycle.internal.MojoExecutor.execute (MojoExecutor.java:151)
    at org.apache.maven.lifecycle.internal.LifecycleModuleBuilder.buildProject (LifecycleModuleBuilder.java:115)
    at org.apache.maven.lifecycle.internal.LifecycleModuleBuilder.buildProject (LifecycleModuleBuilder.java:79)
    at org.apache.maven.lifecycle.internal.builder.singlethreaded.SingleThreadedBuilder.build (SingleThreadedBuilder.java:64)
    at org.apache.maven.lifecycle.internal.LifecycleStarter.execute (LifecycleStarter.java:131)
    at org.apache.maven.DefaultMaven.doExecute (DefaultMaven.java:321)
    at org.apache.maven.DefaultMaven.doExecute (DefaultMaven.java:206)
    at org.apache.maven.DefaultMaven.execute (DefaultMaven.java:119)
    at org.apache.maven.cli.MavenCli.execute (MavenCli.java:979)
    at org.apache.maven.cli.MavenCli.doMain (MavenCli.java:293)
    at org.apache.maven.cli.MavenCli.doMain (MavenCli.java:248)
    at jdk.internal.reflect.NativeMethodAccessorImpl.invoke0 (Native Method)
    at jdk.internal.reflect.NativeMethodAccessorImpl.invoke (NativeMethodAccessorImpl.java:62)
    at jdk.internal.reflect.DelegatingMethodAccessorImpl.invoke (DelegatingMethodAccessorImpl.java:43)
    at java.lang.reflect.Method.invoke (Method.java:566)
    at org.apache.maven.it.Embedded3xLauncher.run (Embedded3xLauncher.java:215)
    at org.apache.maven.it.Verifier.executeGoals (Verifier.java:1339)
    at org.apache.maven.it.Verifier.executeGoal (Verifier.java:1239)
    at org.apache.maven.it.Verifier.executeGoal (Verifier.java:1233)
    at org.apache.maven.it.MavenITmng6972AllowAccessToGraphPackageTest.testit (MavenITmng6972AllowAccessToGraphPackageTest.java:60)
    at jdk.internal.reflect.NativeMethodAccessorImpl.invoke0 (Native Method)
    at jdk.internal.reflect.NativeMethodAccessorImpl.invoke (NativeMethodAccessorImpl.java:62)
    at jdk.internal.reflect.DelegatingMethodAccessorImpl.invoke (DelegatingMethodAccessorImpl.java:43)
    at java.lang.reflect.Method.invoke (Method.java:566)
    at junit.framework.TestCase.runTest (TestCase.java:176)
    at org.apache.maven.it.AbstractMavenIntegrationTestCase.runTest (AbstractMavenIntegrationTestCase.java:255)
    at junit.framework.TestCase.runBare (TestCase.java:141)
    at junit.framework.TestResult$1.protect (TestResult.java:122)
    at junit.framework.TestResult.runProtected (TestResult.java:142)
    at junit.framework.TestResult.run (TestResult.java:125)
    at junit.framework.TestCase.run (TestCase.java:129)
    at junit.framework.TestSuite.runTest (TestSuite.java:252)
    at junit.framework.TestSuite.run (TestSuite.java:247)
    at junit.framework.TestSuite.runTest (TestSuite.java:252)
    at junit.framework.TestSuite.run (TestSuite.java:247)
    at org.junit.internal.runners.JUnit38ClassRunner.run (JUnit38ClassRunner.java:86)
    at org.apache.maven.surefire.junit4.JUnit4Provider.execute (JUnit4Provider.java:365)
    at org.apache.maven.surefire.junit4.JUnit4Provider.executeWithRerun (JUnit4Provider.java:273)
    at org.apache.maven.surefire.junit4.JUnit4Provider.executeTestSet (JUnit4Provider.java:238)
    at org.apache.maven.surefire.junit4.JUnit4Provider.invoke (JUnit4Provider.java:159)
    at org.apache.maven.surefire.booter.ForkedBooter.invokeProviderInSameClassLoader (ForkedBooter.java:383)
    at org.apache.maven.surefire.booter.ForkedBooter.runSuitesInProcess (ForkedBooter.java:344)
    at org.apache.maven.surefire.booter.ForkedBooter.execute (ForkedBooter.java:125)
    at org.apache.maven.surefire.booter.ForkedBooter.main (ForkedBooter.java:417)
Caused by: org.apache.maven.plugin.compiler.CompilationFailureException: Compilation failure
/C:/mvn-it-0.tmp/core-it-suite/target/test-classes/mng-6972-allow-access-to-graph-package/build-plugin/src/main/java/com/example/BuildExtensionUsingGraphPackage.java:[4,17] cannot find symbol
  symbol:   class Objects
  location: package java.util

    at org.apache.maven.plugin.compiler.AbstractCompilerMojo.execute (AbstractCompilerMojo.java:1220)
    at org.apache.maven.plugin.compiler.CompilerMojo.execute (CompilerMojo.java:187)
    at org.apache.maven.plugin.DefaultBuildPluginManager.executeMojo (DefaultBuildPluginManager.java:136)
    at org.apache.maven.lifecycle.internal.MojoExecutor.execute (MojoExecutor.java:213)
    at org.apache.maven.lifecycle.internal.MojoExecutor.execute (MojoExecutor.java:159)
    at org.apache.maven.lifecycle.internal.MojoExecutor.execute (MojoExecutor.java:151)
    at org.apache.maven.lifecycle.internal.LifecycleModuleBuilder.buildProject (LifecycleModuleBuilder.java:115)
    at org.apache.maven.lifecycle.internal.LifecycleModuleBuilder.buildProject (LifecycleModuleBuilder.java:79)
    at org.apache.maven.lifecycle.internal.builder.singlethreaded.SingleThreadedBuilder.build (SingleThreadedBuilder.java:64)
    at org.apache.maven.lifecycle.internal.LifecycleStarter.execute (LifecycleStarter.java:131)
    at org.apache.maven.DefaultMaven.doExecute (DefaultMaven.java:321)
    at org.apache.maven.DefaultMaven.doExecute (DefaultMaven.java:206)
    at org.apache.maven.DefaultMaven.execute (DefaultMaven.java:119)
    at org.apache.maven.cli.MavenCli.execute (MavenCli.java:979)
    at org.apache.maven.cli.MavenCli.doMain (MavenCli.java:293)
    at org.apache.maven.cli.MavenCli.doMain (MavenCli.java:248)
    at jdk.internal.reflect.NativeMethodAccessorImpl.invoke0 (Native Method)
    at jdk.internal.reflect.NativeMethodAccessorImpl.invoke (NativeMethodAccessorImpl.java:62)
    at jdk.internal.reflect.DelegatingMethodAccessorImpl.invoke (DelegatingMethodAccessorImpl.java:43)
    at java.lang.reflect.Method.invoke (Method.java:566)
    at org.apache.maven.it.Embedded3xLauncher.run (Embedded3xLauncher.java:215)
    at org.apache.maven.it.Verifier.executeGoals (Verifier.java:1339)
    at org.apache.maven.it.Verifier.executeGoal (Verifier.java:1239)
    at org.apache.maven.it.Verifier.executeGoal (Verifier.java:1233)
    at org.apache.maven.it.MavenITmng6972AllowAccessToGraphPackageTest.testit (MavenITmng6972AllowAccessToGraphPackageTest.java:60)
    at jdk.internal.reflect.NativeMethodAccessorImpl.invoke0 (Native Method)
    at jdk.internal.reflect.NativeMethodAccessorImpl.invoke (NativeMethodAccessorImpl.java:62)
    at jdk.internal.reflect.DelegatingMethodAccessorImpl.invoke (DelegatingMethodAccessorImpl.java:43)
    at java.lang.reflect.Method.invoke (Method.java:566)
    at junit.framework.TestCase.runTest (TestCase.java:176)
    at org.apache.maven.it.AbstractMavenIntegrationTestCase.runTest (AbstractMavenIntegrationTestCase.java:255)
    at junit.framework.TestCase.runBare (TestCase.java:141)
    at junit.framework.TestResult$1.protect (TestResult.java:122)
    at junit.framework.TestResult.runProtected (TestResult.java:142)
    at junit.framework.TestResult.run (TestResult.java:125)
    at junit.framework.TestCase.run (TestCase.java:129)
    at junit.framework.TestSuite.runTest (TestSuite.java:252)
    at junit.framework.TestSuite.run (TestSuite.java:247)
    at junit.framework.TestSuite.runTest (TestSuite.java:252)
    at junit.framework.TestSuite.run (TestSuite.java:247)
    at org.junit.internal.runners.JUnit38ClassRunner.run (JUnit38ClassRunner.java:86)
    at org.apache.maven.surefire.junit4.JUnit4Provider.execute (JUnit4Provider.java:365)
    at org.apache.maven.surefire.junit4.JUnit4Provider.executeWithRerun (JUnit4Provider.java:273)
    at org.apache.maven.surefire.junit4.JUnit4Provider.executeTestSet (JUnit4Provider.java:238)
    at org.apache.maven.surefire.junit4.JUnit4Provider.invoke (JUnit4Provider.java:159)
    at org.apache.maven.surefire.booter.ForkedBooter.invokeProviderInSameClassLoader (ForkedBooter.java:383)
    at org.apache.maven.surefire.booter.ForkedBooter.runSuitesInProcess (ForkedBooter.java:344)
    at org.apache.maven.surefire.booter.ForkedBooter.execute (ForkedBooter.java:125)
    at org.apache.maven.surefire.booter.ForkedBooter.main (ForkedBooter.java:417)
[ERROR]
[ERROR] Re-run Maven using the '-X' switch to enable full debug logging.
[ERROR]
[ERROR] For more information about the errors and possible solutions, please read the following articles:
[ERROR] [Help 1] http://cwiki.apache.org/confluence/display/MAVEN/MojoFailureException

        at org.apache.maven.it.MavenITmng6972AllowAccessToGraphPackageTest.testit(MavenITmng6972AllowAccessToGraphPackageTest.java:60)


FAILED:  org.apache.maven.it.MavenITmng6972AllowAccessToGraphPackageTest.linux-jdk11 / Run ITs Linux Java 11 / testit

Error Message:
Exit code was non-zero: 1; command line and log =
/home/jenkins/workspace/Maven_maven-box_maven_master/test/core-it-suite/target/apache-maven/bin/mvn --global-settings /home/jenkins/workspace/Maven_maven-box_maven_master/test/core-it-suite/target/test-classes/settings.xml -e --batch-mode -Dmaven.repo.local=/home/jenkins/workspace/Maven_maven-box_maven_master/test/it-local-repo install
[INFO] [jenkins-event-spy] Jenkins Maven Event Spy is disabled
[INFO] Error stacktraces are turned on.
[INFO] Scanning for projects...
[INFO] Maven detected that the requested POM file is part of a multi module project, but could not find a pom.xml file in the multi module root directory '/home/jenkins/workspace/Maven_maven-box_maven_master/test/core-it-suite/target/test-classes/mng-6972-allow-access-to-graph-package'.
[INFO] The reactor is limited to all projects under: /home/jenkins/workspace/Maven_maven-box_maven_master/test/core-it-suite/target/test-classes/mng-6972-allow-access-to-graph-package/build-plugin
[INFO]
[INFO] --------< mng-6972-allow-access-to-graph-package:build-plugin >---------
[INFO] Building build-plugin 1.0
[INFO] --------------------------------[ jar ]---------------------------------
[WARNING] Version not locked for default bindings plugins [maven-resources-plugin, maven-compiler-plugin, maven-surefire-plugin, maven-jar-plugin, maven-install-plugin], you should define versions in pluginManagement section of your pom.xml or parent
[INFO]
[INFO] --- maven-resources-plugin:3.2.0:resources (default-resources) @ build-plugin ---
[INFO] Using 'UTF-8' encoding to copy filtered resources.
[INFO] Using 'UTF-8' encoding to copy filtered properties files.
[INFO] skip non existing resourceDirectory /home/jenkins/workspace/Maven_maven-box_maven_master/test/core-it-suite/target/test-classes/mng-6972-allow-access-to-graph-package/build-plugin/src/main/resources
[INFO] skip non existing resourceDirectory /home/jenkins/workspace/Maven_maven-box_maven_master/test/core-it-suite/target/test-classes/mng-6972-allow-access-to-graph-package/build-plugin/src/main/resources-filtered
[INFO]
[INFO] --- maven-compiler-plugin:3.8.1:compile (default-compile) @ build-plugin ---
[INFO] Changes detected - recompiling the module!
[INFO] Compiling 1 source file to /home/jenkins/workspace/Maven_maven-box_maven_master/test/core-it-suite/target/test-classes/mng-6972-allow-access-to-graph-package/build-plugin/target/classes
[INFO] -------------------------------------------------------------
[ERROR] COMPILATION ERROR :
[INFO] -------------------------------------------------------------
[ERROR] /home/jenkins/workspace/Maven_maven-box_maven_master/test/core-it-suite/target/test-classes/mng-6972-allow-access-to-graph-package/build-plugin/src/main/java/com/example/BuildExtensionUsingGraphPackage.java:[4,17] cannot find symbol
  symbol:   class Objects
  location: package java.util
[INFO] 1 error
[INFO] -------------------------------------------------------------
[INFO] ------------------------------------------------------------------------
[INFO] BUILD FAILURE
[INFO] ------------------------------------------------------------------------
[INFO] Total time:  0.473 s
[INFO] Finished at: 2021-01-06T11:54:06Z
[INFO] ------------------------------------------------------------------------
[ERROR] Failed to execute goal org.apache.maven.plugins:maven-compiler-plugin:3.8.1:compile (default-compile) on project build-plugin: Compilation failure
[ERROR] /home/jenkins/workspace/Maven_maven-box_maven_master/test/core-it-suite/target/test-classes/mng-6972-allow-access-to-graph-package/build-plugin/src/main/java/com/example/BuildExtensionUsingGraphPackage.java:[4,17] cannot find symbol
[ERROR]   symbol:   class Objects
[ERROR]   location: package java.util
[ERROR] -> [Help 1]
org.apache.maven.lifecycle.LifecycleExecutionException: Failed to execute goal org.apache.maven.plugins:maven-compiler-plugin:3.8.1:compile (default-compile) on project build-plugin: Compilation failure
/home/jenkins/workspace/Maven_maven-box_maven_master/test/core-it-suite/target/test-classes/mng-6972-allow-access-to-graph-package/build-plugin/src/main/java/com/example/BuildExtensionUsingGraphPackage.java:[4,17] cannot find symbol
  symbol:   class Objects
  location: package java.util

    at org.apache.maven.lifecycle.internal.MojoExecutor.execute (MojoExecutor.java:218)
    at org.apache.maven.lifecycle.internal.MojoExecutor.execute (MojoExecutor.java:159)
    at org.apache.maven.lifecycle.internal.MojoExecutor.execute (MojoExecutor.java:151)
    at org.apache.maven.lifecycle.internal.LifecycleModuleBuilder.buildProject (LifecycleModuleBuilder.java:115)
    at org.apache.maven.lifecycle.internal.LifecycleModuleBuilder.buildProject (LifecycleModuleBuilder.java:79)
    at org.apache.maven.lifecycle.internal.builder.singlethreaded.SingleThreadedBuilder.build (SingleThreadedBuilder.java:64)
    at org.apache.maven.lifecycle.internal.LifecycleStarter.execute (LifecycleStarter.java:131)
    at org.apache.maven.DefaultMaven.doExecute (DefaultMaven.java:321)
    at org.apache.maven.DefaultMaven.doExecute (DefaultMaven.java:206)
    at org.apache.maven.DefaultMaven.execute (DefaultMaven.java:119)
    at org.apache.maven.cli.MavenCli.execute (MavenCli.java:979)
    at org.apache.maven.cli.MavenCli.doMain (MavenCli.java:293)
    at org.apache.maven.cli.MavenCli.doMain (MavenCli.java:248)
    at jdk.internal.reflect.NativeMethodAccessorImpl.invoke0 (Native Method)
    at jdk.internal.reflect.NativeMethodAccessorImpl.invoke (NativeMethodAccessorImpl.java:62)
    at jdk.internal.reflect.DelegatingMethodAccessorImpl.invoke (DelegatingMethodAccessorImpl.java:43)
    at java.lang.reflect.Method.invoke (Method.java:566)
    at org.apache.maven.it.Embedded3xLauncher.run (Embedded3xLauncher.java:215)
    at org.apache.maven.it.Verifier.executeGoals (Verifier.java:1339)
    at org.apache.maven.it.Verifier.executeGoal (Verifier.java:1239)
    at org.apache.maven.it.Verifier.executeGoal (Verifier.java:1233)
    at org.apache.maven.it.MavenITmng6972AllowAccessToGraphPackageTest.testit (MavenITmng6972AllowAccessToGraphPackageTest.java:60)
    at jdk.internal.reflect.NativeMethodAccessorImpl.invoke0 (Native Method)
    at jdk.internal.reflect.NativeMethodAccessorImpl.invoke (NativeMethodAccessorImpl.java:62)
    at jdk.internal.reflect.DelegatingMethodAccessorImpl.invoke (DelegatingMethodAccessorImpl.java:43)
    at java.lang.reflect.Method.invoke (Method.java:566)
    at junit.framework.TestCase.runTest (TestCase.java:176)
    at org.apache.maven.it.AbstractMavenIntegrationTestCase.runTest (AbstractMavenIntegrationTestCase.java:255)
    at junit.framework.TestCase.runBare (TestCase.java:141)
    at junit.framework.TestResult$1.protect (TestResult.java:122)
    at junit.framework.TestResult.runProtected (TestResult.java:142)
    at junit.framework.TestResult.run (TestResult.java:125)
    at junit.framework.TestCase.run (TestCase.java:129)
    at junit.framework.TestSuite.runTest (TestSuite.java:252)
    at junit.framework.TestSuite.run (TestSuite.java:247)
    at junit.framework.TestSuite.runTest (TestSuite.java:252)
    at junit.framework.TestSuite.run (TestSuite.java:247)
    at org.junit.internal.runners.JUnit38ClassRunner.run (JUnit38ClassRunner.java:86)
    at org.apache.maven.surefire.junit4.JUnit4Provider.execute (JUnit4Provider.java:365)
    at org.apache.maven.surefire.junit4.JUnit4Provider.executeWithRerun (JUnit4Provider.java:273)
    at org.apache.maven.surefire.junit4.JUnit4Provider.executeTestSet (JUnit4Provider.java:238)
    at org.apache.maven.surefire.junit4.JUnit4Provider.invoke (JUnit4Provider.java:159)
    at org.apache.maven.surefire.booter.ForkedBooter.invokeProviderInSameClassLoader (ForkedBooter.java:383)
    at org.apache.maven.surefire.booter.ForkedBooter.runSuitesInProcess (ForkedBooter.java:344)
    at org.apache.maven.surefire.booter.ForkedBooter.execute (ForkedBooter.java:125)
    at org.apache.maven.surefire.booter.ForkedBooter.main (ForkedBooter.java:417)
Caused by: org.apache.maven.plugin.compiler.CompilationFailureException: Compilation failure
/home/jenkins/workspace/Maven_maven-box_maven_master/test/core-it-suite/target/test-classes/mng-6972-allow-access-to-graph-package/build-plugin/src/main/java/com/example/BuildExtensionUsingGraphPackage.java:[4,17] cannot find symbol
  symbol:   class Objects
  location: package java.util

    at org.apache.maven.plugin.compiler.AbstractCompilerMojo.execute (AbstractCompilerMojo.java:1220)
    at org.apache.maven.plugin.compiler.CompilerMojo.execute (CompilerMojo.java:187)
    at org.apache.maven.plugin.DefaultBuildPluginManager.executeMojo (DefaultBuildPluginManager.java:136)
    at org.apache.maven.lifecycle.internal.MojoExecutor.execute (MojoExecutor.java:213)
    at org.apache.maven.lifecycle.internal.MojoExecutor.execute (MojoExecutor.java:159)
    at org.apache.maven.lifecycle.internal.MojoExecutor.execute (MojoExecutor.java:151)
    at org.apache.maven.lifecycle.internal.LifecycleModuleBuilder.buildProject (LifecycleModuleBuilder.java:115)
    at org.apache.maven.lifecycle.internal.LifecycleModuleBuilder.buildProject (LifecycleModuleBuilder.java:79)
    at org.apache.maven.lifecycle.internal.builder.singlethreaded.SingleThreadedBuilder.build (SingleThreadedBuilder.java:64)
    at org.apache.maven.lifecycle.internal.LifecycleStarter.execute (LifecycleStarter.java:131)
    at org.apache.maven.DefaultMaven.doExecute (DefaultMaven.java:321)
    at org.apache.maven.DefaultMaven.doExecute (DefaultMaven.java:206)
    at org.apache.maven.DefaultMaven.execute (DefaultMaven.java:119)
    at org.apache.maven.cli.MavenCli.execute (MavenCli.java:979)
    at org.apache.maven.cli.MavenCli.doMain (MavenCli.java:293)
    at org.apache.maven.cli.MavenCli.doMain (MavenCli.java:248)
    at jdk.internal.reflect.NativeMethodAccessorImpl.invoke0 (Native Method)
    at jdk.internal.reflect.NativeMethodAccessorImpl.invoke (NativeMethodAccessorImpl.java:62)
    at jdk.internal.reflect.DelegatingMethodAccessorImpl.invoke (DelegatingMethodAccessorImpl.java:43)
    at java.lang.reflect.Method.invoke (Method.java:566)
    at org.apache.maven.it.Embedded3xLauncher.run (Embedded3xLauncher.java:215)
    at org.apache.maven.it.Verifier.executeGoals (Verifier.java:1339)
    at org.apache.maven.it.Verifier.executeGoal (Verifier.java:1239)
    at org.apache.maven.it.Verifier.executeGoal (Verifier.java:1233)
    at org.apache.maven.it.MavenITmng6972AllowAccessToGraphPackageTest.testit (MavenITmng6972AllowAccessToGraphPackageTest.java:60)
    at jdk.internal.reflect.NativeMethodAccessorImpl.invoke0 (Native Method)
    at jdk.internal.reflect.NativeMethodAccessorImpl.invoke (NativeMethodAccessorImpl.java:62)
    at jdk.internal.reflect.DelegatingMethodAccessorImpl.invoke (DelegatingMethodAccessorImpl.java:43)
    at java.lang.reflect.Method.invoke (Method.java:566)
    at junit.framework.TestCase.runTest (TestCase.java:176)
    at org.apache.maven.it.AbstractMavenIntegrationTestCase.runTest (AbstractMavenIntegrationTestCase.java:255)
    at junit.framework.TestCase.runBare (TestCase.java:141)
    at junit.framework.TestResult$1.protect (TestResult.java:122)
    at junit.framework.TestResult.runProtected (TestResult.java:142)
    at junit.framework.TestResult.run (TestResult.java:125)
    at junit.framework.TestCase.run (TestCase.java:129)
    at junit.framework.TestSuite.runTest (TestSuite.java:252)
    at junit.framework.TestSuite.run (TestSuite.java:247)
    at junit.framework.TestSuite.runTest (TestSuite.java:252)
    at junit.framework.TestSuite.run (TestSuite.java:247)
    at org.junit.internal.runners.JUnit38ClassRunner.run (JUnit38ClassRunner.java:86)
    at org.apache.maven.surefire.junit4.JUnit4Provider.execute (JUnit4Provider.java:365)
    at org.apache.maven.surefire.junit4.JUnit4Provider.executeWithRerun (JUnit4Provider.java:273)
    at org.apache.maven.surefire.junit4.JUnit4Provider.executeTestSet (JUnit4Provider.java:238)
    at org.apache.maven.surefire.junit4.JUnit4Provider.invoke (JUnit4Provider.java:159)
    at org.apache.maven.surefire.booter.ForkedBooter.invokeProviderInSameClassLoader (ForkedBooter.java:383)
    at org.apache.maven.surefire.booter.ForkedBooter.runSuitesInProcess (ForkedBooter.java:344)
    at org.apache.maven.surefire.booter.ForkedBooter.execute (ForkedBooter.java:125)
    at org.apache.maven.surefire.booter.ForkedBooter.main (ForkedBooter.java:417)
[ERROR]
[ERROR] Re-run Maven using the '-X' switch to enable full debug logging.
[ERROR]
[ERROR] For more information about the errors and possible solutions, please read the following articles:
[ERROR] [Help 1] http://cwiki.apache.org/confluence/display/MAVEN/MojoFailureException


Stack Trace:
org.apache.maven.it.VerificationException:
Exit code was non-zero: 1; command line and log =
/home/jenkins/workspace/Maven_maven-box_maven_master/test/core-it-suite/target/apache-maven/bin/mvn --global-settings /home/jenkins/workspace/Maven_maven-box_maven_master/test/core-it-suite/target/test-classes/settings.xml -e --batch-mode -Dmaven.repo.local=/home/jenkins/workspace/Maven_maven-box_maven_master/test/it-local-repo install
[INFO] [jenkins-event-spy] Jenkins Maven Event Spy is disabled
[INFO] Error stacktraces are turned on.
[INFO] Scanning for projects...
[INFO] Maven detected that the requested POM file is part of a multi module project, but could not find a pom.xml file in the multi module root directory '/home/jenkins/workspace/Maven_maven-box_maven_master/test/core-it-suite/target/test-classes/mng-6972-allow-access-to-graph-package'.
[INFO] The reactor is limited to all projects under: /home/jenkins/workspace/Maven_maven-box_maven_master/test/core-it-suite/target/test-classes/mng-6972-allow-access-to-graph-package/build-plugin
[INFO]
[INFO] --------< mng-6972-allow-access-to-graph-package:build-plugin >---------
[INFO] Building build-plugin 1.0
[INFO] --------------------------------[ jar ]---------------------------------
[WARNING] Version not locked for default bindings plugins [maven-resources-plugin, maven-compiler-plugin, maven-surefire-plugin, maven-jar-plugin, maven-install-plugin], you should define versions in pluginManagement section of your pom.xml or parent
[INFO]
[INFO] --- maven-resources-plugin:3.2.0:resources (default-resources) @ build-plugin ---
[INFO] Using 'UTF-8' encoding to copy filtered resources.
[INFO] Using 'UTF-8' encoding to copy filtered properties files.
[INFO] skip non existing resourceDirectory /home/jenkins/workspace/Maven_maven-box_maven_master/test/core-it-suite/target/test-classes/mng-6972-allow-access-to-graph-package/build-plugin/src/main/resources
[INFO] skip non existing resourceDirectory /home/jenkins/workspace/Maven_maven-box_maven_master/test/core-it-suite/target/test-classes/mng-6972-allow-access-to-graph-package/build-plugin/src/main/resources-filtered
[INFO]
[INFO] --- maven-compiler-plugin:3.8.1:compile (default-compile) @ build-plugin ---
[INFO] Changes detected - recompiling the module!
[INFO] Compiling 1 source file to /home/jenkins/workspace/Maven_maven-box_maven_master/test/core-it-suite/target/test-classes/mng-6972-allow-access-to-graph-package/build-plugin/target/classes
[INFO] -------------------------------------------------------------
[ERROR] COMPILATION ERROR :
[INFO] -------------------------------------------------------------
[ERROR] /home/jenkins/workspace/Maven_maven-box_maven_master/test/core-it-suite/target/test-classes/mng-6972-allow-access-to-graph-package/build-plugin/src/main/java/com/example/BuildExtensionUsingGraphPackage.java:[4,17] cannot find symbol
  symbol:   class Objects
  location: package java.util
[INFO] 1 error
[INFO] -------------------------------------------------------------
[INFO] ------------------------------------------------------------------------
[INFO] BUILD FAILURE
[INFO] ------------------------------------------------------------------------
[INFO] Total time:  0.473 s
[INFO] Finished at: 2021-01-06T11:54:06Z
[INFO] ------------------------------------------------------------------------
[ERROR] Failed to execute goal org.apache.maven.plugins:maven-compiler-plugin:3.8.1:compile (default-compile) on project build-plugin: Compilation failure
[ERROR] /home/jenkins/workspace/Maven_maven-box_maven_master/test/core-it-suite/target/test-classes/mng-6972-allow-access-to-graph-package/build-plugin/src/main/java/com/example/BuildExtensionUsingGraphPackage.java:[4,17] cannot find symbol
[ERROR]   symbol:   class Objects
[ERROR]   location: package java.util
[ERROR] -> [Help 1]
org.apache.maven.lifecycle.LifecycleExecutionException: Failed to execute goal org.apache.maven.plugins:maven-compiler-plugin:3.8.1:compile (default-compile) on project build-plugin: Compilation failure
/home/jenkins/workspace/Maven_maven-box_maven_master/test/core-it-suite/target/test-classes/mng-6972-allow-access-to-graph-package/build-plugin/src/main/java/com/example/BuildExtensionUsingGraphPackage.java:[4,17] cannot find symbol
  symbol:   class Objects
  location: package java.util

    at org.apache.maven.lifecycle.internal.MojoExecutor.execute (MojoExecutor.java:218)
    at org.apache.maven.lifecycle.internal.MojoExecutor.execute (MojoExecutor.java:159)
    at org.apache.maven.lifecycle.internal.MojoExecutor.execute (MojoExecutor.java:151)
    at org.apache.maven.lifecycle.internal.LifecycleModuleBuilder.buildProject (LifecycleModuleBuilder.java:115)
    at org.apache.maven.lifecycle.internal.LifecycleModuleBuilder.buildProject (LifecycleModuleBuilder.java:79)
    at org.apache.maven.lifecycle.internal.builder.singlethreaded.SingleThreadedBuilder.build (SingleThreadedBuilder.java:64)
    at org.apache.maven.lifecycle.internal.LifecycleStarter.execute (LifecycleStarter.java:131)
    at org.apache.maven.DefaultMaven.doExecute (DefaultMaven.java:321)
    at org.apache.maven.DefaultMaven.doExecute (DefaultMaven.java:206)
    at org.apache.maven.DefaultMaven.execute (DefaultMaven.java:119)
    at org.apache.maven.cli.MavenCli.execute (MavenCli.java:979)
    at org.apache.maven.cli.MavenCli.doMain (MavenCli.java:293)
    at org.apache.maven.cli.MavenCli.doMain (MavenCli.java:248)
    at jdk.internal.reflect.NativeMethodAccessorImpl.invoke0 (Native Method)
    at jdk.internal.reflect.NativeMethodAccessorImpl.invoke (NativeMethodAccessorImpl.java:62)
    at jdk.internal.reflect.DelegatingMethodAccessorImpl.invoke (DelegatingMethodAccessorImpl.java:43)
    at java.lang.reflect.Method.invoke (Method.java:566)
    at org.apache.maven.it.Embedded3xLauncher.run (Embedded3xLauncher.java:215)
    at org.apache.maven.it.Verifier.executeGoals (Verifier.java:1339)
    at org.apache.maven.it.Verifier.executeGoal (Verifier.java:1239)
    at org.apache.maven.it.Verifier.executeGoal (Verifier.java:1233)
    at org.apache.maven.it.MavenITmng6972AllowAccessToGraphPackageTest.testit (MavenITmng6972AllowAccessToGraphPackageTest.java:60)
    at jdk.internal.reflect.NativeMethodAccessorImpl.invoke0 (Native Method)
    at jdk.internal.reflect.NativeMethodAccessorImpl.invoke (NativeMethodAccessorImpl.java:62)
    at jdk.internal.reflect.DelegatingMethodAccessorImpl.invoke (DelegatingMethodAccessorImpl.java:43)
    at java.lang.reflect.Method.invoke (Method.java:566)
    at junit.framework.TestCase.runTest (TestCase.java:176)
    at org.apache.maven.it.AbstractMavenIntegrationTestCase.runTest (AbstractMavenIntegrationTestCase.java:255)
    at junit.framework.TestCase.runBare (TestCase.java:141)
    at junit.framework.TestResult$1.protect (TestResult.java:122)
    at junit.framework.TestResult.runProtected (TestResult.java:142)
    at junit.framework.TestResult.run (TestResult.java:125)
    at junit.framework.TestCase.run (TestCase.java:129)
    at junit.framework.TestSuite.runTest (TestSuite.java:252)
    at junit.framework.TestSuite.run (TestSuite.java:247)
    at junit.framework.TestSuite.runTest (TestSuite.java:252)
    at junit.framework.TestSuite.run (TestSuite.java:247)
    at org.junit.internal.runners.JUnit38ClassRunner.run (JUnit38ClassRunner.java:86)
    at org.apache.maven.surefire.junit4.JUnit4Provider.execute (JUnit4Provider.java:365)
    at org.apache.maven.surefire.junit4.JUnit4Provider.executeWithRerun (JUnit4Provider.java:273)
    at org.apache.maven.surefire.junit4.JUnit4Provider.executeTestSet (JUnit4Provider.java:238)
    at org.apache.maven.surefire.junit4.JUnit4Provider.invoke (JUnit4Provider.java:159)
    at org.apache.maven.surefire.booter.ForkedBooter.invokeProviderInSameClassLoader (ForkedBooter.java:383)
    at org.apache.maven.surefire.booter.ForkedBooter.runSuitesInProcess (ForkedBooter.java:344)
    at org.apache.maven.surefire.booter.ForkedBooter.execute (ForkedBooter.java:125)
    at org.apache.maven.surefire.booter.ForkedBooter.main (ForkedBooter.java:417)
Caused by: org.apache.maven.plugin.compiler.CompilationFailureException: Compilation failure
/home/jenkins/workspace/Maven_maven-box_maven_master/test/core-it-suite/target/test-classes/mng-6972-allow-access-to-graph-package/build-plugin/src/main/java/com/example/BuildExtensionUsingGraphPackage.java:[4,17] cannot find symbol
  symbol:   class Objects
  location: package java.util

    at org.apache.maven.plugin.compiler.AbstractCompilerMojo.execute (AbstractCompilerMojo.java:1220)
    at org.apache.maven.plugin.compiler.CompilerMojo.execute (CompilerMojo.java:187)
    at org.apache.maven.plugin.DefaultBuildPluginManager.executeMojo (DefaultBuildPluginManager.java:136)
    at org.apache.maven.lifecycle.internal.MojoExecutor.execute (MojoExecutor.java:213)
    at org.apache.maven.lifecycle.internal.MojoExecutor.execute (MojoExecutor.java:159)
    at org.apache.maven.lifecycle.internal.MojoExecutor.execute (MojoExecutor.java:151)
    at org.apache.maven.lifecycle.internal.LifecycleModuleBuilder.buildProject (LifecycleModuleBuilder.java:115)
    at org.apache.maven.lifecycle.internal.LifecycleModuleBuilder.buildProject (LifecycleModuleBuilder.java:79)
    at org.apache.maven.lifecycle.internal.builder.singlethreaded.SingleThreadedBuilder.build (SingleThreadedBuilder.java:64)
    at org.apache.maven.lifecycle.internal.LifecycleStarter.execute (LifecycleStarter.java:131)
    at org.apache.maven.DefaultMaven.doExecute (DefaultMaven.java:321)
    at org.apache.maven.DefaultMaven.doExecute (DefaultMaven.java:206)
    at org.apache.maven.DefaultMaven.execute (DefaultMaven.java:119)
    at org.apache.maven.cli.MavenCli.execute (MavenCli.java:979)
    at org.apache.maven.cli.MavenCli.doMain (MavenCli.java:293)
    at org.apache.maven.cli.MavenCli.doMain (MavenCli.java:248)
    at jdk.internal.reflect.NativeMethodAccessorImpl.invoke0 (Native Method)
    at jdk.internal.reflect.NativeMethodAccessorImpl.invoke (NativeMethodAccessorImpl.java:62)
    at jdk.internal.reflect.DelegatingMethodAccessorImpl.invoke (DelegatingMethodAccessorImpl.java:43)
    at java.lang.reflect.Method.invoke (Method.java:566)
    at org.apache.maven.it.Embedded3xLauncher.run (Embedded3xLauncher.java:215)
    at org.apache.maven.it.Verifier.executeGoals (Verifier.java:1339)
    at org.apache.maven.it.Verifier.executeGoal (Verifier.java:1239)
    at org.apache.maven.it.Verifier.executeGoal (Verifier.java:1233)
    at org.apache.maven.it.MavenITmng6972AllowAccessToGraphPackageTest.testit (MavenITmng6972AllowAccessToGraphPackageTest.java:60)
    at jdk.internal.reflect.NativeMethodAccessorImpl.invoke0 (Native Method)
    at jdk.internal.reflect.NativeMethodAccessorImpl.invoke (NativeMethodAccessorImpl.java:62)
    at jdk.internal.reflect.DelegatingMethodAccessorImpl.invoke (DelegatingMethodAccessorImpl.java:43)
    at java.lang.reflect.Method.invoke (Method.java:566)
    at junit.framework.TestCase.runTest (TestCase.java:176)
    at org.apache.maven.it.AbstractMavenIntegrationTestCase.runTest (AbstractMavenIntegrationTestCase.java:255)
    at junit.framework.TestCase.runBare (TestCase.java:141)
    at junit.framework.TestResult$1.protect (TestResult.java:122)
    at junit.framework.TestResult.runProtected (TestResult.java:142)
    at junit.framework.TestResult.run (TestResult.java:125)
    at junit.framework.TestCase.run (TestCase.java:129)
    at junit.framework.TestSuite.runTest (TestSuite.java:252)
    at junit.framework.TestSuite.run (TestSuite.java:247)
    at junit.framework.TestSuite.runTest (TestSuite.java:252)
    at junit.framework.TestSuite.run (TestSuite.java:247)
    at org.junit.internal.runners.JUnit38ClassRunner.run (JUnit38ClassRunner.java:86)
    at org.apache.maven.surefire.junit4.JUnit4Provider.execute (JUnit4Provider.java:365)
    at org.apache.maven.surefire.junit4.JUnit4Provider.executeWithRerun (JUnit4Provider.java:273)
    at org.apache.maven.surefire.junit4.JUnit4Provider.executeTestSet (JUnit4Provider.java:238)
    at org.apache.maven.surefire.junit4.JUnit4Provider.invoke (JUnit4Provider.java:159)
    at org.apache.maven.surefire.booter.ForkedBooter.invokeProviderInSameClassLoader (ForkedBooter.java:383)
    at org.apache.maven.surefire.booter.ForkedBooter.runSuitesInProcess (ForkedBooter.java:344)
    at org.apache.maven.surefire.booter.ForkedBooter.execute (ForkedBooter.java:125)
    at org.apache.maven.surefire.booter.ForkedBooter.main (ForkedBooter.java:417)
[ERROR]
[ERROR] Re-run Maven using the '-X' switch to enable full debug logging.
[ERROR]
[ERROR] For more information about the errors and possible solutions, please read the following articles:
[ERROR] [Help 1] http://cwiki.apache.org/confluence/display/MAVEN/MojoFailureException

        at org.apache.maven.it.MavenITmng6972AllowAccessToGraphPackageTest.testit(MavenITmng6972AllowAccessToGraphPackageTest.java:60)




Build log:
[...truncated 43349 lines...]
[withMaven] artifactsPublisher - Archive artifact core-it-support/core-it-plugins/maven-it-plugin-site/target/maven-it-plugin-site-2.1-SNAPSHOT.jar under org/apache/maven/its/plugins/maven-it-plugin-site/2.1-SNAPSHOT/maven-it-plugin-site-2.1-SNAPSHOT.jar
[withMaven] artifactsPublisher - Archive artifact core-it-support/core-it-plugins/maven-it-plugin-toolchain/pom.xml under org/apache/maven/its/plugins/maven-it-plugin-toolchain/2.1-SNAPSHOT/maven-it-plugin-toolchain-2.1-SNAPSHOT.pom
[withMaven] artifactsPublisher - Archive artifact core-it-support/core-it-plugins/maven-it-plugin-toolchain/target/maven-it-plugin-toolchain-2.1-SNAPSHOT.jar under org/apache/maven/its/plugins/maven-it-plugin-toolchain/2.1-SNAPSHOT/maven-it-plugin-toolchain-2.1-SNAPSHOT.jar
[withMaven] artifactsPublisher - Archive artifact core-it-support/core-it-plugins/maven-it-plugin-touch/pom.xml under org/apache/maven/its/plugins/maven-it-plugin-touch/2.1-SNAPSHOT/maven-it-plugin-touch-2.1-SNAPSHOT.pom
[withMaven] artifactsPublisher - Archive artifact core-it-support/core-it-plugins/maven-it-plugin-touch/target/maven-it-plugin-touch-2.1-SNAPSHOT.jar under org/apache/maven/its/plugins/maven-it-plugin-touch/2.1-SNAPSHOT/maven-it-plugin-touch-2.1-SNAPSHOT.jar
[withMaven] artifactsPublisher - Archive artifact core-it-support/core-it-plugins/maven-it-plugin-uses-properties/pom.xml under org/apache/maven/its/plugins/maven-it-plugin-uses-properties/2.1-SNAPSHOT/maven-it-plugin-uses-properties-2.1-SNAPSHOT.pom
[withMaven] artifactsPublisher - Archive artifact core-it-support/core-it-plugins/maven-it-plugin-uses-properties/target/maven-it-plugin-uses-properties-2.1-SNAPSHOT.jar under org/apache/maven/its/plugins/maven-it-plugin-uses-properties/2.1-SNAPSHOT/maven-it-plugin-uses-properties-2.1-SNAPSHOT.jar
[withMaven] artifactsPublisher - Archive artifact core-it-support/core-it-plugins/maven-it-plugin-uses-wagon/pom.xml under org/apache/maven/its/plugins/maven-it-plugin-uses-wagon/2.1-SNAPSHOT/maven-it-plugin-uses-wagon-2.1-SNAPSHOT.pom
[withMaven] artifactsPublisher - Archive artifact core-it-support/core-it-plugins/maven-it-plugin-uses-wagon/target/maven-it-plugin-uses-wagon-2.1-SNAPSHOT.jar under org/apache/maven/its/plugins/maven-it-plugin-uses-wagon/2.1-SNAPSHOT/maven-it-plugin-uses-wagon-2.1-SNAPSHOT.jar
[withMaven] artifactsPublisher - Archive artifact core-it-support/core-it-plugins/maven-it-plugin-all/pom.xml under org/apache/maven/its/plugins/maven-it-plugin-all/2.1-SNAPSHOT/maven-it-plugin-all-2.1-SNAPSHOT.pom
[withMaven] artifactsPublisher - Archive artifact core-it-support/core-it-plugins/maven-it-plugin-all/target/maven-it-plugin-all-2.1-SNAPSHOT.jar under org/apache/maven/its/plugins/maven-it-plugin-all/2.1-SNAPSHOT/maven-it-plugin-all-2.1-SNAPSHOT.jar
[withMaven] artifactsPublisher - Archive artifact core-it-support/core-it-plugins/maven-it-plugin-plexus-utils-11/pom.xml under org/apache/maven/its/plugins/maven-it-plugin-plexus-utils-11/2.1-SNAPSHOT/maven-it-plugin-plexus-utils-11-2.1-SNAPSHOT.pom
[withMaven] artifactsPublisher - Archive artifact core-it-support/core-it-plugins/maven-it-plugin-plexus-utils-11/target/maven-it-plugin-plexus-utils-11-2.1-SNAPSHOT.jar under org/apache/maven/its/plugins/maven-it-plugin-plexus-utils-11/2.1-SNAPSHOT/maven-it-plugin-plexus-utils-11-2.1-SNAPSHOT.jar
[withMaven] artifactsPublisher - Archive artifact core-it-support/core-it-plugins/maven-it-plugin-plexus-utils-new/pom.xml under org/apache/maven/its/plugins/maven-it-plugin-plexus-utils-new/2.1-SNAPSHOT/maven-it-plugin-plexus-utils-new-2.1-SNAPSHOT.pom
[withMaven] artifactsPublisher - Archive artifact core-it-support/core-it-plugins/maven-it-plugin-plexus-utils-new/target/maven-it-plugin-plexus-utils-new-2.1-SNAPSHOT.jar under org/apache/maven/its/plugins/maven-it-plugin-plexus-utils-new/2.1-SNAPSHOT/maven-it-plugin-plexus-utils-new-2.1-SNAPSHOT.jar
[withMaven] artifactsPublisher - Archive artifact core-it-support/core-it-plugins/maven-it-plugin-plexus-component-api/pom.xml under org/apache/maven/its/plugins/maven-it-plugin-plexus-component-api/2.1-SNAPSHOT/maven-it-plugin-plexus-component-api-2.1-SNAPSHOT.pom
[withMaven] artifactsPublisher - Archive artifact core-it-support/core-it-plugins/maven-it-plugin-plexus-component-api/target/maven-it-plugin-plexus-component-api-2.1-SNAPSHOT.jar under org/apache/maven/its/plugins/maven-it-plugin-plexus-component-api/2.1-SNAPSHOT/maven-it-plugin-plexus-component-api-2.1-SNAPSHOT.jar
[withMaven] artifactsPublisher - Archive artifact core-it-support/core-it-plugins/maven-it-plugin-log4j/pom.xml under org/apache/maven/its/plugins/maven-it-plugin-log4j/2.1-SNAPSHOT/maven-it-plugin-log4j-2.1-SNAPSHOT.pom
[withMaven] artifactsPublisher - Archive artifact core-it-support/core-it-plugins/maven-it-plugin-log4j/target/maven-it-plugin-log4j-2.1-SNAPSHOT.jar under org/apache/maven/its/plugins/maven-it-plugin-log4j/2.1-SNAPSHOT/maven-it-plugin-log4j-2.1-SNAPSHOT.jar
[withMaven] artifactsPublisher - Archive artifact core-it-support/core-it-plugins/maven-it-plugin-extension1/pom.xml under org/apache/maven/its/plugins/maven-it-plugin-extension1/2.1-SNAPSHOT/maven-it-plugin-extension1-2.1-SNAPSHOT.pom
[withMaven] artifactsPublisher - Archive artifact core-it-support/core-it-plugins/maven-it-plugin-extension1/target/maven-it-plugin-extension1-2.1-SNAPSHOT.jar under org/apache/maven/its/plugins/maven-it-plugin-extension1/2.1-SNAPSHOT/maven-it-plugin-extension1-2.1-SNAPSHOT.jar
[withMaven] artifactsPublisher - Archive artifact core-it-support/core-it-plugins/maven-it-plugin-extension2/pom.xml under org/apache/maven/its/plugins/maven-it-plugin-extension2/2.1-SNAPSHOT/maven-it-plugin-extension2-2.1-SNAPSHOT.pom
[withMaven] artifactsPublisher - Archive artifact core-it-support/core-it-plugins/maven-it-plugin-extension2/target/maven-it-plugin-extension2-2.1-SNAPSHOT.jar under org/apache/maven/its/plugins/maven-it-plugin-extension2/2.1-SNAPSHOT/maven-it-plugin-extension2-2.1-SNAPSHOT.jar
[withMaven] artifactsPublisher - Archive artifact core-it-support/core-it-plugins/maven-it-plugin-plexus-lifecycle/pom.xml under org/apache/maven/its/plugins/maven-it-plugin-plexus-lifecycle/2.1-SNAPSHOT/maven-it-plugin-plexus-lifecycle-2.1-SNAPSHOT.pom
[withMaven] artifactsPublisher - Archive artifact core-it-support/core-it-plugins/maven-it-plugin-plexus-lifecycle/target/maven-it-plugin-plexus-lifecycle-2.1-SNAPSHOT.jar under org/apache/maven/its/plugins/maven-it-plugin-plexus-lifecycle/2.1-SNAPSHOT/maven-it-plugin-plexus-lifecycle-2.1-SNAPSHOT.jar
[withMaven] artifactsPublisher - Archive artifact core-it-support/core-it-plugins/maven-it-plugin-settings/pom.xml under org/apache/maven/its/plugins/maven-it-plugin-settings/2.1-SNAPSHOT/maven-it-plugin-settings-2.1-SNAPSHOT.pom
[withMaven] artifactsPublisher - Archive artifact core-it-support/core-it-plugins/maven-it-plugin-settings/target/maven-it-plugin-settings-2.1-SNAPSHOT.jar under org/apache/maven/its/plugins/maven-it-plugin-settings/2.1-SNAPSHOT/maven-it-plugin-settings-2.1-SNAPSHOT.jar
[withMaven] artifactsPublisher - Archive artifact core-it-support/core-it-plugins/mng5805-extension/pom.xml under org/apache/maven/its/plugins/mng-5805-pkg-type-mojo-configuration-extension/2.1-SNAPSHOT/mng-5805-pkg-type-mojo-configuration-extension-2.1-SNAPSHOT.pom
[withMaven] artifactsPublisher - Archive artifact core-it-support/core-it-plugins/mng5805-extension/target/mng-5805-pkg-type-mojo-configuration-extension-2.1-SNAPSHOT.jar under org/apache/maven/its/plugins/mng-5805-pkg-type-mojo-configuration-extension/2.1-SNAPSHOT/mng-5805-pkg-type-mojo-configuration-extension-2.1-SNAPSHOT.jar
[withMaven] artifactsPublisher - Archive artifact core-it-support/core-it-plugins/mng5805-extension2/pom.xml under org/apache/maven/its/plugins/mng-5805-pkg-type-mojo-configuration-extension2/2.1-SNAPSHOT/mng-5805-pkg-type-mojo-configuration-extension2-2.1-SNAPSHOT.pom
[withMaven] artifactsPublisher - Archive artifact core-it-support/core-it-plugins/mng5805-extension2/target/mng-5805-pkg-type-mojo-configuration-extension2-2.1-SNAPSHOT.jar under org/apache/maven/its/plugins/mng-5805-pkg-type-mojo-configuration-extension2/2.1-SNAPSHOT/mng-5805-pkg-type-mojo-configuration-extension2-2.1-SNAPSHOT.jar
[withMaven] artifactsPublisher - Archive artifact core-it-support/core-it-plugins/mng5805-plugin/pom.xml under org/apache/maven/its/plugins/mng-5805-pkg-type-mojo-configuration-plugin/2.1-SNAPSHOT/mng-5805-pkg-type-mojo-configuration-plugin-2.1-SNAPSHOT.pom
[withMaven] artifactsPublisher - Archive artifact core-it-support/core-it-plugins/mng5805-plugin/target/mng-5805-pkg-type-mojo-configuration-plugin-2.1-SNAPSHOT.jar under org/apache/maven/its/plugins/mng-5805-pkg-type-mojo-configuration-plugin/2.1-SNAPSHOT/mng-5805-pkg-type-mojo-configuration-plugin-2.1-SNAPSHOT.jar
[withMaven] artifactsPublisher - Archive artifact core-it-support/core-it-plugins/mng5805-plugin-dep/pom.xml under org/apache/maven/its/plugins/mng-5805-pkg-type-mojo-configuration-plugin-dep/2.1-SNAPSHOT/mng-5805-pkg-type-mojo-configuration-plugin-dep-2.1-SNAPSHOT.pom
[withMaven] artifactsPublisher - Archive artifact core-it-support/core-it-plugins/mng5805-plugin-dep/target/mng-5805-pkg-type-mojo-configuration-plugin-dep-2.1-SNAPSHOT.jar under org/apache/maven/its/plugins/mng-5805-pkg-type-mojo-configuration-plugin-dep/2.1-SNAPSHOT/mng-5805-pkg-type-mojo-configuration-plugin-dep-2.1-SNAPSHOT.jar
[withMaven] artifactsPublisher - Archive artifact core-it-support/core-it-plugins/mng5958-extension/pom.xml under org/apache/maven/its/plugins/mng-5958-pkg-type-extension/2.1-SNAPSHOT/mng-5958-pkg-type-extension-2.1-SNAPSHOT.pom
[withMaven] artifactsPublisher - Archive artifact core-it-support/core-it-plugins/mng5958-extension/target/mng-5958-pkg-type-extension-2.1-SNAPSHOT.jar under org/apache/maven/its/plugins/mng-5958-pkg-type-extension/2.1-SNAPSHOT/mng-5958-pkg-type-extension-2.1-SNAPSHOT.jar
[withMaven] artifactsPublisher - Archive artifact core-it-support/core-it-plugins/mng6759-plugin-resolves-project-dependencies/pom.xml under org/apache/maven/its/plugins/mng-6759-resolves-project-dependencies-plugin/2.1-SNAPSHOT/mng-6759-resolves-project-dependencies-plugin-2.1-SNAPSHOT.pom
[withMaven] artifactsPublisher - Archive artifact core-it-support/core-it-plugins/mng6759-plugin-resolves-project-dependencies/target/mng-6759-resolves-project-dependencies-plugin-2.1-SNAPSHOT.jar under org/apache/maven/its/plugins/mng-6759-resolves-project-dependencies-plugin/2.1-SNAPSHOT/mng-6759-resolves-project-dependencies-plugin-2.1-SNAPSHOT.jar
[withMaven] artifactsPublisher - Archive artifact core-it-support/core-it-toolchain/pom.xml under org/apache/maven/its/core-it-toolchain/2.1-SNAPSHOT/core-it-toolchain-2.1-SNAPSHOT.pom
[withMaven] artifactsPublisher - Archive artifact core-it-support/core-it-toolchain/target/core-it-toolchain-2.1-SNAPSHOT.jar under org/apache/maven/its/core-it-toolchain/2.1-SNAPSHOT/core-it-toolchain-2.1-SNAPSHOT.jar
[withMaven] artifactsPublisher - Archive artifact core-it-support/core-it-wagon/pom.xml under org/apache/maven/its/core-it-wagon/2.1-SNAPSHOT/core-it-wagon-2.1-SNAPSHOT.pom
[withMaven] artifactsPublisher - Archive artifact core-it-support/core-it-wagon/target/core-it-wagon-2.1-SNAPSHOT.jar under org/apache/maven/its/core-it-wagon/2.1-SNAPSHOT/core-it-wagon-2.1-SNAPSHOT.jar
[withMaven] artifactsPublisher - Archive artifact core-it-support/core-it-support-artifacts/pom.xml under org/apache/maven/its/core-it-support-artifacts/2.1-SNAPSHOT/core-it-support-artifacts-2.1-SNAPSHOT.pom
[withMaven] artifactsPublisher - Archive artifact core-it-support/core-it-support-artifacts/target/core-it-support-artifacts-2.1-SNAPSHOT-repo.zip under org/apache/maven/its/core-it-support-artifacts/2.1-SNAPSHOT/core-it-support-artifacts-2.1-SNAPSHOT-repo.zip
[withMaven] artifactsPublisher - Archive artifact core-it-support/core-it-extension/pom.xml under org/apache/maven/its/core-it-extension/2.1-SNAPSHOT/core-it-extension-2.1-SNAPSHOT.pom
[withMaven] artifactsPublisher - Archive artifact core-it-support/core-it-extension/target/core-it-extension-2.1-SNAPSHOT.jar under org/apache/maven/its/core-it-extension/2.1-SNAPSHOT/core-it-extension-2.1-SNAPSHOT.jar
[withMaven] artifactsPublisher - Archive artifact core-it-support/core-it-javaagent/pom.xml under mng-coreit/javaagent/1.0-SNAPSHOT/javaagent-1.0-SNAPSHOT.pom
[withMaven] artifactsPublisher - Archive artifact core-it-support/core-it-javaagent/target/javaagent-1.0-SNAPSHOT.jar under mng-coreit/javaagent/1.0-SNAPSHOT/javaagent-1.0-SNAPSHOT.jar
[withMaven] artifactsPublisher - Archive artifact core-it-suite/pom.xml under org/apache/maven/its/core-it-suite/2.1-SNAPSHOT/core-it-suite-2.1-SNAPSHOT.pom
[withMaven] artifactsPublisher - Archive artifact core-it-suite/target/core-it-suite-2.1-SNAPSHOT.jar under org/apache/maven/its/core-it-suite/2.1-SNAPSHOT/core-it-suite-2.1-SNAPSHOT.jar
[withMaven] artifactsPublisher - Archive artifact core-it-suite/target/core-it-suite-2.1-SNAPSHOT-tests.jar under org/apache/maven/its/core-it-suite/2.1-SNAPSHOT/core-it-suite-2.1-SNAPSHOT-tests.jar
[withMaven] junitPublisher - Archive test results for Maven artifact org.apache.maven.its.plugins:maven-it-plugin-active-collection:maven-plugin:2.1-SNAPSHOT generated by maven-surefire-plugin:test (default-test): core-it-support/core-it-plugins/maven-it-plugin-active-collection/target/surefire-reports/*.xml
[withMaven] junitPublisher - Archive test results for Maven artifact org.apache.maven.its.plugins:maven-it-plugin-ant-based:maven-plugin:2.1-SNAPSHOT generated by maven-surefire-plugin:test (default-test): core-it-support/core-it-plugins/maven-it-plugin-ant-based/target/surefire-reports/*.xml
[withMaven] junitPublisher - Archive test results for Maven artifact org.apache.maven.its.plugins:maven-it-plugin-artifact:maven-plugin:2.1-SNAPSHOT generated by maven-surefire-plugin:test (default-test): core-it-support/core-it-plugins/maven-it-plugin-artifact/target/surefire-reports/*.xml
[withMaven] junitPublisher - Archive test results for Maven artifact org.apache.maven.its.plugins.class-loader:dep-a:jar:2.1-SNAPSHOT generated by maven-surefire-plugin:test (default-test): core-it-support/core-it-plugins/maven-it-plugin-class-loader/dep-a/target/surefire-reports/*.xml
[withMaven] junitPublisher - Archive test results for Maven artifact org.apache.maven.its.plugins.class-loader:dep-b:jar:2.1-SNAPSHOT generated by maven-surefire-plugin:test (default-test): core-it-support/core-it-plugins/maven-it-plugin-class-loader/dep-b/target/surefire-reports/*.xml
[withMaven] junitPublisher - Archive test results for Maven artifact org.apache.maven.its.plugins.class-loader:dep-c:jar:2.1-SNAPSHOT generated by maven-surefire-plugin:test (default-test): core-it-support/core-it-plugins/maven-it-plugin-class-loader/dep-c/target/surefire-reports/*.xml
[withMaven] junitPublisher - Archive test results for Maven artifact org.apache.maven.its.plugins:maven-it-plugin-class-loader:maven-plugin:2.1-SNAPSHOT generated by maven-surefire-plugin:test (default-test): core-it-support/core-it-plugins/maven-it-plugin-class-loader/maven-it-plugin-class-loader/target/surefire-reports/*.xml
[withMaven] junitPublisher - Archive test results for Maven artifact org.apache.maven.its.plugins:maven-it-plugin-configuration:maven-plugin:2.1-SNAPSHOT generated by maven-surefire-plugin:test (default-test): core-it-support/core-it-plugins/maven-it-plugin-configuration/target/surefire-reports/*.xml
[withMaven] junitPublisher - Archive test results for Maven artifact org.apache.maven.its.plugins:maven-it-plugin-context-passing:maven-plugin:2.1-SNAPSHOT generated by maven-surefire-plugin:test (default-test): core-it-support/core-it-plugins/maven-it-plugin-context-passing/target/surefire-reports/*.xml
[withMaven] junitPublisher - Archive test results for Maven artifact org.apache.maven.plugins:maven-clean-plugin:maven-plugin:0.1-stub-SNAPSHOT generated by maven-surefire-plugin:test (default-test): core-it-support/core-it-plugins/maven-it-plugin-core-stubs/maven-clean-plugin/target/surefire-reports/*.xml
[withMaven] junitPublisher - Archive test results for Maven artifact org.apache.maven.plugins:maven-compiler-plugin:maven-plugin:0.1-stub-SNAPSHOT generated by maven-surefire-plugin:test (default-test): core-it-support/core-it-plugins/maven-it-plugin-core-stubs/maven-compiler-plugin/target/surefire-reports/*.xml
[withMaven] junitPublisher - Archive test results for Maven artifact org.apache.maven.plugins:maven-deploy-plugin:maven-plugin:0.1-stub-SNAPSHOT generated by maven-surefire-plugin:test (default-test): core-it-support/core-it-plugins/maven-it-plugin-core-stubs/maven-deploy-plugin/target/surefire-reports/*.xml
[withMaven] junitPublisher - Archive test results for Maven artifact org.apache.maven.plugins:maven-ear-plugin:maven-plugin:0.1-stub-SNAPSHOT generated by maven-surefire-plugin:test (default-test): core-it-support/core-it-plugins/maven-it-plugin-core-stubs/maven-ear-plugin/target/surefire-reports/*.xml
[withMaven] junitPublisher - Archive test results for Maven artifact org.apache.maven.plugins:maven-ejb-plugin:maven-plugin:0.1-stub-SNAPSHOT generated by maven-surefire-plugin:test (default-test): core-it-support/core-it-plugins/maven-it-plugin-core-stubs/maven-ejb-plugin/target/surefire-reports/*.xml
[withMaven] junitPublisher - Archive test results for Maven artifact org.apache.maven.plugins:maven-install-plugin:maven-plugin:0.1-stub-SNAPSHOT generated by maven-surefire-plugin:test (default-test): core-it-support/core-it-plugins/maven-it-plugin-core-stubs/maven-install-plugin/target/surefire-reports/*.xml
[withMaven] junitPublisher - Archive test results for Maven artifact org.apache.maven.plugins:maven-jar-plugin:maven-plugin:0.1-stub-SNAPSHOT generated by maven-surefire-plugin:test (default-test): core-it-support/core-it-plugins/maven-it-plugin-core-stubs/maven-jar-plugin/target/surefire-reports/*.xml
[withMaven] junitPublisher - Archive test results for Maven artifact org.apache.maven.plugins:maven-javadoc-plugin:maven-plugin:0.1-stub-SNAPSHOT generated by maven-surefire-plugin:test (default-test): core-it-support/core-it-plugins/maven-it-plugin-core-stubs/maven-javadoc-plugin/target/surefire-reports/*.xml
[withMaven] junitPublisher - Archive test results for Maven artifact org.apache.maven.plugins:maven-plugin-plugin:maven-plugin:0.1-stub-SNAPSHOT generated by maven-surefire-plugin:test (default-test): core-it-support/core-it-plugins/maven-it-plugin-core-stubs/maven-plugin-plugin/target/surefire-reports/*.xml
[withMaven] junitPublisher - Archive test results for Maven artifact org.apache.maven.plugins:maven-rar-plugin:maven-plugin:0.1-stub-SNAPSHOT generated by maven-surefire-plugin:test (default-test): core-it-support/core-it-plugins/maven-it-plugin-core-stubs/maven-rar-plugin/target/surefire-reports/*.xml
[withMaven] junitPublisher - Archive test results for Maven artifact org.apache.maven.plugins:maven-resources-plugin:maven-plugin:0.1-stub-SNAPSHOT generated by maven-surefire-plugin:test (default-test): core-it-support/core-it-plugins/maven-it-plugin-core-stubs/maven-resources-plugin/target/surefire-reports/*.xml
[withMaven] junitPublisher - Archive test results for Maven artifact org.apache.maven.plugins:maven-site-plugin:maven-plugin:0.1-stub-SNAPSHOT generated by maven-surefire-plugin:test (default-test): core-it-support/core-it-plugins/maven-it-plugin-core-stubs/maven-site-plugin/target/surefire-reports/*.xml
[withMaven] junitPublisher - Archive test results for Maven artifact org.apache.maven.plugins:maven-source-plugin:maven-plugin:0.1-stub-SNAPSHOT generated by maven-surefire-plugin:test (default-test): core-it-support/core-it-plugins/maven-it-plugin-core-stubs/maven-source-plugin/target/surefire-reports/*.xml
[withMaven] junitPublisher - Archive test results for Maven artifact org.apache.maven.plugins:maven-surefire-plugin:maven-plugin:0.1-stub-SNAPSHOT generated by maven-surefire-plugin:test (default-test): core-it-support/core-it-plugins/maven-it-plugin-core-stubs/maven-surefire-plugin/target/surefire-reports/*.xml
[withMaven] junitPublisher - Archive test results for Maven artifact org.apache.maven.plugins:maven-war-plugin:maven-plugin:0.1-stub-SNAPSHOT generated by maven-surefire-plugin:test (default-test): core-it-support/core-it-plugins/maven-it-plugin-core-stubs/maven-war-plugin/target/surefire-reports/*.xml
[withMaven] junitPublisher - Archive test results for Maven artifact org.apache.maven.its.plugins:maven-it-plugin-dependency-collection:maven-plugin:2.1-SNAPSHOT generated by maven-surefire-plugin:test (default-test): core-it-support/core-it-plugins/maven-it-plugin-dependency-collection/target/surefire-reports/*.xml
[withMaven] junitPublisher - Archive test results for Maven artifact org.apache.maven.its.plugins:maven-it-plugin-dependency-resolution:maven-plugin:2.1-SNAPSHOT generated by maven-surefire-plugin:test (default-test): core-it-support/core-it-plugins/maven-it-plugin-dependency-resolution/target/surefire-reports/*.xml
[withMaven] junitPublisher - Archive test results for Maven artifact org.apache.maven.its.plugins:maven-it-plugin-expression:maven-plugin:2.1-SNAPSHOT generated by maven-surefire-plugin:test (default-test): core-it-support/core-it-plugins/maven-it-plugin-expression/target/surefire-reports/*.xml
[withMaven] junitPublisher - Archive test results for Maven artifact org.apache.maven.its.plugins:maven-it-plugin-error:maven-plugin:2.1-SNAPSHOT generated by maven-surefire-plugin:test (default-test): core-it-support/core-it-plugins/maven-it-plugin-error/target/surefire-reports/*.xml
[withMaven] junitPublisher - Archive test results for Maven artifact org.apache.maven.its:core-it-component:jar:2.1-SNAPSHOT generated by maven-surefire-plugin:test (default-test): core-it-support/core-it-component/target/surefire-reports/*.xml
[withMaven] junitPublisher - Archive test results for Maven artifact org.apache.maven.its.plugins:maven-it-plugin-extension-consumer:maven-plugin:2.1-SNAPSHOT generated by maven-surefire-plugin:test (default-test): core-it-support/core-it-plugins/maven-it-plugin-extension-consumer/target/surefire-reports/*.xml
[withMaven] junitPublisher - Archive test results for Maven artifact org.apache.maven.its.plugins:maven-it-plugin-extension-provider:maven-plugin:2.1-SNAPSHOT generated by maven-surefire-plugin:test (default-test): core-it-support/core-it-plugins/maven-it-plugin-extension-provider/target/surefire-reports/*.xml
[withMaven] junitPublisher - Archive test results for Maven artifact org.apache.maven.its.plugins:maven-it-plugin-fork:maven-plugin:2.1-SNAPSHOT generated by maven-surefire-plugin:test (default-test): core-it-support/core-it-plugins/maven-it-plugin-fork/target/surefire-reports/*.xml
[withMaven] junitPublisher - Archive test results for Maven artifact org.apache.maven.its.plugins:maven-it-plugin-invalid-descriptor:maven-plugin:2.1-SNAPSHOT generated by maven-surefire-plugin:test (default-test): core-it-support/core-it-plugins/maven-it-plugin-invalid-descriptor/target/surefire-reports/*.xml
[withMaven] junitPublisher - Archive test results for Maven artifact org.apache.maven.its.plugins:maven-it-plugin-log-file:maven-plugin:2.1-SNAPSHOT generated by maven-surefire-plugin:test (default-test): core-it-support/core-it-plugins/maven-it-plugin-log-file/target/surefire-reports/*.xml
[withMaven] junitPublisher - Archive test results for Maven artifact org.apache.maven.its:maven-it-helper:jar:2.1-SNAPSHOT generated by maven-surefire-plugin:test (default-test): core-it-support/maven-it-helper/target/surefire-reports/*.xml
[withMaven] junitPublisher - Archive test results for Maven artifact org.apache.maven.its.plugins:maven-it-plugin-model-interpolation:maven-plugin:2.1-SNAPSHOT generated by maven-surefire-plugin:test (default-test): core-it-support/core-it-plugins/maven-it-plugin-model-interpolation/target/surefire-reports/*.xml
[withMaven] junitPublisher - Archive test results for Maven artifact org.apache.maven.its.plugins:maven-it-plugin-no-default-comp:maven-plugin:2.1-SNAPSHOT generated by maven-surefire-plugin:test (default-test): core-it-support/core-it-plugins/maven-it-plugin-no-default-comp/target/surefire-reports/*.xml
[withMaven] junitPublisher - Archive test results for Maven artifact org.apache.maven.its.plugins:maven-it-plugin-no-project:maven-plugin:2.1-SNAPSHOT generated by maven-surefire-plugin:test (default-test): core-it-support/core-it-plugins/maven-it-plugin-no-project/target/surefire-reports/*.xml
[withMaven] junitPublisher - Archive test results for Maven artifact org.apache.maven.its.plugins:maven-it-plugin-online:maven-plugin:2.1-SNAPSHOT generated by maven-surefire-plugin:test (default-test): core-it-support/core-it-plugins/maven-it-plugin-online/target/surefire-reports/*.xml
[withMaven] junitPublisher - Archive test results for Maven artifact org.apache.maven.its.plugins:maven-it-plugin-optional-mojos:maven-plugin:2.1-SNAPSHOT generated by maven-surefire-plugin:test (default-test): core-it-support/core-it-plugins/maven-it-plugin-optional-mojos/target/surefire-reports/*.xml
[withMaven] junitPublisher - Archive test results for Maven artifact org.apache.maven.its.plugins:maven-it-plugin-packaging:maven-plugin:2.1-SNAPSHOT generated by maven-surefire-plugin:test (default-test): core-it-support/core-it-plugins/maven-it-plugin-packaging/target/surefire-reports/*.xml
[withMaven] junitPublisher - Archive test results for Maven artifact org.apache.maven.its.plugins:maven-it-plugin-parameter-implementation:maven-plugin:2.1-SNAPSHOT generated by maven-surefire-plugin:test (default-test): core-it-support/core-it-plugins/maven-it-plugin-parameter-implementation/target/surefire-reports/*.xml
[withMaven] junitPublisher - Archive test results for Maven artifact org.apache.maven.its.plugins:maven-it-plugin-plugin-dependency:maven-plugin:2.1-SNAPSHOT generated by maven-surefire-plugin:test (default-test): core-it-support/core-it-plugins/maven-it-plugin-plugin-dependency/target/surefire-reports/*.xml
[withMaven] junitPublisher - Archive test results for Maven artifact org.apache.maven.its.plugins:maven-it-plugin-project:maven-plugin:2.1-SNAPSHOT generated by maven-surefire-plugin:test (default-test): core-it-support/core-it-plugins/maven-it-plugin-project/target/surefire-reports/*.xml
[withMaven] junitPublisher - Archive test results for Maven artifact org.apache.maven.its.plugins:maven-it-plugin-project-interpolation:maven-plugin:2.1-SNAPSHOT generated by maven-surefire-plugin:test (default-test): core-it-support/core-it-plugins/maven-it-plugin-project-interpolation/target/surefire-reports/*.xml
[withMaven] junitPublisher - Archive test results for Maven artifact org.apache.maven.its.plugins:maven-it-plugin-setter:maven-plugin:2.1-SNAPSHOT generated by maven-surefire-plugin:test (default-test): core-it-support/core-it-plugins/maven-it-plugin-setter/target/surefire-reports/*.xml
[withMaven] junitPublisher - Archive test results for Maven artifact org.apache.maven.its.plugins:maven-it-plugin-singleton-component:maven-plugin:2.1-SNAPSHOT generated by maven-surefire-plugin:test (default-test): core-it-support/core-it-plugins/maven-it-plugin-singleton-component/target/surefire-reports/*.xml
[withMaven] junitPublisher - Archive test results for Maven artifact org.apache.maven.its.plugins:maven-it-plugin-site:maven-plugin:2.1-SNAPSHOT generated by maven-surefire-plugin:test (default-test): core-it-support/core-it-plugins/maven-it-plugin-site/target/surefire-reports/*.xml
[withMaven] junitPublisher - Archive test results for Maven artifact org.apache.maven.its.plugins:maven-it-plugin-toolchain:maven-plugin:2.1-SNAPSHOT generated by maven-surefire-plugin:test (default-test): core-it-support/core-it-plugins/maven-it-plugin-toolchain/target/surefire-reports/*.xml
[withMaven] junitPublisher - Archive test results for Maven artifact org.apache.maven.its.plugins:maven-it-plugin-touch:maven-plugin:2.1-SNAPSHOT generated by maven-surefire-plugin:test (default-test): core-it-support/core-it-plugins/maven-it-plugin-touch/target/surefire-reports/*.xml
[withMaven] junitPublisher - Archive test results for Maven artifact org.apache.maven.its.plugins:maven-it-plugin-uses-properties:maven-plugin:2.1-SNAPSHOT generated by maven-surefire-plugin:test (default-test): core-it-support/core-it-plugins/maven-it-plugin-uses-properties/target/surefire-reports/*.xml
[withMaven] junitPublisher - Archive test results for Maven artifact org.apache.maven.its.plugins:maven-it-plugin-uses-wagon:maven-plugin:2.1-SNAPSHOT generated by maven-surefire-plugin:test (default-test): core-it-support/core-it-plugins/maven-it-plugin-uses-wagon/target/surefire-reports/*.xml
[withMaven] junitPublisher - Archive test results for Maven artifact org.apache.maven.its.plugins:maven-it-plugin-all:maven-plugin:2.1-SNAPSHOT generated by maven-surefire-plugin:test (default-test): core-it-support/core-it-plugins/maven-it-plugin-all/target/surefire-reports/*.xml
[withMaven] junitPublisher - Archive test results for Maven artifact org.apache.maven.its.plugins:maven-it-plugin-plexus-utils-11:maven-plugin:2.1-SNAPSHOT generated by maven-surefire-plugin:test (default-test): core-it-support/core-it-plugins/maven-it-plugin-plexus-utils-11/target/surefire-reports/*.xml
[withMaven] junitPublisher - Archive test results for Maven artifact org.apache.maven.its.plugins:maven-it-plugin-plexus-utils-new:maven-plugin:2.1-SNAPSHOT generated by maven-surefire-plugin:test (default-test): core-it-support/core-it-plugins/maven-it-plugin-plexus-utils-new/target/surefire-reports/*.xml
[withMaven] junitPublisher - Archive test results for Maven artifact org.apache.maven.its.plugins:maven-it-plugin-plexus-component-api:maven-plugin:2.1-SNAPSHOT generated by maven-surefire-plugin:test (default-test): core-it-support/core-it-plugins/maven-it-plugin-plexus-component-api/target/surefire-reports/*.xml
[withMaven] junitPublisher - Archive test results for Maven artifact org.apache.maven.its.plugins:maven-it-plugin-log4j:maven-plugin:2.1-SNAPSHOT generated by maven-surefire-plugin:test (default-test): core-it-support/core-it-plugins/maven-it-plugin-log4j/target/surefire-reports/*.xml
[withMaven] junitPublisher - Archive test results for Maven artifact org.apache.maven.its.plugins:maven-it-plugin-extension1:maven-plugin:2.1-SNAPSHOT generated by maven-surefire-plugin:test (default-test): core-it-support/core-it-plugins/maven-it-plugin-extension1/target/surefire-reports/*.xml
[withMaven] junitPublisher - Archive test results for Maven artifact org.apache.maven.its.plugins:maven-it-plugin-extension2:maven-plugin:2.1-SNAPSHOT generated by maven-surefire-plugin:test (default-test): core-it-support/core-it-plugins/maven-it-plugin-extension2/target/surefire-reports/*.xml
[withMaven] junitPublisher - Archive test results for Maven artifact org.apache.maven.its.plugins:maven-it-plugin-plexus-lifecycle:maven-plugin:2.1-SNAPSHOT generated by maven-surefire-plugin:test (default-test): core-it-support/core-it-plugins/maven-it-plugin-plexus-lifecycle/target/surefire-reports/*.xml
[withMaven] junitPublisher - Archive test results for Maven artifact org.apache.maven.its.plugins:maven-it-plugin-settings:maven-plugin:2.1-SNAPSHOT generated by maven-surefire-plugin:test (default-test): core-it-support/core-it-plugins/maven-it-plugin-settings/target/surefire-reports/*.xml
[withMaven] junitPublisher - Archive test results for Maven artifact org.apache.maven.its.plugins:mng-5805-pkg-type-mojo-configuration-extension:jar:2.1-SNAPSHOT generated by maven-surefire-plugin:test (default-test): core-it-support/core-it-plugins/mng5805-extension/target/surefire-reports/*.xml
[withMaven] junitPublisher - Archive test results for Maven artifact org.apache.maven.its.plugins:mng-5805-pkg-type-mojo-configuration-extension2:jar:2.1-SNAPSHOT generated by maven-surefire-plugin:test (default-test): core-it-support/core-it-plugins/mng5805-extension2/target/surefire-reports/*.xml
[withMaven] junitPublisher - Archive test results for Maven artifact org.apache.maven.its.plugins:mng-5805-pkg-type-mojo-configuration-plugin:maven-plugin:2.1-SNAPSHOT generated by maven-surefire-plugin:test (default-test): core-it-support/core-it-plugins/mng5805-plugin/target/surefire-reports/*.xml
[withMaven] junitPublisher - Archive test results for Maven artifact org.apache.maven.its.plugins:mng-5805-pkg-type-mojo-configuration-plugin-dep:jar:2.1-SNAPSHOT generated by maven-surefire-plugin:test (default-test): core-it-support/core-it-plugins/mng5805-plugin-dep/target/surefire-reports/*.xml
[withMaven] junitPublisher - Archive test results for Maven artifact org.apache.maven.its.plugins:mng-5958-pkg-type-extension:jar:2.1-SNAPSHOT generated by maven-surefire-plugin:test (default-test): core-it-support/core-it-plugins/mng5958-extension/target/surefire-reports/*.xml
[withMaven] junitPublisher - Archive test results for Maven artifact org.apache.maven.its.plugins:mng-6759-resolves-project-dependencies-plugin:maven-plugin:2.1-SNAPSHOT generated by maven-surefire-plugin:test (default-test): core-it-support/core-it-plugins/mng6759-plugin-resolves-project-dependencies/target/surefire-reports/*.xml
[withMaven] junitPublisher - Archive test results for Maven artifact org.apache.maven.its:core-it-toolchain:jar:2.1-SNAPSHOT generated by maven-surefire-plugin:test (default-test): core-it-support/core-it-toolchain/target/surefire-reports/*.xml
[withMaven] junitPublisher - Archive test results for Maven artifact org.apache.maven.its:core-it-wagon:jar:2.1-SNAPSHOT generated by maven-surefire-plugin:test (default-test): core-it-support/core-it-wagon/target/surefire-reports/*.xml
[withMaven] junitPublisher - Archive test results for Maven artifact org.apache.maven.its:core-it-extension:jar:2.1-SNAPSHOT generated by maven-surefire-plugin:test (default-test): core-it-support/core-it-extension/target/surefire-reports/*.xml
[withMaven] junitPublisher - Archive test results for Maven artifact mng-coreit:javaagent:jar:1.0-SNAPSHOT generated by maven-surefire-plugin:test (default-test): core-it-support/core-it-javaagent/target/surefire-reports/*.xml
[withMaven] junitPublisher - Archive test results for Maven artifact org.apache.maven.its:core-it-suite:jar:2.1-SNAPSHOT generated by maven-surefire-plugin:test (default-test): core-it-suite/target/surefire-reports/*.xml
Recording test results
[DevOpticsMavenPublisher] dependencies consumed: 5, artifacts produced: 156
[withMaven] Publishers: Pipeline Graph Publisher: 17 ms, Generated Artifacts Publisher: 116786 ms, Invoker Publisher: 2 ms, Junit Publisher: 476897 ms, Concordion Publisher: 2 ms, Dependencies Fingerprint Publisher: 2833 ms, Findbugs Publisher: 1 ms, JGiven Publisher: 1 ms, Jacoco Publisher: 1 ms, SpotBugs Publisher: 1 ms, Open Task Scanner Publisher: 14713 ms, CloudBees DevOptics Gate Artifact Publisher: 449566 ms
[Pipeline] // withMaven
[Pipeline] fileExists
[Pipeline] zip
Writing zip file of /home/jenkins/workspace/Maven_maven-box_maven_master/test/core-it-suite/target/test-classes to /home/jenkins/workspace/Maven_maven-box_maven_master/test/core-it-suite-logs-linux-jdk11.zip
Zipped 8640 entries.
Archiving /home/jenkins/workspace/Maven_maven-box_maven_master/test/core-it-suite-logs-linux-jdk11.zip
[Pipeline] fileExists
[withMaven] openTasksPublisher - Scan Tasks for Maven artifact org.apache.maven.its.plugins:maven-it-plugin-active-collection:maven-plugin:2.1-SNAPSHOT in source directory core-it-support/core-it-plugins/maven-it-plugin-active-collection/src/main/java
[Pipeline] zip
[withMaven] openTasksPublisher - Scan Tasks for Maven artifact org.apache.maven.its.plugins:maven-it-plugin-artifact:maven-plugin:2.1-SNAPSHOT in source directory core-it-support/core-it-plugins/maven-it-plugin-artifact/src/main/java
[withMaven] openTasksPublisher - Scan Tasks for Maven artifact org.apache.maven.its.plugins.class-loader:dep-a:jar:2.1-SNAPSHOT in source directory core-it-support/core-it-plugins/maven-it-plugin-class-loader/dep-a/src/main/java
[withMaven] openTasksPublisher - Scan Tasks for Maven artifact org.apache.maven.its.plugins.class-loader:dep-b:jar:2.1-SNAPSHOT in source directory core-it-support/core-it-plugins/maven-it-plugin-class-loader/dep-b/src/main/java
Writing zip file of /home/jenkins/workspace/Maven_maven-box_maven_master/test/core-it-suite/target/surefire-reports to /home/jenkins/workspace/Maven_maven-box_maven_master/test/core-it-suite-reports-linux-jdk11.zip
Zipped 4 entries.
Archiving /home/jenkins/workspace/Maven_maven-box_maven_master/test/core-it-suite-reports-linux-jdk11.zip
[withMaven] openTasksPublisher - Scan Tasks for Maven artifact org.apache.maven.its.plugins:maven-it-plugin-class-loader:maven-plugin:2.1-SNAPSHOT in source directory core-it-support/core-it-plugins/maven-it-plugin-class-loader/maven-it-plugin-class-loader/src/main/java
[Pipeline] deleteDir
[withMaven] openTasksPublisher - Scan Tasks for Maven artifact org.apache.maven.its.plugins:maven-it-plugin-configuration:maven-plugin:2.1-SNAPSHOT in source directory core-it-support/core-it-plugins/maven-it-plugin-configuration/src/main/java
[withMaven] openTasksPublisher - Scan Tasks for Maven artifact org.apache.maven.its.plugins:maven-it-plugin-context-passing:maven-plugin:2.1-SNAPSHOT in source directory core-it-support/core-it-plugins/maven-it-plugin-context-passing/src/main/java
[withMaven] openTasksPublisher - Scan Tasks for Maven artifact org.apache.maven.plugins:maven-clean-plugin:maven-plugin:0.1-stub-SNAPSHOT in source directory core-it-support/core-it-plugins/maven-it-plugin-core-stubs/maven-clean-plugin/src/main/java
[withMaven] openTasksPublisher - Scan Tasks for Maven artifact org.apache.maven.plugins:maven-compiler-plugin:maven-plugin:0.1-stub-SNAPSHOT in source directory core-it-support/core-it-plugins/maven-it-plugin-core-stubs/maven-compiler-plugin/src/main/java
[withMaven] openTasksPublisher - Scan Tasks for Maven artifact org.apache.maven.plugins:maven-deploy-plugin:maven-plugin:0.1-stub-SNAPSHOT in source directory core-it-support/core-it-plugins/maven-it-plugin-core-stubs/maven-deploy-plugin/src/main/java
[withMaven] openTasksPublisher - Scan Tasks for Maven artifact org.apache.maven.plugins:maven-ear-plugin:maven-plugin:0.1-stub-SNAPSHOT in source directory core-it-support/core-it-plugins/maven-it-plugin-core-stubs/maven-ear-plugin/src/main/java
[withMaven] openTasksPublisher - Scan Tasks for Maven artifact org.apache.maven.plugins:maven-ejb-plugin:maven-plugin:0.1-stub-SNAPSHOT in source directory core-it-support/core-it-plugins/maven-it-plugin-core-stubs/maven-ejb-plugin/src/main/java
[withMaven] openTasksPublisher - Scan Tasks for Maven artifact org.apache.maven.plugins:maven-install-plugin:maven-plugin:0.1-stub-SNAPSHOT in source directory core-it-support/core-it-plugins/maven-it-plugin-core-stubs/maven-install-plugin/src/main/java
[withMaven] openTasksPublisher - Scan Tasks for Maven artifact org.apache.maven.plugins:maven-jar-plugin:maven-plugin:0.1-stub-SNAPSHOT in source directory core-it-support/core-it-plugins/maven-it-plugin-core-stubs/maven-jar-plugin/src/main/java
[Pipeline] }
[Pipeline] // dir
[Pipeline] }
[Pipeline] // stage
[Pipeline] }
[Pipeline] // node
[Pipeline] }
[withMaven] openTasksPublisher - Scan Tasks for Maven artifact org.apache.maven.plugins:maven-javadoc-plugin:maven-plugin:0.1-stub-SNAPSHOT in source directory core-it-support/core-it-plugins/maven-it-plugin-core-stubs/maven-javadoc-plugin/src/main/java
[withMaven] openTasksPublisher - Scan Tasks for Maven artifact org.apache.maven.plugins:maven-plugin-plugin:maven-plugin:0.1-stub-SNAPSHOT in source directory core-it-support/core-it-plugins/maven-it-plugin-core-stubs/maven-plugin-plugin/src/main/java
[withMaven] openTasksPublisher - Scan Tasks for Maven artifact org.apache.maven.plugins:maven-rar-plugin:maven-plugin:0.1-stub-SNAPSHOT in source directory core-it-support/core-it-plugins/maven-it-plugin-core-stubs/maven-rar-plugin/src/main/java
[withMaven] openTasksPublisher - Scan Tasks for Maven artifact org.apache.maven.plugins:maven-resources-plugin:maven-plugin:0.1-stub-SNAPSHOT in source directory core-it-support/core-it-plugins/maven-it-plugin-core-stubs/maven-resources-plugin/src/main/java
[withMaven] openTasksPublisher - Scan Tasks for Maven artifact org.apache.maven.plugins:maven-site-plugin:maven-plugin:0.1-stub-SNAPSHOT in source directory core-it-support/core-it-plugins/maven-it-plugin-core-stubs/maven-site-plugin/src/main/java
[withMaven] openTasksPublisher - Scan Tasks for Maven artifact org.apache.maven.plugins:maven-source-plugin:maven-plugin:0.1-stub-SNAPSHOT in source directory core-it-support/core-it-plugins/maven-it-plugin-core-stubs/maven-source-plugin/src/main/java
[withMaven] openTasksPublisher - Scan Tasks for Maven artifact org.apache.maven.plugins:maven-surefire-plugin:maven-plugin:0.1-stub-SNAPSHOT in source directory core-it-support/core-it-plugins/maven-it-plugin-core-stubs/maven-surefire-plugin/src/main/java
[withMaven] openTasksPublisher - Scan Tasks for Maven artifact org.apache.maven.plugins:maven-war-plugin:maven-plugin:0.1-stub-SNAPSHOT in source directory core-it-support/core-it-plugins/maven-it-plugin-core-stubs/maven-war-plugin/src/main/java
[withMaven] openTasksPublisher - Scan Tasks for Maven artifact org.apache.maven.its.plugins:maven-it-plugin-dependency-collection:maven-plugin:2.1-SNAPSHOT in source directory core-it-support/core-it-plugins/maven-it-plugin-dependency-collection/src/main/java
[withMaven] openTasksPublisher - Scan Tasks for Maven artifact org.apache.maven.its.plugins:maven-it-plugin-dependency-resolution:maven-plugin:2.1-SNAPSHOT in source directory core-it-support/core-it-plugins/maven-it-plugin-dependency-resolution/src/main/java
[withMaven] openTasksPublisher - Scan Tasks for Maven artifact org.apache.maven.its.plugins:maven-it-plugin-expression:maven-plugin:2.1-SNAPSHOT in source directory core-it-support/core-it-plugins/maven-it-plugin-expression/src/main/java
[withMaven] openTasksPublisher - Scan Tasks for Maven artifact org.apache.maven.its.plugins:maven-it-plugin-error:maven-plugin:2.1-SNAPSHOT in source directory core-it-support/core-it-plugins/maven-it-plugin-error/src/main/java
[withMaven] openTasksPublisher - Scan Tasks for Maven artifact org.apache.maven.its:core-it-component:jar:2.1-SNAPSHOT in source directory core-it-support/core-it-component/src/main/java
[withMaven] openTasksPublisher - Scan Tasks for Maven artifact org.apache.maven.its.plugins:maven-it-plugin-extension-consumer:maven-plugin:2.1-SNAPSHOT in source directory core-it-support/core-it-plugins/maven-it-plugin-extension-consumer/src/main/java
[withMaven] openTasksPublisher - Scan Tasks for Maven artifact org.apache.maven.its.plugins:maven-it-plugin-extension-provider:maven-plugin:2.1-SNAPSHOT in source directory core-it-support/core-it-plugins/maven-it-plugin-extension-provider/src/main/java
[withMaven] openTasksPublisher - Scan Tasks for Maven artifact org.apache.maven.its.plugins:maven-it-plugin-fork:maven-plugin:2.1-SNAPSHOT in source directory core-it-support/core-it-plugins/maven-it-plugin-fork/src/main/java
[withMaven] openTasksPublisher - Scan Tasks for Maven artifact org.apache.maven.its.plugins:maven-it-plugin-invalid-descriptor:maven-plugin:2.1-SNAPSHOT in source directory core-it-support/core-it-plugins/maven-it-plugin-invalid-descriptor/src/main/java
[withMaven] openTasksPublisher - Scan Tasks for Maven artifact org.apache.maven.its.plugins:maven-it-plugin-log-file:maven-plugin:2.1-SNAPSHOT in source directory core-it-support/core-it-plugins/maven-it-plugin-log-file/src/main/java
[withMaven] openTasksPublisher - Scan Tasks for Maven artifact org.apache.maven.its:maven-it-helper:jar:2.1-SNAPSHOT in source directory core-it-support/maven-it-helper/src/main/java
[withMaven] openTasksPublisher - Scan Tasks for Maven artifact org.apache.maven.its.plugins:maven-it-plugin-model-interpolation:maven-plugin:2.1-SNAPSHOT in source directory core-it-support/core-it-plugins/maven-it-plugin-model-interpolation/src/main/java
[withMaven] openTasksPublisher - Scan Tasks for Maven artifact org.apache.maven.its.plugins:maven-it-plugin-no-default-comp:maven-plugin:2.1-SNAPSHOT in source directory core-it-support/core-it-plugins/maven-it-plugin-no-default-comp/src/main/java
[withMaven] openTasksPublisher - Scan Tasks for Maven artifact org.apache.maven.its.plugins:maven-it-plugin-no-project:maven-plugin:2.1-SNAPSHOT in source directory core-it-support/core-it-plugins/maven-it-plugin-no-project/src/main/java
[withMaven] openTasksPublisher - Scan Tasks for Maven artifact org.apache.maven.its.plugins:maven-it-plugin-online:maven-plugin:2.1-SNAPSHOT in source directory core-it-support/core-it-plugins/maven-it-plugin-online/src/main/java
[withMaven] openTasksPublisher - Scan Tasks for Maven artifact org.apache.maven.its.plugins:maven-it-plugin-optional-mojos:maven-plugin:2.1-SNAPSHOT in source directory core-it-support/core-it-plugins/maven-it-plugin-optional-mojos/src/main/java
[withMaven] openTasksPublisher - Scan Tasks for Maven artifact org.apache.maven.its.plugins:maven-it-plugin-packaging:maven-plugin:2.1-SNAPSHOT in source directory core-it-support/core-it-plugins/maven-it-plugin-packaging/src/main/java
[withMaven] openTasksPublisher - Scan Tasks for Maven artifact org.apache.maven.its.plugins:maven-it-plugin-parameter-implementation:maven-plugin:2.1-SNAPSHOT in source directory core-it-support/core-it-plugins/maven-it-plugin-parameter-implementation/src/main/java
[withMaven] openTasksPublisher - Scan Tasks for Maven artifact org.apache.maven.its.plugins:maven-it-plugin-plugin-dependency:maven-plugin:2.1-SNAPSHOT in source directory core-it-support/core-it-plugins/maven-it-plugin-plugin-dependency/src/main/java
[withMaven] openTasksPublisher - Scan Tasks for Maven artifact org.apache.maven.its.plugins:maven-it-plugin-project:maven-plugin:2.1-SNAPSHOT in source directory core-it-support/core-it-plugins/maven-it-plugin-project/src/main/java
[withMaven] openTasksPublisher - Scan Tasks for Maven artifact org.apache.maven.its.plugins:maven-it-plugin-project-interpolation:maven-plugin:2.1-SNAPSHOT in source directory core-it-support/core-it-plugins/maven-it-plugin-project-interpolation/src/main/java
[withMaven] openTasksPublisher - Scan Tasks for Maven artifact org.apache.maven.its.plugins:maven-it-plugin-setter:maven-plugin:2.1-SNAPSHOT in source directory core-it-support/core-it-plugins/maven-it-plugin-setter/src/main/java
[withMaven] openTasksPublisher - Scan Tasks for Maven artifact org.apache.maven.its.plugins:maven-it-plugin-singleton-component:maven-plugin:2.1-SNAPSHOT in source directory core-it-support/core-it-plugins/maven-it-plugin-singleton-component/src/main/java
[withMaven] openTasksPublisher - Scan Tasks for Maven artifact org.apache.maven.its.plugins:maven-it-plugin-site:maven-plugin:2.1-SNAPSHOT in source directory core-it-support/core-it-plugins/maven-it-plugin-site/src/main/java
[withMaven] openTasksPublisher - Scan Tasks for Maven artifact org.apache.maven.its.plugins:maven-it-plugin-toolchain:maven-plugin:2.1-SNAPSHOT in source directory core-it-support/core-it-plugins/maven-it-plugin-toolchain/src/main/java
[withMaven] openTasksPublisher - Scan Tasks for Maven artifact org.apache.maven.its.plugins:maven-it-plugin-touch:maven-plugin:2.1-SNAPSHOT in source directory core-it-support/core-it-plugins/maven-it-plugin-touch/src/main/java
[withMaven] openTasksPublisher - Scan Tasks for Maven artifact org.apache.maven.its.plugins:maven-it-plugin-uses-properties:maven-plugin:2.1-SNAPSHOT in source directory core-it-support/core-it-plugins/maven-it-plugin-uses-properties/src/main/java
[withMaven] openTasksPublisher - Scan Tasks for Maven artifact org.apache.maven.its.plugins:maven-it-plugin-uses-wagon:maven-plugin:2.1-SNAPSHOT in source directory core-it-support/core-it-plugins/maven-it-plugin-uses-wagon/src/main/java
[withMaven] openTasksPublisher - Scan Tasks for Maven artifact org.apache.maven.its.plugins:maven-it-plugin-all:maven-plugin:2.1-SNAPSHOT in source directory core-it-support/core-it-plugins/maven-it-plugin-all/src/main/java
[withMaven] openTasksPublisher - Scan Tasks for Maven artifact org.apache.maven.its.plugins:maven-it-plugin-plexus-utils-11:maven-plugin:2.1-SNAPSHOT in source directory core-it-support/core-it-plugins/maven-it-plugin-plexus-utils-11/src/main/java
[withMaven] openTasksPublisher - Scan Tasks for Maven artifact org.apache.maven.its.plugins:maven-it-plugin-plexus-utils-new:maven-plugin:2.1-SNAPSHOT in source directory core-it-support/core-it-plugins/maven-it-plugin-plexus-utils-new/src/main/java
[withMaven] openTasksPublisher - Scan Tasks for Maven artifact org.apache.maven.its.plugins:maven-it-plugin-plexus-component-api:maven-plugin:2.1-SNAPSHOT in source directory core-it-support/core-it-plugins/maven-it-plugin-plexus-component-api/src/main/java
[withMaven] openTasksPublisher - Scan Tasks for Maven artifact org.apache.maven.its.plugins:maven-it-plugin-log4j:maven-plugin:2.1-SNAPSHOT in source directory core-it-support/core-it-plugins/maven-it-plugin-log4j/src/main/java
[withMaven] openTasksPublisher - Scan Tasks for Maven artifact org.apache.maven.its.plugins:maven-it-plugin-extension1:maven-plugin:2.1-SNAPSHOT in source directory core-it-support/core-it-plugins/maven-it-plugin-extension1/src/main/java
[withMaven] openTasksPublisher - Scan Tasks for Maven artifact org.apache.maven.its.plugins:maven-it-plugin-extension2:maven-plugin:2.1-SNAPSHOT in source directory core-it-support/core-it-plugins/maven-it-plugin-extension2/src/main/java
[withMaven] openTasksPublisher - Scan Tasks for Maven artifact org.apache.maven.its.plugins:maven-it-plugin-plexus-lifecycle:maven-plugin:2.1-SNAPSHOT in source directory core-it-support/core-it-plugins/maven-it-plugin-plexus-lifecycle/src/main/java
[withMaven] openTasksPublisher - Scan Tasks for Maven artifact org.apache.maven.its.plugins:maven-it-plugin-settings:maven-plugin:2.1-SNAPSHOT in source directory core-it-support/core-it-plugins/maven-it-plugin-settings/src/main/java
[withMaven] openTasksPublisher - Scan Tasks for Maven artifact org.apache.maven.its.plugins:mng-5805-pkg-type-mojo-configuration-plugin:maven-plugin:2.1-SNAPSHOT in source directory core-it-support/core-it-plugins/mng5805-plugin/src/main/java
[withMaven] openTasksPublisher - Scan Tasks for Maven artifact org.apache.maven.its.plugins:mng-5805-pkg-type-mojo-configuration-plugin-dep:jar:2.1-SNAPSHOT in source directory core-it-support/core-it-plugins/mng5805-plugin-dep/src/main/java
[withMaven] openTasksPublisher - Scan Tasks for Maven artifact org.apache.maven.its.plugins:mng-5958-pkg-type-extension:jar:2.1-SNAPSHOT in source directory core-it-support/core-it-plugins/mng5958-extension/src/main/java
[withMaven] openTasksPublisher - Scan Tasks for Maven artifact org.apache.maven.its.plugins:mng-6759-resolves-project-dependencies-plugin:maven-plugin:2.1-SNAPSHOT in source directory core-it-support/core-it-plugins/mng6759-plugin-resolves-project-dependencies/src/main/java
[withMaven] openTasksPublisher - Scan Tasks for Maven artifact org.apache.maven.its:core-it-toolchain:jar:2.1-SNAPSHOT in source directory core-it-support/core-it-toolchain/src/main/java
[withMaven] openTasksPublisher - Scan Tasks for Maven artifact org.apache.maven.its:core-it-wagon:jar:2.1-SNAPSHOT in source directory core-it-support/core-it-wagon/src/main/java
[withMaven] openTasksPublisher - Scan Tasks for Maven artifact mng-coreit:javaagent:jar:1.0-SNAPSHOT in source directory core-it-support/core-it-javaagent/src/main/java
[TASKS] Scanning folder '/home/jenkins/jenkins-agent/workspace/Maven_maven-box_maven_master/test' for files matching the pattern 'core-it-support/core-it-plugins/maven-it-plugin-active-collection/src/main/java/**/*,core-it-support/core-it-plugins/maven-it-plugin-artifact/src/main/java/**/*,core-it-support/core-it-plugins/maven-it-plugin-class-loader/dep-a/src/main/java/**/*,core-it-support/core-it-plugins/maven-it-plugin-class-loader/dep-b/src/main/java/**/*,core-it-support/core-it-plugins/maven-it-plugin-class-loader/maven-it-plugin-class-loader/src/main/java/**/*,core-it-support/core-it-plugins/maven-it-plugin-configuration/src/main/java/**/*,core-it-support/core-it-plugins/maven-it-plugin-context-passing/src/main/java/**/*,core-it-support/core-it-plugins/maven-it-plugin-core-stubs/maven-clean-plugin/src/main/java/**/*,core-it-support/core-it-plugins/maven-it-plugin-core-stubs/maven-compiler-plugin/src/main/java/**/*,core-it-support/core-it-plugins/maven-it-plugin-core-stubs/maven-deploy-plugin/src/main/java/**/*,core-it-support/core-it-plugins/maven-it-plugin-core-stubs/maven-ear-plugin/src/main/java/**/*,core-it-support/core-it-plugins/maven-it-plugin-core-stubs/maven-ejb-plugin/src/main/java/**/*,core-it-support/core-it-plugins/maven-it-plugin-core-stubs/maven-install-plugin/src/main/java/**/*,core-it-support/core-it-plugins/maven-it-plugin-core-stubs/maven-jar-plugin/src/main/java/**/*,core-it-support/core-it-plugins/maven-it-plugin-core-stubs/maven-javadoc-plugin/src/main/java/**/*,core-it-support/core-it-plugins/maven-it-plugin-core-stubs/maven-plugin-plugin/src/main/java/**/*,core-it-support/core-it-plugins/maven-it-plugin-core-stubs/maven-rar-plugin/src/main/java/**/*,core-it-support/core-it-plugins/maven-it-plugin-core-stubs/maven-resources-plugin/src/main/java/**/*,core-it-support/core-it-plugins/maven-it-plugin-core-stubs/maven-site-plugin/src/main/java/**/*,core-it-support/core-it-plugins/maven-it-plugin-core-stubs/maven-source-plugin/src/main/java/**/*,core-it-support/core-it-plugins/maven-it-plugin-core-stubs/maven-surefire-plugin/src/main/java/**/*,core-it-support/core-it-plugins/maven-it-plugin-core-stubs/maven-war-plugin/src/main/java/**/*,core-it-support/core-it-plugins/maven-it-plugin-dependency-collection/src/main/java/**/*,core-it-support/core-it-plugins/maven-it-plugin-dependency-resolution/src/main/java/**/*,core-it-support/core-it-plugins/maven-it-plugin-expression/src/main/java/**/*,core-it-support/core-it-plugins/maven-it-plugin-error/src/main/java/**/*,core-it-support/core-it-component/src/main/java/**/*,core-it-support/core-it-plugins/maven-it-plugin-extension-consumer/src/main/java/**/*,core-it-support/core-it-plugins/maven-it-plugin-extension-provider/src/main/java/**/*,core-it-support/core-it-plugins/maven-it-plugin-fork/src/main/java/**/*,core-it-support/core-it-plugins/maven-it-plugin-invalid-descriptor/src/main/java/**/*,core-it-support/core-it-plugins/maven-it-plugin-log-file/src/main/java/**/*,core-it-support/maven-it-helper/src/main/java/**/*,core-it-support/core-it-plugins/maven-it-plugin-model-interpolation/src/main/java/**/*,core-it-support/core-it-plugins/maven-it-plugin-no-default-comp/src/main/java/**/*,core-it-support/core-it-plugins/maven-it-plugin-no-project/src/main/java/**/*,core-it-support/core-it-plugins/maven-it-plugin-online/src/main/java/**/*,core-it-support/core-it-plugins/maven-it-plugin-optional-mojos/src/main/java/**/*,core-it-support/core-it-plugins/maven-it-plugin-packaging/src/main/java/**/*,core-it-support/core-it-plugins/maven-it-plugin-parameter-implementation/src/main/java/**/*,core-it-support/core-it-plugins/maven-it-plugin-plugin-dependency/src/main/java/**/*,core-it-support/core-it-plugins/maven-it-plugin-project/src/main/java/**/*,core-it-support/core-it-plugins/maven-it-plugin-project-interpolation/src/main/java/**/*,core-it-support/core-it-plugins/maven-it-plugin-setter/src/main/java/**/*,core-it-support/core-it-plugins/maven-it-plugin-singleton-component/src/main/java/**/*,core-it-support/core-it-plugins/maven-it-plugin-site/src/main/java/**/*,core-it-support/core-it-plugins/maven-it-plugin-toolchain/src/main/java/**/*,core-it-support/core-it-plugins/maven-it-plugin-touch/src/main/java/**/*,core-it-support/core-it-plugins/maven-it-plugin-uses-properties/src/main/java/**/*,core-it-support/core-it-plugins/maven-it-plugin-uses-wagon/src/main/java/**/*,core-it-support/core-it-plugins/maven-it-plugin-all/src/main/java/**/*,core-it-support/core-it-plugins/maven-it-plugin-plexus-utils-11/src/main/java/**/*,core-it-support/core-it-plugins/maven-it-plugin-plexus-utils-new/src/main/java/**/*,core-it-support/core-it-plugins/maven-it-plugin-plexus-component-api/src/main/java/**/*,core-it-support/core-it-plugins/maven-it-plugin-log4j/src/main/java/**/*,core-it-support/core-it-plugins/maven-it-plugin-extension1/src/main/java/**/*,core-it-support/core-it-plugins/maven-it-plugin-extension2/src/main/java/**/*,core-it-support/core-it-plugins/maven-it-plugin-plexus-lifecycle/src/main/java/**/*,core-it-support/core-it-plugins/maven-it-plugin-settings/src/main/java/**/*,core-it-support/core-it-plugins/mng5805-plugin/src/main/java/**/*,core-it-support/core-it-plugins/mng5805-plugin-dep/src/main/java/**/*,core-it-support/core-it-plugins/mng5958-extension/src/main/java/**/*,core-it-support/core-it-plugins/mng6759-plugin-resolves-project-dependencies/src/main/java/**/*,core-it-support/core-it-toolchain/src/main/java/**/*,core-it-support/core-it-wagon/src/main/java/**/*,core-it-support/core-it-javaagent/src/main/java/**/*' - excludes: null
[TASKS] Found 167 files to scan for tasks
[TASKS] Found 0 open tasks.
Skipping warnings blame since pipelines do not have an SCM link.%n
[TASKS] Computing warning deltas based on reference build #88
[DevOpticsMavenPublisher] dependencies consumed: 5, artifacts produced: 156
[withMaven] Publishers: Pipeline Graph Publisher: 18 ms, Generated Artifacts Publisher: 449841 ms, Invoker Publisher: 2 ms, Junit Publisher: 547860 ms, Concordion Publisher: 2 ms, Dependencies Fingerprint Publisher: 4783 ms, Findbugs Publisher: 1 ms, JGiven Publisher: 1 ms, Jacoco Publisher: 1 ms, SpotBugs Publisher: 1 ms, Open Task Scanner Publisher: 23462 ms, CloudBees DevOptics Gate Artifact Publisher: 496479 ms
[Pipeline] // withMaven
[Pipeline] fileExists
[Pipeline] zip
Writing zip file of /home/jenkins/jenkins-agent/workspace/Maven_maven-box_maven_master/test/core-it-suite/target/test-classes to /home/jenkins/jenkins-agent/workspace/Maven_maven-box_maven_master/test/core-it-suite-logs-linux-jdk8.zip
Zipped 8648 entries.
Archiving /home/jenkins/jenkins-agent/workspace/Maven_maven-box_maven_master/test/core-it-suite-logs-linux-jdk8.zip
[Pipeline] fileExists
[Pipeline] zip
Writing zip file of /home/jenkins/jenkins-agent/workspace/Maven_maven-box_maven_master/test/core-it-suite/target/surefire-reports to /home/jenkins/jenkins-agent/workspace/Maven_maven-box_maven_master/test/core-it-suite-reports-linux-jdk8.zip
Zipped 4 entries.
Archiving /home/jenkins/jenkins-agent/workspace/Maven_maven-box_maven_master/test/core-it-suite-reports-linux-jdk8.zip
[Pipeline] deleteDir
[Pipeline] }
[Pipeline] // dir
[Pipeline] }
[Pipeline] // stage
[Pipeline] }
[Pipeline] // node
[Pipeline] }
[Pipeline] // parallel
[Pipeline] stage
[Pipeline] { (Notifications)
[Pipeline] echo
Build result: UNSTABLE
[Pipeline] jiraIssueSelector
[Pipeline] echo
The authors of changes [slachiewicz, michaelo].
[Pipeline] echo
Sending email ...
[Pipeline] emailext
Reply | Threaded
Open this post in threaded view
|

Build succeeded in Jenkins: Maven » Maven TLP » maven » master #91

Apache Jenkins Server-2
See https://ci-builds.apache.org/job/Maven/job/maven-box/job/maven/job/master/91/

Changes:

* [MNG-6909] Convert to JSR330 in tests - maven-core
* [MNG-6909] Convert to JSR330 in tests - maven-compat
* [MNG-6909] Convert to JSR330 - use sisu plugin
* [MNG-6972] Fix IT - explicitly set compiler target versions to 8
* Set minimal default target/source/release for maven-compiler to Java 7

All tests passed