Build failed in Jenkins: Maven » Maven TLP » maven » master #137

Previous Topic Next Topic
 
classic Classic list List threaded Threaded
2 messages Options
Reply | Threaded
Open this post in threaded view
|

Build failed in Jenkins: Maven » Maven TLP » maven » master #137

Apache Jenkins Server-2
See https://ci-builds.apache.org/job/Maven/job/maven-box/job/maven/job/master/137/

Changes:

* [MNG-6656] move to o.a.m.model.transform + .sax

All tests passed

Build log:
[...truncated 3725 lines...]
[INFO] Reading assembly descriptor: src/assembly/wrapper/source.xml
[INFO] Building tar: /home/jenkins/jenkins-agent/workspace/Maven_maven-box_maven_master/build/apache-maven/target/apache-maven-wrapper-4.0.0-alpha-1-SNAPSHOT-script.tar.gz
[INFO] Building zip: /home/jenkins/jenkins-agent/workspace/Maven_maven-box_maven_master/build/apache-maven/target/apache-maven-wrapper-4.0.0-alpha-1-SNAPSHOT-script.zip
[INFO] Building tar: /home/jenkins/jenkins-agent/workspace/Maven_maven-box_maven_master/build/apache-maven/target/apache-maven-wrapper-4.0.0-alpha-1-SNAPSHOT-bin.tar.gz
[INFO] Building zip: /home/jenkins/jenkins-agent/workspace/Maven_maven-box_maven_master/build/apache-maven/target/apache-maven-wrapper-4.0.0-alpha-1-SNAPSHOT-bin.zip
[INFO] Building tar: /home/jenkins/jenkins-agent/workspace/Maven_maven-box_maven_master/build/apache-maven/target/apache-maven-wrapper-4.0.0-alpha-1-SNAPSHOT-source.tar.gz
[INFO] Building zip: /home/jenkins/jenkins-agent/workspace/Maven_maven-box_maven_master/build/apache-maven/target/apache-maven-wrapper-4.0.0-alpha-1-SNAPSHOT-source.zip
[WARNING] [jenkins-event-spy] Unexpected Maven project file name 'maven-wrapper.pom', problems may occur
[WARNING] [jenkins-event-spy] Unexpected Maven project file name 'maven-wrapper.pom', problems may occur
[INFO]
[INFO] --- maven-checkstyle-plugin:3.0.0:check (checkstyle-check) @ apache-maven-wrapper ---
[WARNING] [jenkins-event-spy] Unexpected Maven project file name 'maven-wrapper.pom', problems may occur
[WARNING] [jenkins-event-spy] Unexpected Maven project file name 'maven-wrapper.pom', problems may occur
[INFO]
[INFO] --- maven-install-plugin:2.5.2:install (default-install) @ apache-maven-wrapper ---
[INFO] Installing /home/jenkins/jenkins-agent/workspace/Maven_maven-box_maven_master/build/apache-maven/maven-wrapper.pom to /home/jenkins/jenkins-agent/workspace/Maven_maven-box_maven_master/build/.repository/org/apache/maven/apache-maven-wrapper/4.0.0-alpha-1-SNAPSHOT/apache-maven-wrapper-4.0.0-alpha-1-SNAPSHOT.pom
[INFO] Installing /home/jenkins/jenkins-agent/workspace/Maven_maven-box_maven_master/build/apache-maven/target/apache-maven-wrapper-4.0.0-alpha-1-SNAPSHOT-site.xml to /home/jenkins/jenkins-agent/workspace/Maven_maven-box_maven_master/build/.repository/org/apache/maven/apache-maven-wrapper/4.0.0-alpha-1-SNAPSHOT/apache-maven-wrapper-4.0.0-alpha-1-SNAPSHOT-site.xml
[INFO] Installing /home/jenkins/jenkins-agent/workspace/Maven_maven-box_maven_master/build/apache-maven/target/apache-maven-wrapper-4.0.0-alpha-1-SNAPSHOT-script.tar.gz to /home/jenkins/jenkins-agent/workspace/Maven_maven-box_maven_master/build/.repository/org/apache/maven/apache-maven-wrapper/4.0.0-alpha-1-SNAPSHOT/apache-maven-wrapper-4.0.0-alpha-1-SNAPSHOT-script.tar.gz
[INFO] Installing /home/jenkins/jenkins-agent/workspace/Maven_maven-box_maven_master/build/apache-maven/target/apache-maven-wrapper-4.0.0-alpha-1-SNAPSHOT-script.zip to /home/jenkins/jenkins-agent/workspace/Maven_maven-box_maven_master/build/.repository/org/apache/maven/apache-maven-wrapper/4.0.0-alpha-1-SNAPSHOT/apache-maven-wrapper-4.0.0-alpha-1-SNAPSHOT-script.zip
[INFO] Installing /home/jenkins/jenkins-agent/workspace/Maven_maven-box_maven_master/build/apache-maven/target/apache-maven-wrapper-4.0.0-alpha-1-SNAPSHOT-bin.tar.gz to /home/jenkins/jenkins-agent/workspace/Maven_maven-box_maven_master/build/.repository/org/apache/maven/apache-maven-wrapper/4.0.0-alpha-1-SNAPSHOT/apache-maven-wrapper-4.0.0-alpha-1-SNAPSHOT-bin.tar.gz
[INFO] Installing /home/jenkins/jenkins-agent/workspace/Maven_maven-box_maven_master/build/apache-maven/target/apache-maven-wrapper-4.0.0-alpha-1-SNAPSHOT-bin.zip to /home/jenkins/jenkins-agent/workspace/Maven_maven-box_maven_master/build/.repository/org/apache/maven/apache-maven-wrapper/4.0.0-alpha-1-SNAPSHOT/apache-maven-wrapper-4.0.0-alpha-1-SNAPSHOT-bin.zip
[INFO] Installing /home/jenkins/jenkins-agent/workspace/Maven_maven-box_maven_master/build/apache-maven/target/apache-maven-wrapper-4.0.0-alpha-1-SNAPSHOT-source.tar.gz to /home/jenkins/jenkins-agent/workspace/Maven_maven-box_maven_master/build/.repository/org/apache/maven/apache-maven-wrapper/4.0.0-alpha-1-SNAPSHOT/apache-maven-wrapper-4.0.0-alpha-1-SNAPSHOT-source.tar.gz
[INFO] Installing /home/jenkins/jenkins-agent/workspace/Maven_maven-box_maven_master/build/apache-maven/target/apache-maven-wrapper-4.0.0-alpha-1-SNAPSHOT-source.zip to /home/jenkins/jenkins-agent/workspace/Maven_maven-box_maven_master/build/.repository/org/apache/maven/apache-maven-wrapper/4.0.0-alpha-1-SNAPSHOT/apache-maven-wrapper-4.0.0-alpha-1-SNAPSHOT-source.zip
[WARNING] [jenkins-event-spy] Unexpected Maven project file name 'maven-wrapper.pom', problems may occur
[WARNING] [jenkins-event-spy] Unexpected Maven project file name 'maven-wrapper.pom', problems may occur
[INFO]
[INFO] --- maven-deploy-plugin:2.8.2:deploy (default-deploy) @ apache-maven-wrapper ---
[INFO] Downloading from apache.snapshots.https: https://repository.apache.org/content/repositories/snapshots/org/apache/maven/apache-maven-wrapper/4.0.0-alpha-1-SNAPSHOT/maven-metadata.xml
[INFO] Downloaded from apache.snapshots.https: https://repository.apache.org/content/repositories/snapshots/org/apache/maven/apache-maven-wrapper/4.0.0-alpha-1-SNAPSHOT/maven-metadata.xml (2.2 kB at 6.6 kB/s)
[INFO] Uploading to apache.snapshots.https: https://repository.apache.org/content/repositories/snapshots/org/apache/maven/apache-maven-wrapper/4.0.0-alpha-1-SNAPSHOT/apache-maven-wrapper-4.0.0-alpha-1-20210404.174147-77.pom
[INFO] Uploaded to apache.snapshots.https: https://repository.apache.org/content/repositories/snapshots/org/apache/maven/apache-maven-wrapper/4.0.0-alpha-1-SNAPSHOT/apache-maven-wrapper-4.0.0-alpha-1-20210404.174147-77.pom (5.4 kB at 5.4 kB/s)
[INFO] Downloading from apache.snapshots.https: https://repository.apache.org/content/repositories/snapshots/org/apache/maven/apache-maven-wrapper/maven-metadata.xml
[INFO] Downloaded from apache.snapshots.https: https://repository.apache.org/content/repositories/snapshots/org/apache/maven/apache-maven-wrapper/maven-metadata.xml (412 B at 1.2 kB/s)
[INFO] Uploading to apache.snapshots.https: https://repository.apache.org/content/repositories/snapshots/org/apache/maven/apache-maven-wrapper/4.0.0-alpha-1-SNAPSHOT/maven-metadata.xml
[INFO] Uploaded to apache.snapshots.https: https://repository.apache.org/content/repositories/snapshots/org/apache/maven/apache-maven-wrapper/4.0.0-alpha-1-SNAPSHOT/maven-metadata.xml (2.2 kB at 2.0 kB/s)
[INFO] Uploading to apache.snapshots.https: https://repository.apache.org/content/repositories/snapshots/org/apache/maven/apache-maven-wrapper/maven-metadata.xml
[INFO] Uploaded to apache.snapshots.https: https://repository.apache.org/content/repositories/snapshots/org/apache/maven/apache-maven-wrapper/maven-metadata.xml (412 B at 374 B/s)
[INFO] Uploading to apache.snapshots.https: https://repository.apache.org/content/repositories/snapshots/org/apache/maven/apache-maven-wrapper/4.0.0-alpha-1-SNAPSHOT/apache-maven-wrapper-4.0.0-alpha-1-20210404.174147-77-site.xml
[INFO] Uploaded to apache.snapshots.https: https://repository.apache.org/content/repositories/snapshots/org/apache/maven/apache-maven-wrapper/4.0.0-alpha-1-SNAPSHOT/apache-maven-wrapper-4.0.0-alpha-1-20210404.174147-77-site.xml (1.1 kB at 1.1 kB/s)
[INFO] Uploading to apache.snapshots.https: https://repository.apache.org/content/repositories/snapshots/org/apache/maven/apache-maven-wrapper/4.0.0-alpha-1-SNAPSHOT/maven-metadata.xml
[INFO] Uploaded to apache.snapshots.https: https://repository.apache.org/content/repositories/snapshots/org/apache/maven/apache-maven-wrapper/4.0.0-alpha-1-SNAPSHOT/maven-metadata.xml (2.2 kB at 2.2 kB/s)
[INFO] Uploading to apache.snapshots.https: https://repository.apache.org/content/repositories/snapshots/org/apache/maven/apache-maven-wrapper/4.0.0-alpha-1-SNAPSHOT/apache-maven-wrapper-4.0.0-alpha-1-20210404.174147-77-script.tar.gz
[INFO] Uploaded to apache.snapshots.https: https://repository.apache.org/content/repositories/snapshots/org/apache/maven/apache-maven-wrapper/4.0.0-alpha-1-SNAPSHOT/apache-maven-wrapper-4.0.0-alpha-1-20210404.174147-77-script.tar.gz (5.2 kB at 5.4 kB/s)
[INFO] Uploading to apache.snapshots.https: https://repository.apache.org/content/repositories/snapshots/org/apache/maven/apache-maven-wrapper/4.0.0-alpha-1-SNAPSHOT/maven-metadata.xml
[INFO] Uploaded to apache.snapshots.https: https://repository.apache.org/content/repositories/snapshots/org/apache/maven/apache-maven-wrapper/4.0.0-alpha-1-SNAPSHOT/maven-metadata.xml (2.2 kB at 2.0 kB/s)
[INFO] Uploading to apache.snapshots.https: https://repository.apache.org/content/repositories/snapshots/org/apache/maven/apache-maven-wrapper/4.0.0-alpha-1-SNAPSHOT/apache-maven-wrapper-4.0.0-alpha-1-20210404.174147-77-script.zip
[INFO] Uploaded to apache.snapshots.https: https://repository.apache.org/content/repositories/snapshots/org/apache/maven/apache-maven-wrapper/4.0.0-alpha-1-SNAPSHOT/apache-maven-wrapper-4.0.0-alpha-1-20210404.174147-77-script.zip (8.4 kB at 8.7 kB/s)
[INFO] Uploading to apache.snapshots.https: https://repository.apache.org/content/repositories/snapshots/org/apache/maven/apache-maven-wrapper/4.0.0-alpha-1-SNAPSHOT/maven-metadata.xml
[INFO] Uploaded to apache.snapshots.https: https://repository.apache.org/content/repositories/snapshots/org/apache/maven/apache-maven-wrapper/4.0.0-alpha-1-SNAPSHOT/maven-metadata.xml (2.2 kB at 2.2 kB/s)
[INFO] Uploading to apache.snapshots.https: https://repository.apache.org/content/repositories/snapshots/org/apache/maven/apache-maven-wrapper/4.0.0-alpha-1-SNAPSHOT/apache-maven-wrapper-4.0.0-alpha-1-20210404.174147-77-bin.tar.gz
[INFO] Uploaded to apache.snapshots.https: https://repository.apache.org/content/repositories/snapshots/org/apache/maven/apache-maven-wrapper/4.0.0-alpha-1-SNAPSHOT/apache-maven-wrapper-4.0.0-alpha-1-20210404.174147-77-bin.tar.gz (32 kB at 28 kB/s)
[INFO] Uploading to apache.snapshots.https: https://repository.apache.org/content/repositories/snapshots/org/apache/maven/apache-maven-wrapper/4.0.0-alpha-1-SNAPSHOT/maven-metadata.xml
[INFO] Uploaded to apache.snapshots.https: https://repository.apache.org/content/repositories/snapshots/org/apache/maven/apache-maven-wrapper/4.0.0-alpha-1-SNAPSHOT/maven-metadata.xml (2.2 kB at 2.3 kB/s)
[INFO] Uploading to apache.snapshots.https: https://repository.apache.org/content/repositories/snapshots/org/apache/maven/apache-maven-wrapper/4.0.0-alpha-1-SNAPSHOT/apache-maven-wrapper-4.0.0-alpha-1-20210404.174147-77-bin.zip
[INFO] Uploaded to apache.snapshots.https: https://repository.apache.org/content/repositories/snapshots/org/apache/maven/apache-maven-wrapper/4.0.0-alpha-1-SNAPSHOT/apache-maven-wrapper-4.0.0-alpha-1-20210404.174147-77-bin.zip (34 kB at 34 kB/s)
[INFO] Uploading to apache.snapshots.https: https://repository.apache.org/content/repositories/snapshots/org/apache/maven/apache-maven-wrapper/4.0.0-alpha-1-SNAPSHOT/maven-metadata.xml
[INFO] Uploaded to apache.snapshots.https: https://repository.apache.org/content/repositories/snapshots/org/apache/maven/apache-maven-wrapper/4.0.0-alpha-1-SNAPSHOT/maven-metadata.xml (2.2 kB at 2.2 kB/s)
[INFO] Uploading to apache.snapshots.https: https://repository.apache.org/content/repositories/snapshots/org/apache/maven/apache-maven-wrapper/4.0.0-alpha-1-SNAPSHOT/apache-maven-wrapper-4.0.0-alpha-1-20210404.174147-77-source.tar.gz
[INFO] Uploaded to apache.snapshots.https: https://repository.apache.org/content/repositories/snapshots/org/apache/maven/apache-maven-wrapper/4.0.0-alpha-1-SNAPSHOT/apache-maven-wrapper-4.0.0-alpha-1-20210404.174147-77-source.tar.gz (6.2 kB at 6.4 kB/s)
[INFO] Uploading to apache.snapshots.https: https://repository.apache.org/content/repositories/snapshots/org/apache/maven/apache-maven-wrapper/4.0.0-alpha-1-SNAPSHOT/maven-metadata.xml
[INFO] Uploaded to apache.snapshots.https: https://repository.apache.org/content/repositories/snapshots/org/apache/maven/apache-maven-wrapper/4.0.0-alpha-1-SNAPSHOT/maven-metadata.xml (2.2 kB at 2.1 kB/s)
[INFO] Uploading to apache.snapshots.https: https://repository.apache.org/content/repositories/snapshots/org/apache/maven/apache-maven-wrapper/4.0.0-alpha-1-SNAPSHOT/apache-maven-wrapper-4.0.0-alpha-1-20210404.174147-77-source.zip
[INFO] Uploaded to apache.snapshots.https: https://repository.apache.org/content/repositories/snapshots/org/apache/maven/apache-maven-wrapper/4.0.0-alpha-1-SNAPSHOT/apache-maven-wrapper-4.0.0-alpha-1-20210404.174147-77-source.zip (9.8 kB at 10 kB/s)
[INFO] Uploading to apache.snapshots.https: https://repository.apache.org/content/repositories/snapshots/org/apache/maven/apache-maven-wrapper/4.0.0-alpha-1-SNAPSHOT/maven-metadata.xml
[INFO] Uploaded to apache.snapshots.https: https://repository.apache.org/content/repositories/snapshots/org/apache/maven/apache-maven-wrapper/4.0.0-alpha-1-SNAPSHOT/maven-metadata.xml (2.2 kB at 2.3 kB/s)
[WARNING] [jenkins-event-spy] Unexpected Maven project file name 'maven-wrapper.pom', problems may occur
[WARNING] [jenkins-event-spy] Unexpected Maven project file name 'maven-wrapper.pom', problems may occur
[INFO] ------------------------------------------------------------------------
[INFO] Reactor Summary for Apache Maven 4.0.0-alpha-1-SNAPSHOT:
[INFO]
[INFO] Maven Dependencies BOM ............................. SUCCESS [ 20.235 s]
[INFO] Apache Maven ....................................... SUCCESS [  9.023 s]
[INFO] Maven Test Support ................................. SUCCESS [  7.566 s]
[INFO] Maven Model ........................................ SUCCESS [ 12.461 s]
[INFO] Maven Artifact ..................................... SUCCESS [ 10.501 s]
[INFO] Maven Plugin API ................................... SUCCESS [  7.890 s]
[INFO] Maven Builder Support .............................. SUCCESS [  7.707 s]
[INFO] Maven Model XML Transform .......................... FAILURE [  4.367 s]
[INFO] Maven Model Builder ................................ SKIPPED
[INFO] Maven Settings ..................................... SUCCESS [  6.294 s]
[INFO] Maven Settings Builder ............................. SUCCESS [  8.331 s]
[INFO] Maven Repository Metadata Model .................... SUCCESS [  6.230 s]
[INFO] Maven Artifact Resolver Provider ................... SKIPPED
[INFO] Maven Core ......................................... SKIPPED
[INFO] Maven SLF4J Wrapper ................................ SUCCESS [  7.028 s]
[INFO] Maven SLF4J Simple Provider ........................ SUCCESS [  8.245 s]
[INFO] Maven Embedder ..................................... SKIPPED
[INFO] Maven Compat ....................................... SKIPPED
[INFO] Apache Maven Distribution .......................... SKIPPED
[INFO] Maven Wrapper ...................................... SUCCESS [  9.483 s]
[INFO] Apache Maven Wrapper Distribution .................. SUCCESS [ 20.199 s]
[INFO] ------------------------------------------------------------------------
[INFO] BUILD FAILURE
[INFO] ------------------------------------------------------------------------
[INFO] Total time:  02:25 min
[INFO] Finished at: 2021-04-04T17:42:05Z
[INFO] ------------------------------------------------------------------------
[WARNING] [jenkins-event-spy] Unexpected Maven project file name 'maven-wrapper.pom', problems may occur
[INFO] [jenkins-event-spy] Generated /home/jenkins/jenkins-agent/workspace/Maven_maven-box_maven_master/build@tmp/withMavenb3c9cf36/maven-spy-20210404-173939-3975391296860701677863.log
[ERROR] Failed to execute goal org.apache.maven.plugins:maven-checkstyle-plugin:3.0.0:check (checkstyle-check) on project maven-model-transform: You have 4 Checkstyle violations. -> [Help 1]
org.apache.maven.lifecycle.LifecycleExecutionException: Failed to execute goal org.apache.maven.plugins:maven-checkstyle-plugin:3.0.0:check (checkstyle-check) on project maven-model-transform: You have 4 Checkstyle violations.
    at org.apache.maven.lifecycle.internal.MojoExecutor.execute (MojoExecutor.java:215)
    at org.apache.maven.lifecycle.internal.MojoExecutor.execute (MojoExecutor.java:156)
    at org.apache.maven.lifecycle.internal.MojoExecutor.execute (MojoExecutor.java:148)
    at org.apache.maven.lifecycle.internal.LifecycleModuleBuilder.buildProject (LifecycleModuleBuilder.java:117)
    at org.apache.maven.lifecycle.internal.LifecycleModuleBuilder.buildProject (LifecycleModuleBuilder.java:81)
    at org.apache.maven.lifecycle.internal.builder.singlethreaded.SingleThreadedBuilder.build (SingleThreadedBuilder.java:56)
    at org.apache.maven.lifecycle.internal.LifecycleStarter.execute (LifecycleStarter.java:128)
    at org.apache.maven.DefaultMaven.doExecute (DefaultMaven.java:305)
    at org.apache.maven.DefaultMaven.doExecute (DefaultMaven.java:192)
    at org.apache.maven.DefaultMaven.execute (DefaultMaven.java:105)
    at org.apache.maven.cli.MavenCli.execute (MavenCli.java:957)
    at org.apache.maven.cli.MavenCli.doMain (MavenCli.java:289)
    at org.apache.maven.cli.MavenCli.main (MavenCli.java:193)
    at sun.reflect.NativeMethodAccessorImpl.invoke0 (Native Method)
    at sun.reflect.NativeMethodAccessorImpl.invoke (NativeMethodAccessorImpl.java:62)
    at sun.reflect.DelegatingMethodAccessorImpl.invoke (DelegatingMethodAccessorImpl.java:43)
    at java.lang.reflect.Method.invoke (Method.java:498)
    at org.codehaus.plexus.classworlds.launcher.Launcher.launchEnhanced (Launcher.java:282)
    at org.codehaus.plexus.classworlds.launcher.Launcher.launch (Launcher.java:225)
    at org.codehaus.plexus.classworlds.launcher.Launcher.mainWithExitCode (Launcher.java:406)
    at org.codehaus.plexus.classworlds.launcher.Launcher.main (Launcher.java:347)
Caused by: org.apache.maven.plugin.MojoFailureException: You have 4 Checkstyle violations.
    at org.apache.maven.plugins.checkstyle.CheckstyleViolationCheckMojo.execute (CheckstyleViolationCheckMojo.java:576)
    at org.apache.maven.plugin.DefaultBuildPluginManager.executeMojo (DefaultBuildPluginManager.java:137)
    at org.apache.maven.lifecycle.internal.MojoExecutor.execute (MojoExecutor.java:210)
    at org.apache.maven.lifecycle.internal.MojoExecutor.execute (MojoExecutor.java:156)
    at org.apache.maven.lifecycle.internal.MojoExecutor.execute (MojoExecutor.java:148)
    at org.apache.maven.lifecycle.internal.LifecycleModuleBuilder.buildProject (LifecycleModuleBuilder.java:117)
    at org.apache.maven.lifecycle.internal.LifecycleModuleBuilder.buildProject (LifecycleModuleBuilder.java:81)
    at org.apache.maven.lifecycle.internal.builder.singlethreaded.SingleThreadedBuilder.build (SingleThreadedBuilder.java:56)
    at org.apache.maven.lifecycle.internal.LifecycleStarter.execute (LifecycleStarter.java:128)
    at org.apache.maven.DefaultMaven.doExecute (DefaultMaven.java:305)
    at org.apache.maven.DefaultMaven.doExecute (DefaultMaven.java:192)
    at org.apache.maven.DefaultMaven.execute (DefaultMaven.java:105)
    at org.apache.maven.cli.MavenCli.execute (MavenCli.java:957)
    at org.apache.maven.cli.MavenCli.doMain (MavenCli.java:289)
    at org.apache.maven.cli.MavenCli.main (MavenCli.java:193)
    at sun.reflect.NativeMethodAccessorImpl.invoke0 (Native Method)
    at sun.reflect.NativeMethodAccessorImpl.invoke (NativeMethodAccessorImpl.java:62)
    at sun.reflect.DelegatingMethodAccessorImpl.invoke (DelegatingMethodAccessorImpl.java:43)
    at java.lang.reflect.Method.invoke (Method.java:498)
    at org.codehaus.plexus.classworlds.launcher.Launcher.launchEnhanced (Launcher.java:282)
    at org.codehaus.plexus.classworlds.launcher.Launcher.launch (Launcher.java:225)
    at org.codehaus.plexus.classworlds.launcher.Launcher.mainWithExitCode (Launcher.java:406)
    at org.codehaus.plexus.classworlds.launcher.Launcher.main (Launcher.java:347)
[ERROR]
[ERROR] Re-run Maven using the -X switch to enable full debug logging.
[ERROR]
[ERROR] For more information about the errors and possible solutions, please read the following articles:
[ERROR] [Help 1] http://cwiki.apache.org/confluence/display/MAVEN/MojoFailureException
[ERROR]
[ERROR] After correcting the problems, you can resume the build with the command
[ERROR]   mvn <args> -rf :maven-model-transform
[Pipeline] }
[withMaven] artifactsPublisher - Archive artifact maven-bom/pom.xml under org/apache/maven/maven-bom/4.0.0-alpha-1-SNAPSHOT/maven-bom-4.0.0-alpha-1-SNAPSHOT.pom
[withMaven] artifactsPublisher - Archive artifact pom.xml under org/apache/maven/maven/4.0.0-alpha-1-SNAPSHOT/maven-4.0.0-alpha-1-SNAPSHOT.pom
[withMaven] artifactsPublisher - Archive artifact maven-test-support/pom.xml under org/apache/maven/maven-test-support/4.0.0-alpha-1-SNAPSHOT/maven-test-support-4.0.0-alpha-1-SNAPSHOT.pom
[withMaven] artifactsPublisher - Archive artifact maven-model/pom.xml under org/apache/maven/maven-model/4.0.0-alpha-1-SNAPSHOT/maven-model-4.0.0-alpha-1-SNAPSHOT.pom
[withMaven] artifactsPublisher - Archive artifact maven-artifact/pom.xml under org/apache/maven/maven-artifact/4.0.0-alpha-1-SNAPSHOT/maven-artifact-4.0.0-alpha-1-SNAPSHOT.pom
[withMaven] artifactsPublisher - Archive artifact maven-plugin-api/pom.xml under org/apache/maven/maven-plugin-api/4.0.0-alpha-1-SNAPSHOT/maven-plugin-api-4.0.0-alpha-1-SNAPSHOT.pom
[withMaven] artifactsPublisher - Archive artifact maven-builder-support/pom.xml under org/apache/maven/maven-builder-support/4.0.0-alpha-1-SNAPSHOT/maven-builder-support-4.0.0-alpha-1-SNAPSHOT.pom
[withMaven] artifactsPublisher - Archive artifact maven-model-transform/pom.xml under org/apache/maven/maven-model-transform/4.0.0-alpha-1-SNAPSHOT/maven-model-transform-4.0.0-alpha-1-SNAPSHOT.pom
[withMaven] artifactsPublisher - Archive artifact maven-model-builder/pom.xml under org/apache/maven/maven-model-builder/4.0.0-alpha-1-SNAPSHOT/maven-model-builder-4.0.0-alpha-1-SNAPSHOT.pom
[withMaven] artifactsPublisher - Archive artifact maven-settings/pom.xml under org/apache/maven/maven-settings/4.0.0-alpha-1-SNAPSHOT/maven-settings-4.0.0-alpha-1-SNAPSHOT.pom
[withMaven] artifactsPublisher - Archive artifact maven-settings-builder/pom.xml under org/apache/maven/maven-settings-builder/4.0.0-alpha-1-SNAPSHOT/maven-settings-builder-4.0.0-alpha-1-SNAPSHOT.pom
[withMaven] artifactsPublisher - Archive artifact maven-repository-metadata/pom.xml under org/apache/maven/maven-repository-metadata/4.0.0-alpha-1-SNAPSHOT/maven-repository-metadata-4.0.0-alpha-1-SNAPSHOT.pom
[withMaven] artifactsPublisher - Archive artifact maven-resolver-provider/pom.xml under org/apache/maven/maven-resolver-provider/4.0.0-alpha-1-SNAPSHOT/maven-resolver-provider-4.0.0-alpha-1-SNAPSHOT.pom
[withMaven] artifactsPublisher - Archive artifact maven-core/pom.xml under org/apache/maven/maven-core/4.0.0-alpha-1-SNAPSHOT/maven-core-4.0.0-alpha-1-SNAPSHOT.pom
[withMaven] artifactsPublisher - Archive artifact maven-slf4j-wrapper/pom.xml under org/apache/maven/maven-slf4j-wrapper/4.0.0-alpha-1-SNAPSHOT/maven-slf4j-wrapper-4.0.0-alpha-1-SNAPSHOT.pom
[withMaven] artifactsPublisher - Archive artifact maven-slf4j-provider/pom.xml under org/apache/maven/maven-slf4j-provider/4.0.0-alpha-1-SNAPSHOT/maven-slf4j-provider-4.0.0-alpha-1-SNAPSHOT.pom
[withMaven] artifactsPublisher - Archive artifact maven-embedder/pom.xml under org/apache/maven/maven-embedder/4.0.0-alpha-1-SNAPSHOT/maven-embedder-4.0.0-alpha-1-SNAPSHOT.pom
[withMaven] artifactsPublisher - Archive artifact maven-compat/pom.xml under org/apache/maven/maven-compat/4.0.0-alpha-1-SNAPSHOT/maven-compat-4.0.0-alpha-1-SNAPSHOT.pom
[withMaven] artifactsPublisher - Archive artifact apache-maven/pom.xml under org/apache/maven/apache-maven/4.0.0-alpha-1-SNAPSHOT/apache-maven-4.0.0-alpha-1-SNAPSHOT.pom
[withMaven] artifactsPublisher - Archive artifact maven-wrapper/pom.xml under org/apache/maven/maven-wrapper/4.0.0-alpha-1-SNAPSHOT/maven-wrapper-4.0.0-alpha-1-SNAPSHOT.pom
[withMaven] artifactsPublisher - Archive artifact apache-maven/maven-wrapper.pom under org/apache/maven/apache-maven-wrapper/4.0.0-alpha-1-SNAPSHOT/apache-maven-wrapper-4.0.0-alpha-1-SNAPSHOT.pom
[withMaven] Publishers: Generated Artifacts Publisher: 11417 ms, Pipeline Graph Publisher: 7 ms
[withMaven] artifactsPublisher - Archive artifact maven-bom/pom.xml under org/apache/maven/maven-bom/4.0.0-alpha-1-SNAPSHOT/maven-bom-4.0.0-alpha-1-SNAPSHOT.pom
[withMaven] artifactsPublisher - Archive artifact maven-bom/target/maven-bom-4.0.0-alpha-1-SNAPSHOT.jar under org/apache/maven/maven-bom/4.0.0-alpha-1-SNAPSHOT/maven-bom-4.0.0-alpha-1-SNAPSHOT.jar
[withMaven] artifactsPublisher - Archive artifact pom.xml under org/apache/maven/maven/4.0.0-alpha-1-SNAPSHOT/maven-4.0.0-alpha-1-SNAPSHOT.pom
[withMaven] artifactsPublisher - Archive artifact target/maven-4.0.0-alpha-1-SNAPSHOT-site.xml under org/apache/maven/maven/4.0.0-alpha-1-SNAPSHOT/maven-4.0.0-alpha-1-SNAPSHOT-site.xml
[withMaven] artifactsPublisher - Archive artifact maven-test-support/pom.xml under org/apache/maven/maven-test-support/4.0.0-alpha-1-SNAPSHOT/maven-test-support-4.0.0-alpha-1-SNAPSHOT.pom
[withMaven] artifactsPublisher - Archive artifact maven-test-support/target/maven-test-support-4.0.0-alpha-1-SNAPSHOT.jar under org/apache/maven/maven-test-support/4.0.0-alpha-1-SNAPSHOT/maven-test-support-4.0.0-alpha-1-SNAPSHOT.jar
[withMaven] artifactsPublisher - Archive artifact maven-model/pom.xml under org/apache/maven/maven-model/4.0.0-alpha-1-SNAPSHOT/maven-model-4.0.0-alpha-1-SNAPSHOT.pom
[withMaven] artifactsPublisher - Archive artifact maven-model/target/maven-model-4.0.0-alpha-1-SNAPSHOT.jar under org/apache/maven/maven-model/4.0.0-alpha-1-SNAPSHOT/maven-model-4.0.0-alpha-1-SNAPSHOT.jar
[withMaven] artifactsPublisher - Archive artifact maven-artifact/pom.xml under org/apache/maven/maven-artifact/4.0.0-alpha-1-SNAPSHOT/maven-artifact-4.0.0-alpha-1-SNAPSHOT.pom
[withMaven] artifactsPublisher - Archive artifact maven-artifact/target/maven-artifact-4.0.0-alpha-1-SNAPSHOT.jar under org/apache/maven/maven-artifact/4.0.0-alpha-1-SNAPSHOT/maven-artifact-4.0.0-alpha-1-SNAPSHOT.jar
[withMaven] artifactsPublisher - Archive artifact maven-plugin-api/pom.xml under org/apache/maven/maven-plugin-api/4.0.0-alpha-1-SNAPSHOT/maven-plugin-api-4.0.0-alpha-1-SNAPSHOT.pom
[withMaven] artifactsPublisher - Archive artifact maven-plugin-api/target/maven-plugin-api-4.0.0-alpha-1-SNAPSHOT.jar under org/apache/maven/maven-plugin-api/4.0.0-alpha-1-SNAPSHOT/maven-plugin-api-4.0.0-alpha-1-SNAPSHOT.jar
[withMaven] artifactsPublisher - Archive artifact maven-builder-support/pom.xml under org/apache/maven/maven-builder-support/4.0.0-alpha-1-SNAPSHOT/maven-builder-support-4.0.0-alpha-1-SNAPSHOT.pom
[withMaven] artifactsPublisher - Archive artifact maven-builder-support/target/maven-builder-support-4.0.0-alpha-1-SNAPSHOT.jar under org/apache/maven/maven-builder-support/4.0.0-alpha-1-SNAPSHOT/maven-builder-support-4.0.0-alpha-1-SNAPSHOT.jar
[withMaven] artifactsPublisher - Archive artifact maven-settings/pom.xml under org/apache/maven/maven-settings/4.0.0-alpha-1-SNAPSHOT/maven-settings-4.0.0-alpha-1-SNAPSHOT.pom
[withMaven] artifactsPublisher - Archive artifact maven-settings/target/maven-settings-4.0.0-alpha-1-SNAPSHOT.jar under org/apache/maven/maven-settings/4.0.0-alpha-1-SNAPSHOT/maven-settings-4.0.0-alpha-1-SNAPSHOT.jar
[withMaven] artifactsPublisher - Archive artifact maven-settings-builder/pom.xml under org/apache/maven/maven-settings-builder/4.0.0-alpha-1-SNAPSHOT/maven-settings-builder-4.0.0-alpha-1-SNAPSHOT.pom
[withMaven] artifactsPublisher - Archive artifact maven-settings-builder/target/maven-settings-builder-4.0.0-alpha-1-SNAPSHOT.jar under org/apache/maven/maven-settings-builder/4.0.0-alpha-1-SNAPSHOT/maven-settings-builder-4.0.0-alpha-1-SNAPSHOT.jar
[withMaven] artifactsPublisher - Archive artifact maven-repository-metadata/pom.xml under org/apache/maven/maven-repository-metadata/4.0.0-alpha-1-SNAPSHOT/maven-repository-metadata-4.0.0-alpha-1-SNAPSHOT.pom
[withMaven] artifactsPublisher - Archive artifact maven-repository-metadata/target/maven-repository-metadata-4.0.0-alpha-1-SNAPSHOT.jar under org/apache/maven/maven-repository-metadata/4.0.0-alpha-1-SNAPSHOT/maven-repository-metadata-4.0.0-alpha-1-SNAPSHOT.jar
[withMaven] artifactsPublisher - Archive artifact maven-slf4j-wrapper/pom.xml under org/apache/maven/maven-slf4j-wrapper/4.0.0-alpha-1-SNAPSHOT/maven-slf4j-wrapper-4.0.0-alpha-1-SNAPSHOT.pom
[withMaven] artifactsPublisher - Archive artifact maven-slf4j-wrapper/target/maven-slf4j-wrapper-4.0.0-alpha-1-SNAPSHOT.jar under org/apache/maven/maven-slf4j-wrapper/4.0.0-alpha-1-SNAPSHOT/maven-slf4j-wrapper-4.0.0-alpha-1-SNAPSHOT.jar
[withMaven] artifactsPublisher - Archive artifact maven-slf4j-provider/pom.xml under org/apache/maven/maven-slf4j-provider/4.0.0-alpha-1-SNAPSHOT/maven-slf4j-provider-4.0.0-alpha-1-SNAPSHOT.pom
[withMaven] artifactsPublisher - Archive artifact maven-slf4j-provider/target/maven-slf4j-provider-4.0.0-alpha-1-SNAPSHOT.jar under org/apache/maven/maven-slf4j-provider/4.0.0-alpha-1-SNAPSHOT/maven-slf4j-provider-4.0.0-alpha-1-SNAPSHOT.jar
[withMaven] artifactsPublisher - Archive artifact maven-wrapper/pom.xml under org/apache/maven/maven-wrapper/4.0.0-alpha-1-SNAPSHOT/maven-wrapper-4.0.0-alpha-1-SNAPSHOT.pom
[withMaven] artifactsPublisher - Archive artifact maven-wrapper/target/maven-wrapper.jar under org/apache/maven/maven-wrapper/4.0.0-alpha-1-SNAPSHOT/maven-wrapper-4.0.0-alpha-1-SNAPSHOT.jar
[withMaven] artifactsPublisher - Archive artifact apache-maven/maven-wrapper.pom under org/apache/maven/apache-maven-wrapper/4.0.0-alpha-1-SNAPSHOT/apache-maven-wrapper-4.0.0-alpha-1-SNAPSHOT.pom
[withMaven] artifactsPublisher - Archive artifact apache-maven/target/apache-maven-wrapper-4.0.0-alpha-1-SNAPSHOT-site.xml under org/apache/maven/apache-maven-wrapper/4.0.0-alpha-1-SNAPSHOT/apache-maven-wrapper-4.0.0-alpha-1-SNAPSHOT-site.xml
[withMaven] artifactsPublisher - Archive artifact apache-maven/target/apache-maven-wrapper-4.0.0-alpha-1-SNAPSHOT-script.tar.gz under org/apache/maven/apache-maven-wrapper/4.0.0-alpha-1-SNAPSHOT/apache-maven-wrapper-4.0.0-alpha-1-SNAPSHOT-script.tar.gz
[withMaven] artifactsPublisher - Archive artifact apache-maven/target/apache-maven-wrapper-4.0.0-alpha-1-SNAPSHOT-script.zip under org/apache/maven/apache-maven-wrapper/4.0.0-alpha-1-SNAPSHOT/apache-maven-wrapper-4.0.0-alpha-1-SNAPSHOT-script.zip
[withMaven] artifactsPublisher - Archive artifact apache-maven/target/apache-maven-wrapper-4.0.0-alpha-1-SNAPSHOT-bin.tar.gz under org/apache/maven/apache-maven-wrapper/4.0.0-alpha-1-SNAPSHOT/apache-maven-wrapper-4.0.0-alpha-1-SNAPSHOT-bin.tar.gz
[withMaven] artifactsPublisher - Archive artifact apache-maven/target/apache-maven-wrapper-4.0.0-alpha-1-SNAPSHOT-bin.zip under org/apache/maven/apache-maven-wrapper/4.0.0-alpha-1-SNAPSHOT/apache-maven-wrapper-4.0.0-alpha-1-SNAPSHOT-bin.zip
[withMaven] artifactsPublisher - Archive artifact apache-maven/target/apache-maven-wrapper-4.0.0-alpha-1-SNAPSHOT-source.tar.gz under org/apache/maven/apache-maven-wrapper/4.0.0-alpha-1-SNAPSHOT/apache-maven-wrapper-4.0.0-alpha-1-SNAPSHOT-source.tar.gz
[withMaven] artifactsPublisher - Archive artifact apache-maven/target/apache-maven-wrapper-4.0.0-alpha-1-SNAPSHOT-source.zip under org/apache/maven/apache-maven-wrapper/4.0.0-alpha-1-SNAPSHOT/apache-maven-wrapper-4.0.0-alpha-1-SNAPSHOT-source.zip
[Fast Archiver] Compressed 667.70 KB of artifacts by 76.7% relative to #136
[withMaven] junitPublisher - Archive test results for Maven artifact org.apache.maven:maven-bom:jar:4.0.0-alpha-1-SNAPSHOT generated by maven-surefire-plugin:test (default-test): maven-bom/target/surefire-reports/*.xml
[withMaven] junitPublisher - Archive test results for Maven artifact org.apache.maven:maven-test-support:jar:4.0.0-alpha-1-SNAPSHOT generated by maven-surefire-plugin:test (default-test): maven-test-support/target/surefire-reports/*.xml
[withMaven] junitPublisher - Archive test results for Maven artifact org.apache.maven:maven-model:jar:4.0.0-alpha-1-SNAPSHOT generated by maven-surefire-plugin:test (default-test): maven-model/target/surefire-reports/*.xml
[withMaven] junitPublisher - Archive test results for Maven artifact org.apache.maven:maven-artifact:jar:4.0.0-alpha-1-SNAPSHOT generated by maven-surefire-plugin:test (default-test): maven-artifact/target/surefire-reports/*.xml
[withMaven] junitPublisher - Archive test results for Maven artifact org.apache.maven:maven-plugin-api:jar:4.0.0-alpha-1-SNAPSHOT generated by maven-surefire-plugin:test (default-test): maven-plugin-api/target/surefire-reports/*.xml
[withMaven] junitPublisher - Archive test results for Maven artifact org.apache.maven:maven-builder-support:jar:4.0.0-alpha-1-SNAPSHOT generated by maven-surefire-plugin:test (default-test): maven-builder-support/target/surefire-reports/*.xml
[withMaven] junitPublisher - Archive test results for Maven artifact org.apache.maven:maven-model-transform:jar:4.0.0-alpha-1-SNAPSHOT generated by maven-surefire-plugin:test (default-test): maven-model-transform/target/surefire-reports/*.xml
[withMaven] junitPublisher - Archive test results for Maven artifact org.apache.maven:maven-settings:jar:4.0.0-alpha-1-SNAPSHOT generated by maven-surefire-plugin:test (default-test): maven-settings/target/surefire-reports/*.xml
[withMaven] junitPublisher - Archive test results for Maven artifact org.apache.maven:maven-settings-builder:jar:4.0.0-alpha-1-SNAPSHOT generated by maven-surefire-plugin:test (default-test): maven-settings-builder/target/surefire-reports/*.xml
[withMaven] junitPublisher - Archive test results for Maven artifact org.apache.maven:maven-repository-metadata:jar:4.0.0-alpha-1-SNAPSHOT generated by maven-surefire-plugin:test (default-test): maven-repository-metadata/target/surefire-reports/*.xml
[withMaven] junitPublisher - Archive test results for Maven artifact org.apache.maven:maven-slf4j-wrapper:jar:4.0.0-alpha-1-SNAPSHOT generated by maven-surefire-plugin:test (default-test): maven-slf4j-wrapper/target/surefire-reports/*.xml
[withMaven] junitPublisher - Archive test results for Maven artifact org.apache.maven:maven-slf4j-provider:jar:4.0.0-alpha-1-SNAPSHOT generated by maven-surefire-plugin:test (default-test): maven-slf4j-provider/target/surefire-reports/*.xml
[withMaven] junitPublisher - Archive test results for Maven artifact org.apache.maven:maven-wrapper:jar:4.0.0-alpha-1-SNAPSHOT generated by maven-surefire-plugin:test (default-test): maven-wrapper/target/surefire-reports/*.xml
Recording test results
[withMaven] junitPublisher - Archive test results for Maven artifact org.apache.maven:maven-artifact:jar:4.0.0-alpha-1-SNAPSHOT generated by maven-failsafe-plugin:integration-test (default): maven-artifact/target/failsafe-reports/*.xml
Recording test results
[withMaven] Publishers: Generated Artifacts Publisher: 15148 ms, Junit Publisher: 37683 ms, Dependencies Fingerprint Publisher: 2033 ms, Pipeline Graph Publisher: 4 ms
[Pipeline] // withMaven
[Pipeline] }
[Pipeline] // stage
[Pipeline] }
[Pipeline] // dir
[Pipeline] }
[Pipeline] // node
[Pipeline] echo
[FAILURE-003] AbortException hudson.AbortException: script returned exit code 1
[Pipeline] stage
[Pipeline] { (Notifications)
[Pipeline] echo
Build result: FAILURE
[Pipeline] jiraIssueSelector
[Pipeline] jiraComment
[Pipeline] echo
The authors of changes [hboutemy].
[Pipeline] echo
Sending email ...
[Pipeline] emailext
Reply | Threaded
Open this post in threaded view
|

Build succeeded in Jenkins: Maven » Maven TLP » maven » master #138

Apache Jenkins Server-2
See https://ci-builds.apache.org/job/Maven/job/maven-box/job/maven/job/master/138/

Changes:

* [MNG-6656] rename build+consumer filters to buildToRaw+rawToConsumer

All tests passed