Build failed in Jenkins: Maven » Maven TLP » maven-enforcer » master #3

Previous Topic Next Topic
 
classic Classic list List threaded Threaded
5 messages Options
Reply | Threaded
Open this post in threaded view
|

Build failed in Jenkins: Maven » Maven TLP » maven-enforcer » master #3

Apache Jenkins Server-2
See https://ci-builds.apache.org/job/Maven/job/maven-box/job/maven-enforcer/job/master/3/

Changes:

* (doc) Remove javadoc for missing parameter
* (doc) Remove duplicated determiner

All tests passed

Build log:
[...truncated 440195 lines...]
      url: http://repository.apache.org/snapshots
   layout: default
snapshots: [enabled => true, update => daily]
 releases: [enabled => false, update => daily]
,       id: central
      url: https://repo.maven.apache.org/maven2
   layout: default
snapshots: [enabled => false, update => daily]
 releases: [enabled => true, update => never]
]
[DEBUG]   (f) session = org.apache.maven.execution.MavenSession@5d3d2bab
[DEBUG]   (f) skip = false
[DEBUG] -- end configuration --
[INFO] Stopping Mock Repository Manager on http://localhost:39763
[DEBUG] stopped SocketConnector@0.0.0.0:0
[DEBUG] stopping Server@1479b8ee
[DEBUG] stopping org.mortbay.jetty.servlet.Context@2042d2f5{/,null}
[DEBUG] stopping SessionHandler@2fc07397
[DEBUG] stopping ServletHandler@3e4d6ff
[DEBUG] stopped org.codehaus.mojo.mrm.servlet.FileSystemServlet-538240854
[DEBUG] stopped ServletHandler@3e4d6ff
[DEBUG] stopped org.mortbay.jetty.servlet.HashSessionManager@24df0158
[DEBUG] stopped SessionHandler@2fc07397
[DEBUG] stopping ErrorHandler@47fff1c3
[DEBUG] stopped ErrorHandler@47fff1c3
[DEBUG] stopped org.mortbay.jetty.servlet.Context@2042d2f5{/,null}
[DEBUG] stopped org.mortbay.jetty.servlet.HashSessionIdManager@6976bd5d
[DEBUG] stopped org.mortbay.thread.BoundedThreadPool@1cce52db
[DEBUG] stopped Server@1479b8ee
[INFO] Mock Repository Manager http://localhost:39763 is stopped.
[INFO]
[INFO] --- maven-checkstyle-plugin:3.0.0:check (checkstyle-check) @ maven-enforcer-plugin ---
[DEBUG] Configuring mojo org.apache.maven.plugins:maven-checkstyle-plugin:3.0.0:check from plugin realm ClassRealm[plugin>org.apache.maven.plugins:maven-checkstyle-plugin:3.0.0, parent: sun.misc.Launcher$AppClassLoader@29cd761a]
[DEBUG] Configuring mojo 'org.apache.maven.plugins:maven-checkstyle-plugin:3.0.0:check' with basic configurator -->
[DEBUG]   (f) cacheFile = /home/jenkins/workspace/_maven-box_maven-enforcer_master@2/linux-jdk7-m3.3.x_build/maven-enforcer-plugin/target/checkstyle-cachefile
[DEBUG]   (f) configLocation = config/maven_checks.xml
[DEBUG]   (f) consoleOutput = false
[DEBUG]   (f) encoding = UTF-8
[DEBUG]   (f) failOnViolation = true
[DEBUG]   (f) failsOnError = false
[DEBUG]   (f) headerLocation = config/maven-header.txt
[DEBUG]   (f) includeResources = true
[DEBUG]   (f) includeTestResources = true
[DEBUG]   (f) includeTestSourceDirectory = false
[DEBUG]   (f) includes = **\/*.java
[DEBUG]   (f) logViolationsToConsole = true
[DEBUG]   (f) maxAllowedViolations = 0
[DEBUG]   (f) omitIgnoredModules = false
[DEBUG]   (f) outputFile = /home/jenkins/workspace/_maven-box_maven-enforcer_master@2/linux-jdk7-m3.3.x_build/maven-enforcer-plugin/target/checkstyle-result.xml
[DEBUG]   (f) outputFileFormat = xml
[DEBUG]   (f) plugin = Component Descriptor: role: 'org.apache.maven.plugin.Mojo', implementation: 'org.apache.maven.plugins.checkstyle.CheckstyleViolationCheckMojo', role hint: 'org.apache.maven.plugins:maven-checkstyle-plugin:3.0.0:check'
role: 'org.apache.maven.plugin.Mojo', implementation: 'org.apache.maven.plugins.checkstyle.CheckstyleReport', role hint: 'org.apache.maven.plugins:maven-checkstyle-plugin:3.0.0:checkstyle'
role: 'org.apache.maven.plugin.Mojo', implementation: 'org.apache.maven.plugins.checkstyle.CheckstyleAggregateReport', role hint: 'org.apache.maven.plugins:maven-checkstyle-plugin:3.0.0:checkstyle-aggregate'
role: 'org.apache.maven.plugin.Mojo', implementation: 'org.apache.maven.plugins.checkstyle.HelpMojo', role hint: 'org.apache.maven.plugins:maven-checkstyle-plugin:3.0.0:help'
---
[DEBUG]   (f) project = MavenProject: org.apache.maven.plugins:maven-enforcer-plugin:3.0.0-M4-SNAPSHOT @ /home/jenkins/workspace/_maven-box_maven-enforcer_master@2/linux-jdk7-m3.3.x_build/maven-enforcer-plugin/pom.xml
[DEBUG]   (f) resourceIncludes = **/*.properties
[DEBUG]   (f) resources = [Resource {targetPath: null, filtering: false, FileSet {directory: /home/jenkins/workspace/_maven-box_maven-enforcer_master@2/linux-jdk7-m3.3.x_build/maven-enforcer-plugin/src/main/resources, PatternSet [includes: {}, excludes: {}]}}, Resource {targetPath: null, filtering: false, FileSet {directory: /home/jenkins/workspace/_maven-box_maven-enforcer_master@2/linux-jdk7-m3.3.x_build/maven-enforcer-plugin/target/maven-shared-archive-resources, PatternSet [includes: {}, excludes: {}]}}]
[DEBUG]   (f) rulesFiles = /home/jenkins/workspace/_maven-box_maven-enforcer_master@2/linux-jdk7-m3.3.x_build/maven-enforcer-plugin/target/checkstyle-rules.xml
[DEBUG]   (f) skip = false
[DEBUG]   (f) skipExec = false
[DEBUG]   (f) sourceDirectories = [src/main/java]
[DEBUG]   (f) suppressionsFileExpression = checkstyle.suppressions.file
[DEBUG]   (f) testResources = [Resource {targetPath: null, filtering: false, FileSet {directory: /home/jenkins/workspace/_maven-box_maven-enforcer_master@2/linux-jdk7-m3.3.x_build/maven-enforcer-plugin/src/test/resources, PatternSet [includes: {}, excludes: {}]}}, Resource {targetPath: null, filtering: false, FileSet {directory: /home/jenkins/workspace/_maven-box_maven-enforcer_master@2/linux-jdk7-m3.3.x_build/maven-enforcer-plugin/target/maven-shared-archive-resources, PatternSet [includes: {}, excludes: {}]}}]
[DEBUG]   (f) testSourceDirectories = [src/test/java]
[DEBUG]   (f) violationIgnore = RedundantThrows,NewlineAtEndOfFile,ParameterNumber,MethodLength,FileLength
[DEBUG]   (f) violationSeverity = error
[DEBUG] -- end configuration --
[DEBUG] executeCheckstyle start headerLocation : config/maven-header.txt
[DEBUG] Added 3 source files found in '/home/jenkins/workspace/_maven-box_maven-enforcer_master@2/linux-jdk7-m3.3.x_build/maven-enforcer-plugin/src/main/java'.
[DEBUG] Added 0 resource files found in '/home/jenkins/workspace/_maven-box_maven-enforcer_master@2/linux-jdk7-m3.3.x_build/maven-enforcer-plugin/src/main/resources'.
[DEBUG] Added 0 resource files found in '/home/jenkins/workspace/_maven-box_maven-enforcer_master@2/linux-jdk7-m3.3.x_build/maven-enforcer-plugin/target/maven-shared-archive-resources'.
[DEBUG] The resources directory '/home/jenkins/workspace/_maven-box_maven-enforcer_master@2/linux-jdk7-m3.3.x_build/maven-enforcer-plugin/src/test/resources' does not exist or is not a directory.
[DEBUG] Added 0 resource files found in '/home/jenkins/workspace/_maven-box_maven-enforcer_master@2/linux-jdk7-m3.3.x_build/maven-enforcer-plugin/target/maven-shared-archive-resources'.
[DEBUG] Added 3 files to process.
[DEBUG] Adding the outputDirectory file:/home/jenkins/workspace/_maven-box_maven-enforcer_master@2/linux-jdk7-m3.3.x_build/maven-enforcer-plugin/target/classes/ to the Checkstyle class path
[DEBUG] request.getConfigLocation() config/maven_checks.xml
[DEBUG] The resource 'config/maven_checks.xml' was not found with resourceLoader org.codehaus.plexus.resource.loader.JarResourceLoader.
[DEBUG] The resource 'config/maven_checks.xml' was found as jar:file:/home/jenkins/workspace/.maven_repositories/0/org/apache/maven/shared/maven-shared-resources/2/maven-shared-resources-2.jar!/config/maven_checks.xml.
[DEBUG] headerLocation config/maven-header.txt
[DEBUG] JarResourceLoader : trying to load "jar:file:/home/jenkins/workspace/.maven_repositories/0/org/apache/maven/shared/maven-shared-resources/2/maven-shared-resources-2.jar"
[DEBUG] The resource 'config/maven-header.txt' was found as jar:file:/home/jenkins/workspace/.maven_repositories/0/org/apache/maven/shared/maven-shared-resources/2/maven-shared-resources-2.jar!/config/maven-header.txt.
[DEBUG] Added '/home/jenkins/workspace/_maven-box_maven-enforcer_master@2/linux-jdk7-m3.3.x_build/maven-enforcer-plugin/src/main/resources' as a source directory.
[DEBUG] Added '/home/jenkins/workspace/_maven-box_maven-enforcer_master@2/linux-jdk7-m3.3.x_build/maven-enforcer-plugin/target/maven-shared-archive-resources' as a source directory.
[INFO] ------------------------------------------------------------------------
[INFO] Reactor Summary:
[INFO]
[INFO] Apache Maven Enforcer .............................. SUCCESS [  8.907 s]
[INFO] Apache Maven Enforcer API .......................... SUCCESS [  5.291 s]
[INFO] Apache Maven Enforcer Built-In Rules ............... SUCCESS [ 21.196 s]
[INFO] Apache Maven Enforcer Plugin ....................... SUCCESS [08:04 min]
[INFO] ------------------------------------------------------------------------
[INFO] BUILD SUCCESS
[INFO] ------------------------------------------------------------------------
[INFO] Total time: 08:40 min
[INFO] Finished at: 2020-07-27T14:32:40+00:00
[INFO] Final Memory: 55M/1762M
[INFO] ------------------------------------------------------------------------
[INFO] [jenkins-event-spy] Generated /home/jenkins/workspace/_maven-box_maven-enforcer_master@2@tmp/withMaven33a472d9/maven-spy-20200727-142359-4942893173657986891603.log
[Pipeline] }
[Pipeline] // dir
[withMaven] openTasksPublisher - Scan Tasks for Maven artifact org.apache.maven.enforcer:enforcer-api:jar:3.0.0-M4-SNAPSHOT in source directory linux-jdk7-m3.6.x_build/enforcer-api/src/main/java
[withMaven] openTasksPublisher - Scan Tasks for Maven artifact org.apache.maven.enforcer:enforcer-rules:jar:3.0.0-M4-SNAPSHOT in source directory linux-jdk7-m3.6.x_build/enforcer-rules/src/main/java
[withMaven] openTasksPublisher - Scan Tasks for Maven artifact org.apache.maven.plugins:maven-enforcer-plugin:maven-plugin:3.0.0-M4-SNAPSHOT in source directory linux-jdk7-m3.6.x_build/maven-enforcer-plugin/src/main/java
[TASKS] Scanning folder '/home/jenkins/workspace/_maven-box_maven-enforcer_master@2' for files matching the pattern 'linux-jdk7-m3.6.x_build/enforcer-api/src/main/java/**/*,linux-jdk7-m3.6.x_build/enforcer-rules/src/main/java/**/*,linux-jdk7-m3.6.x_build/maven-enforcer-plugin/src/main/java/**/*' - excludes: null
[TASKS] Found 52 files to scan for tasks
[TASKS] Found 4 open tasks.
Skipping warnings blame since pipelines do not have an SCM link.%n
[withMaven] invokerPublisher - Archive invoker results for Maven artifact MavenArtifact{org.apache.maven.plugins:maven-enforcer-plugin:maven-plugin:3.0.0-M4-SNAPSHOT(version: 3.0.0-M4-SNAPSHOT, snapshot:false) } generated by PluginInvocation{org.apache.maven.plugins:maven-invoker-plugin:3.2.1@run  integration-test}: linux-jdk7-m3.6.x_build/maven-enforcer-plugin/target/invoker-reports/*.xml
[withMaven] openTasksPublisher - Scan Tasks for Maven artifact org.apache.maven.enforcer:enforcer-api:jar:3.0.0-M4-SNAPSHOT in source directory linux-jdk14-m3.6.x_build/enforcer-api/src/main/java
[withMaven] openTasksPublisher - Scan Tasks for Maven artifact org.apache.maven.enforcer:enforcer-rules:jar:3.0.0-M4-SNAPSHOT in source directory linux-jdk14-m3.6.x_build/enforcer-rules/src/main/java
[withMaven] openTasksPublisher - Scan Tasks for Maven artifact org.apache.maven.plugins:maven-enforcer-plugin:maven-plugin:3.0.0-M4-SNAPSHOT in source directory linux-jdk14-m3.6.x_build/maven-enforcer-plugin/src/main/java
[TASKS] Scanning folder '/home/jenkins/workspace/_maven-box_maven-enforcer_master@3@2' for files matching the pattern 'linux-jdk14-m3.6.x_build/enforcer-api/src/main/java/**/*,linux-jdk14-m3.6.x_build/enforcer-rules/src/main/java/**/*,linux-jdk14-m3.6.x_build/maven-enforcer-plugin/src/main/java/**/*' - excludes: null
[TASKS] Found 52 files to scan for tasks
[TASKS] Found 4 open tasks.
Skipping warnings blame since pipelines do not have an SCM link.%n
[withMaven] invokerPublisher - Archive invoker results for Maven artifact MavenArtifact{org.apache.maven.plugins:maven-enforcer-plugin:maven-plugin:3.0.0-M4-SNAPSHOT(version: 3.0.0-M4-SNAPSHOT, snapshot:false) } generated by PluginInvocation{org.apache.maven.plugins:maven-invoker-plugin:3.2.1@run  integration-test}: linux-jdk14-m3.6.x_build/maven-enforcer-plugin/target/invoker-reports/*.xml
[Pipeline] }
[withMaven] Publishers: Generated Artifacts Publisher: 6692 ms, Junit Publisher: 29636 ms, Open Task Scanner Publisher: 2792 ms, Dependencies Fingerprint Publisher: 1753 ms, Invoker Publisher: 143481 ms
[Pipeline] // withMaven
[Pipeline] cleanWs
[withMaven] openTasksPublisher - Scan Tasks for Maven artifact org.apache.maven.enforcer:enforcer-api:jar:3.0.0-M4-SNAPSHOT in source directory linux-jdk8-m3.6.x_build/enforcer-api/src/main/java
[WS-CLEANUP] Deleting project workspace...
[WS-CLEANUP] Deferred wipeout is used...
[withMaven] openTasksPublisher - Scan Tasks for Maven artifact org.apache.maven.enforcer:enforcer-rules:jar:3.0.0-M4-SNAPSHOT in source directory linux-jdk8-m3.6.x_build/enforcer-rules/src/main/java
[withMaven] artifactsPublisher - Archive artifact linux-jdk7-m3.3.x_build/pom.xml under org/apache/maven/enforcer/enforcer/3.0.0-M4-SNAPSHOT/enforcer-3.0.0-M4-SNAPSHOT.pom
[withMaven] openTasksPublisher - Scan Tasks for Maven artifact org.apache.maven.plugins:maven-enforcer-plugin:maven-plugin:3.0.0-M4-SNAPSHOT in source directory linux-jdk8-m3.6.x_build/maven-enforcer-plugin/src/main/java
[WS-CLEANUP] done
[Pipeline] }
[Pipeline] // stage
[Pipeline] }
[Pipeline] // ws
[Pipeline] }
[Pipeline] // node
[Pipeline] }
[withMaven] artifactsPublisher - Archive artifact linux-jdk7-m3.3.x_build/target/enforcer-3.0.0-M4-SNAPSHOT-site.xml under org/apache/maven/enforcer/enforcer/3.0.0-M4-SNAPSHOT/enforcer-3.0.0-M4-SNAPSHOT-site.xml
[TASKS] Scanning folder '/home/jenkins/workspace/_maven-box_maven-enforcer_master@2' for files matching the pattern 'linux-jdk8-m3.6.x_build/enforcer-api/src/main/java/**/*,linux-jdk8-m3.6.x_build/enforcer-rules/src/main/java/**/*,linux-jdk8-m3.6.x_build/maven-enforcer-plugin/src/main/java/**/*' - excludes: null
[TASKS] Found 52 files to scan for tasks
[TASKS] Found 4 open tasks.
Skipping warnings blame since pipelines do not have an SCM link.%n
[withMaven] artifactsPublisher - Archive artifact linux-jdk7-m3.3.x_build/enforcer-api/pom.xml under org/apache/maven/enforcer/enforcer-api/3.0.0-M4-SNAPSHOT/enforcer-api-3.0.0-M4-SNAPSHOT.pom
[withMaven] artifactsPublisher - Archive artifact linux-jdk7-m3.3.x_build/enforcer-api/target/enforcer-api-3.0.0-M4-SNAPSHOT.jar under org/apache/maven/enforcer/enforcer-api/3.0.0-M4-SNAPSHOT/enforcer-api-3.0.0-M4-SNAPSHOT.jar
[withMaven] artifactsPublisher - Archive artifact linux-jdk7-m3.3.x_build/enforcer-rules/pom.xml under org/apache/maven/enforcer/enforcer-rules/3.0.0-M4-SNAPSHOT/enforcer-rules-3.0.0-M4-SNAPSHOT.pom
[withMaven] artifactsPublisher - Archive artifact linux-jdk7-m3.3.x_build/enforcer-rules/target/enforcer-rules-3.0.0-M4-SNAPSHOT.jar under org/apache/maven/enforcer/enforcer-rules/3.0.0-M4-SNAPSHOT/enforcer-rules-3.0.0-M4-SNAPSHOT.jar
[withMaven] artifactsPublisher - Archive artifact linux-jdk7-m3.3.x_build/enforcer-rules/target/enforcer-rules-3.0.0-M4-SNAPSHOT-tests.jar under org/apache/maven/enforcer/enforcer-rules/3.0.0-M4-SNAPSHOT/enforcer-rules-3.0.0-M4-SNAPSHOT-tests.jar
[withMaven] invokerPublisher - Archive invoker results for Maven artifact MavenArtifact{org.apache.maven.plugins:maven-enforcer-plugin:maven-plugin:3.0.0-M4-SNAPSHOT(version: 3.0.0-M4-SNAPSHOT, snapshot:false) } generated by PluginInvocation{org.apache.maven.plugins:maven-invoker-plugin:3.2.1@run  integration-test}: linux-jdk8-m3.6.x_build/maven-enforcer-plugin/target/invoker-reports/*.xml
[withMaven] artifactsPublisher - Archive artifact linux-jdk7-m3.3.x_build/maven-enforcer-plugin/pom.xml under org/apache/maven/plugins/maven-enforcer-plugin/3.0.0-M4-SNAPSHOT/maven-enforcer-plugin-3.0.0-M4-SNAPSHOT.pom
[withMaven] artifactsPublisher - Archive artifact linux-jdk7-m3.3.x_build/maven-enforcer-plugin/target/maven-enforcer-plugin-3.0.0-M4-SNAPSHOT.jar under org/apache/maven/plugins/maven-enforcer-plugin/3.0.0-M4-SNAPSHOT/maven-enforcer-plugin-3.0.0-M4-SNAPSHOT.jar
[withMaven] junitPublisher - Archive test results for Maven artifact org.apache.maven.enforcer:enforcer-api:jar:3.0.0-M4-SNAPSHOT generated by maven-surefire-plugin:test (default-test): linux-jdk7-m3.3.x_build/enforcer-api/target/surefire-reports/*.xml
[withMaven] junitPublisher - Archive test results for Maven artifact org.apache.maven.enforcer:enforcer-rules:jar:3.0.0-M4-SNAPSHOT generated by maven-surefire-plugin:test (default-test): linux-jdk7-m3.3.x_build/enforcer-rules/target/surefire-reports/*.xml
[withMaven] junitPublisher - Archive test results for Maven artifact org.apache.maven.plugins:maven-enforcer-plugin:maven-plugin:3.0.0-M4-SNAPSHOT generated by maven-surefire-plugin:test (default-test): linux-jdk7-m3.3.x_build/maven-enforcer-plugin/target/surefire-reports/*.xml
Recording test results
[withMaven] Publishers: Generated Artifacts Publisher: 7121 ms, Junit Publisher: 28656 ms, Open Task Scanner Publisher: 2740 ms, Dependencies Fingerprint Publisher: 1760 ms, Invoker Publisher: 143232 ms, Pipeline Graph Publisher: 3 ms
[Pipeline] // withMaven
[Pipeline] cleanWs
[withMaven] openTasksPublisher - Scan Tasks for Maven artifact org.apache.maven.enforcer:enforcer-api:jar:3.0.0-M4-SNAPSHOT in source directory linux-jdk7-m3.3.x_build/enforcer-api/src/main/java
[withMaven] openTasksPublisher - Scan Tasks for Maven artifact org.apache.maven.enforcer:enforcer-rules:jar:3.0.0-M4-SNAPSHOT in source directory linux-jdk7-m3.3.x_build/enforcer-rules/src/main/java
[WS-CLEANUP] Deleting project workspace...
[WS-CLEANUP] Deferred wipeout is used...
[withMaven] openTasksPublisher - Scan Tasks for Maven artifact org.apache.maven.plugins:maven-enforcer-plugin:maven-plugin:3.0.0-M4-SNAPSHOT in source directory linux-jdk7-m3.3.x_build/maven-enforcer-plugin/src/main/java
[TASKS] Scanning folder '/home/jenkins/workspace/_maven-box_maven-enforcer_master@2' for files matching the pattern 'linux-jdk7-m3.3.x_build/enforcer-api/src/main/java/**/*,linux-jdk7-m3.3.x_build/enforcer-rules/src/main/java/**/*,linux-jdk7-m3.3.x_build/maven-enforcer-plugin/src/main/java/**/*' - excludes: null
[TASKS] Found 52 files to scan for tasks
[TASKS] Found 4 open tasks.
Skipping warnings blame since pipelines do not have an SCM link.%n
[WS-CLEANUP] done
[Pipeline] }
[Pipeline] // stage
[Pipeline] }
[Pipeline] // ws
[Pipeline] }
[Pipeline] // node
[Pipeline] }
[withMaven] invokerPublisher - Archive invoker results for Maven artifact MavenArtifact{org.apache.maven.plugins:maven-enforcer-plugin:maven-plugin:3.0.0-M4-SNAPSHOT(version: 3.0.0-M4-SNAPSHOT, snapshot:false) } generated by PluginInvocation{org.apache.maven.plugins:maven-invoker-plugin:3.2.1@run  integration-test}: linux-jdk7-m3.3.x_build/maven-enforcer-plugin/target/invoker-reports/*.xml
[withMaven] Publishers: Generated Artifacts Publisher: 6840 ms, Junit Publisher: 39920 ms, Open Task Scanner Publisher: 2718 ms, Dependencies Fingerprint Publisher: 2041 ms, Invoker Publisher: 136038 ms, Pipeline Graph Publisher: 1 ms
[Pipeline] // withMaven
[Pipeline] cleanWs
[WS-CLEANUP] Deleting project workspace...
[WS-CLEANUP] Deferred wipeout is used...
[WS-CLEANUP] done
[Pipeline] }
[Pipeline] // stage
[Pipeline] }
[Pipeline] // ws
[Pipeline] }
[Pipeline] // node
[Pipeline] }
[withMaven] Publishers: Generated Artifacts Publisher: 7545 ms, Junit Publisher: 33763 ms, Open Task Scanner Publisher: 3064 ms, Dependencies Fingerprint Publisher: 2042 ms, Invoker Publisher: 132501 ms, Pipeline Graph Publisher: 1 ms
[Pipeline] // withMaven
[Pipeline] cleanWs
[WS-CLEANUP] Deleting project workspace...
[WS-CLEANUP] Deferred wipeout is used...
[WS-CLEANUP] done
[Pipeline] }
[Pipeline] // stage
[Pipeline] }
[Pipeline] // ws
[Pipeline] }
[Pipeline] // node
[Pipeline] }
[withMaven] Publishers: Generated Artifacts Publisher: 8157 ms, Junit Publisher: 49575 ms, Open Task Scanner Publisher: 3105 ms, Dependencies Fingerprint Publisher: 2071 ms, Invoker Publisher: 139574 ms, Pipeline Graph Publisher: 1 ms
[Pipeline] // withMaven
[Pipeline] cleanWs
[WS-CLEANUP] Deleting project workspace...
[WS-CLEANUP] Deferred wipeout is used...
[WS-CLEANUP] done
[Pipeline] }
[Pipeline] // stage
[Pipeline] }
[Pipeline] // ws
[Pipeline] }
[Pipeline] // node
[Pipeline] }
[withMaven] Publishers: Generated Artifacts Publisher: 8245 ms, Junit Publisher: 83881 ms, Open Task Scanner Publisher: 3105 ms, Dependencies Fingerprint Publisher: 2071 ms, Invoker Publisher: 136760 ms, Pipeline Graph Publisher: 1 ms
[Pipeline] // withMaven
[Pipeline] cleanWs
[WS-CLEANUP] Deleting project workspace...
[WS-CLEANUP] Deferred wipeout is used...
[WS-CLEANUP] done
[Pipeline] }
[Pipeline] // stage
[Pipeline] }
[Pipeline] // ws
[Pipeline] }
[Pipeline] // node
[Pipeline] }
[withMaven] Publishers: Generated Artifacts Publisher: 6922 ms, Junit Publisher: 28668 ms, Open Task Scanner Publisher: 2893 ms, Dependencies Fingerprint Publisher: 1875 ms, Invoker Publisher: 127022 ms, Pipeline Graph Publisher: 3 ms
[Pipeline] // withMaven
[Pipeline] cleanWs
[WS-CLEANUP] Deleting project workspace...
[WS-CLEANUP] Deferred wipeout is used...
[WS-CLEANUP] done
[Pipeline] }
[Pipeline] // stage
[Pipeline] }
[Pipeline] // ws
[Pipeline] }
[Pipeline] // node
[Pipeline] }
[Pipeline] // parallel
[Pipeline] stage
[Pipeline] { (Notifications)
[Pipeline] echo
Build result: FAILURE
[Pipeline] jiraIssueSelector
[Pipeline] echo
The authors of changes [slachiewicz].
[Pipeline] echo
Sending email ...
[Pipeline] emailext
Reply | Threaded
Open this post in threaded view
|

Build failed in Jenkins: Maven » Maven TLP » maven-enforcer » master #4

Apache Jenkins Server-2
See https://ci-builds.apache.org/job/Maven/job/maven-box/job/maven-enforcer/job/master/4/

Changes:

* enable GitHub Actions CI

All tests passed

Build log:
[...truncated 441016 lines...]
[DEBUG] RESPONSE /org/apache/maven/enforcer/enforcer-rules/3.0.0-M4-SNAPSHOT/maven-metadata.xml  200
[DEBUG] EOF
[DEBUG] post-build script: no script 'verify' found in directory /home/jenkins/workspace/_maven-box_maven-enforcer_master@3@2/linux-jdk7-m3.5.x_build/maven-enforcer-plugin/target/it/require-active-profile
[INFO]           require-active-profile/pom.xml ................... SUCCESS (6.6 s)
[INFO] -------------------------------------------------
[INFO] Build Summary:
[INFO]   Passed: 79, Failed: 0, Errors: 0, Skipped: 2
[INFO] -------------------------------------------------
[INFO]
[INFO] --- mrm-maven-plugin:1.0.0:stop (default) @ maven-enforcer-plugin ---
[DEBUG] Configuring mojo org.codehaus.mojo:mrm-maven-plugin:1.0.0:stop from plugin realm ClassRealm[plugin>org.codehaus.mojo:mrm-maven-plugin:1.0.0, parent: sun.misc.Launcher$AppClassLoader@1a1a7aa4]
[DEBUG] Configuring mojo 'org.codehaus.mojo:mrm-maven-plugin:1.0.0:stop' with basic configurator -->
[DEBUG]   (f) localRepository =       id: local
      url: file:///home/jenkins/workspace/.maven_repositories/1/
   layout: default
snapshots: [enabled => true, update => always]
 releases: [enabled => true, update => always]

[DEBUG]   (f) mojoExecution = org.codehaus.mojo:mrm-maven-plugin:1.0.0:stop {execution: default}
[DEBUG]   (f) pluginDescriptor = Component Descriptor: role: 'org.apache.maven.plugin.Mojo', implementation: 'org.codehaus.mojo.mrm.plugin.HelpMojo', role hint: 'org.codehaus.mojo:mrm-maven-plugin:1.0.0:help'
role: 'org.apache.maven.plugin.Mojo', implementation: 'org.codehaus.mojo.mrm.plugin.RunMojo', role hint: 'org.codehaus.mojo:mrm-maven-plugin:1.0.0:run'
role: 'org.apache.maven.plugin.Mojo', implementation: 'org.codehaus.mojo.mrm.plugin.StartMojo', role hint: 'org.codehaus.mojo:mrm-maven-plugin:1.0.0:start'
role: 'org.apache.maven.plugin.Mojo', implementation: 'org.codehaus.mojo.mrm.plugin.StopMojo', role hint: 'org.codehaus.mojo:mrm-maven-plugin:1.0.0:stop'
---
[DEBUG]   (f) project = MavenProject: org.apache.maven.plugins:maven-enforcer-plugin:3.0.0-M4-SNAPSHOT @ /home/jenkins/workspace/_maven-box_maven-enforcer_master@3@2/linux-jdk7-m3.5.x_build/maven-enforcer-plugin/pom.xml
[DEBUG]   (f) remoteArtifactRepositories = [      id: Nexus
      url: http://repository.apache.org/snapshots
   layout: default
snapshots: [enabled => true, update => daily]
 releases: [enabled => false, update => daily]
,       id: central
      url: https://repo.maven.apache.org/maven2
   layout: default
snapshots: [enabled => false, update => daily]
 releases: [enabled => true, update => daily]
]
[DEBUG]   (f) remotePluginRepositories = [      id: Nexus
      url: http://repository.apache.org/snapshots
   layout: default
snapshots: [enabled => true, update => daily]
 releases: [enabled => false, update => daily]
,       id: central
      url: https://repo.maven.apache.org/maven2
   layout: default
snapshots: [enabled => false, update => daily]
 releases: [enabled => true, update => never]
]
[DEBUG]   (f) session = org.apache.maven.execution.MavenSession@9237e3f
[DEBUG]   (f) skip = false
[DEBUG] -- end configuration --
[INFO] Stopping Mock Repository Manager on http://localhost:37701
[DEBUG] stopped SocketConnector@0.0.0.0:0
[DEBUG] stopping Server@75ba24cf
[DEBUG] stopping org.mortbay.jetty.servlet.Context@10ae8bfc{/,null}
[DEBUG] stopping SessionHandler@336855f2
[DEBUG] stopping ServletHandler@6e29d3c
[DEBUG] stopped org.codehaus.mojo.mrm.servlet.FileSystemServlet-482739945
[DEBUG] stopped ServletHandler@6e29d3c
[DEBUG] stopped org.mortbay.jetty.servlet.HashSessionManager@7c0d1ac
[DEBUG] stopped SessionHandler@336855f2
[DEBUG] stopping ErrorHandler@1f2bf363
[DEBUG] stopped ErrorHandler@1f2bf363
[DEBUG] stopped org.mortbay.jetty.servlet.Context@10ae8bfc{/,null}
[DEBUG] stopped org.mortbay.jetty.servlet.HashSessionIdManager@6dfacb93
[DEBUG] stopped org.mortbay.thread.BoundedThreadPool@1add81b5
[DEBUG] stopped Server@75ba24cf
[INFO] Mock Repository Manager http://localhost:37701 is stopped.
[INFO]
[INFO] --- maven-checkstyle-plugin:3.0.0:check (checkstyle-check) @ maven-enforcer-plugin ---
[DEBUG] Configuring mojo org.apache.maven.plugins:maven-checkstyle-plugin:3.0.0:check from plugin realm ClassRealm[plugin>org.apache.maven.plugins:maven-checkstyle-plugin:3.0.0, parent: sun.misc.Launcher$AppClassLoader@1a1a7aa4]
[DEBUG] Configuring mojo 'org.apache.maven.plugins:maven-checkstyle-plugin:3.0.0:check' with basic configurator -->
[DEBUG]   (f) cacheFile = /home/jenkins/workspace/_maven-box_maven-enforcer_master@3@2/linux-jdk7-m3.5.x_build/maven-enforcer-plugin/target/checkstyle-cachefile
[DEBUG]   (f) configLocation = config/maven_checks.xml
[DEBUG]   (f) consoleOutput = false
[DEBUG]   (f) encoding = UTF-8
[DEBUG]   (f) failOnViolation = true
[DEBUG]   (f) failsOnError = false
[DEBUG]   (f) headerLocation = config/maven-header.txt
[DEBUG]   (f) includeResources = true
[DEBUG]   (f) includeTestResources = true
[DEBUG]   (f) includeTestSourceDirectory = false
[DEBUG]   (f) includes = **\/*.java
[DEBUG]   (f) logViolationsToConsole = true
[DEBUG]   (f) maxAllowedViolations = 0
[DEBUG]   (f) omitIgnoredModules = false
[DEBUG]   (f) outputFile = /home/jenkins/workspace/_maven-box_maven-enforcer_master@3@2/linux-jdk7-m3.5.x_build/maven-enforcer-plugin/target/checkstyle-result.xml
[DEBUG]   (f) outputFileFormat = xml
[DEBUG]   (f) plugin = Component Descriptor: role: 'org.apache.maven.plugin.Mojo', implementation: 'org.apache.maven.plugins.checkstyle.CheckstyleViolationCheckMojo', role hint: 'org.apache.maven.plugins:maven-checkstyle-plugin:3.0.0:check'
role: 'org.apache.maven.plugin.Mojo', implementation: 'org.apache.maven.plugins.checkstyle.CheckstyleReport', role hint: 'org.apache.maven.plugins:maven-checkstyle-plugin:3.0.0:checkstyle'
role: 'org.apache.maven.plugin.Mojo', implementation: 'org.apache.maven.plugins.checkstyle.CheckstyleAggregateReport', role hint: 'org.apache.maven.plugins:maven-checkstyle-plugin:3.0.0:checkstyle-aggregate'
role: 'org.apache.maven.plugin.Mojo', implementation: 'org.apache.maven.plugins.checkstyle.HelpMojo', role hint: 'org.apache.maven.plugins:maven-checkstyle-plugin:3.0.0:help'
---
[DEBUG]   (f) project = MavenProject: org.apache.maven.plugins:maven-enforcer-plugin:3.0.0-M4-SNAPSHOT @ /home/jenkins/workspace/_maven-box_maven-enforcer_master@3@2/linux-jdk7-m3.5.x_build/maven-enforcer-plugin/pom.xml
[DEBUG]   (f) resourceIncludes = **/*.properties
[DEBUG]   (f) resources = [Resource {targetPath: null, filtering: false, FileSet {directory: /home/jenkins/workspace/_maven-box_maven-enforcer_master@3@2/linux-jdk7-m3.5.x_build/maven-enforcer-plugin/src/main/resources, PatternSet [includes: {}, excludes: {}]}}, Resource {targetPath: null, filtering: false, FileSet {directory: /home/jenkins/workspace/_maven-box_maven-enforcer_master@3@2/linux-jdk7-m3.5.x_build/maven-enforcer-plugin/target/maven-shared-archive-resources, PatternSet [includes: {}, excludes: {}]}}]
[DEBUG]   (f) rulesFiles = /home/jenkins/workspace/_maven-box_maven-enforcer_master@3@2/linux-jdk7-m3.5.x_build/maven-enforcer-plugin/target/checkstyle-rules.xml
[DEBUG]   (f) skip = false
[DEBUG]   (f) skipExec = false
[DEBUG]   (f) sourceDirectories = [src/main/java]
[DEBUG]   (f) suppressionsFileExpression = checkstyle.suppressions.file
[DEBUG]   (f) testResources = [Resource {targetPath: null, filtering: false, FileSet {directory: /home/jenkins/workspace/_maven-box_maven-enforcer_master@3@2/linux-jdk7-m3.5.x_build/maven-enforcer-plugin/src/test/resources, PatternSet [includes: {}, excludes: {}]}}, Resource {targetPath: null, filtering: false, FileSet {directory: /home/jenkins/workspace/_maven-box_maven-enforcer_master@3@2/linux-jdk7-m3.5.x_build/maven-enforcer-plugin/target/maven-shared-archive-resources, PatternSet [includes: {}, excludes: {}]}}]
[DEBUG]   (f) testSourceDirectories = [src/test/java]
[DEBUG]   (f) violationIgnore = RedundantThrows,NewlineAtEndOfFile,ParameterNumber,MethodLength,FileLength
[DEBUG]   (f) violationSeverity = error
[DEBUG] -- end configuration --
[DEBUG] executeCheckstyle start headerLocation : config/maven-header.txt
[DEBUG] Added 3 source files found in '/home/jenkins/workspace/_maven-box_maven-enforcer_master@3@2/linux-jdk7-m3.5.x_build/maven-enforcer-plugin/src/main/java'.
[DEBUG] Added 0 resource files found in '/home/jenkins/workspace/_maven-box_maven-enforcer_master@3@2/linux-jdk7-m3.5.x_build/maven-enforcer-plugin/src/main/resources'.
[DEBUG] Added 0 resource files found in '/home/jenkins/workspace/_maven-box_maven-enforcer_master@3@2/linux-jdk7-m3.5.x_build/maven-enforcer-plugin/target/maven-shared-archive-resources'.
[DEBUG] The resources directory '/home/jenkins/workspace/_maven-box_maven-enforcer_master@3@2/linux-jdk7-m3.5.x_build/maven-enforcer-plugin/src/test/resources' does not exist or is not a directory.
[DEBUG] Added 0 resource files found in '/home/jenkins/workspace/_maven-box_maven-enforcer_master@3@2/linux-jdk7-m3.5.x_build/maven-enforcer-plugin/target/maven-shared-archive-resources'.
[DEBUG] Added 3 files to process.
[DEBUG] Adding the outputDirectory file:/home/jenkins/workspace/_maven-box_maven-enforcer_master@3@2/linux-jdk7-m3.5.x_build/maven-enforcer-plugin/target/classes/ to the Checkstyle class path
[DEBUG] request.getConfigLocation() config/maven_checks.xml
[DEBUG] The resource 'config/maven_checks.xml' was found as jar:file:/home/jenkins/workspace/.maven_repositories/1/org/apache/maven/shared/maven-shared-resources/2/maven-shared-resources-2.jar!/config/maven_checks.xml.
[DEBUG] headerLocation config/maven-header.txt
[DEBUG] The resource 'config/maven-header.txt' was found as jar:file:/home/jenkins/workspace/.maven_repositories/1/org/apache/maven/shared/maven-shared-resources/2/maven-shared-resources-2.jar!/config/maven-header.txt.
[DEBUG] Added '/home/jenkins/workspace/_maven-box_maven-enforcer_master@3@2/linux-jdk7-m3.5.x_build/maven-enforcer-plugin/src/main/resources' as a source directory.
[DEBUG] Added '/home/jenkins/workspace/_maven-box_maven-enforcer_master@3@2/linux-jdk7-m3.5.x_build/maven-enforcer-plugin/target/maven-shared-archive-resources' as a source directory.
[INFO] ------------------------------------------------------------------------
[INFO] Reactor Summary:
[INFO]
[INFO] Apache Maven Enforcer 3.0.0-M4-SNAPSHOT ............ SUCCESS [  9.437 s]
[INFO] Apache Maven Enforcer API .......................... SUCCESS [  5.440 s]
[INFO] Apache Maven Enforcer Built-In Rules ............... SUCCESS [ 22.897 s]
[INFO] Apache Maven Enforcer Plugin 3.0.0-M4-SNAPSHOT ..... SUCCESS [09:34 min]
[INFO] ------------------------------------------------------------------------
[INFO] BUILD SUCCESS
[INFO] ------------------------------------------------------------------------
[INFO] Total time: 10:12 min
[INFO] Finished at: 2020-07-27T14:40:05Z
[INFO] ------------------------------------------------------------------------
[INFO] [jenkins-event-spy] Generated /home/jenkins/workspace/_maven-box_maven-enforcer_master@3@2@tmp/withMavendaf481b3/maven-spy-20200727-142951-7348089996057386509889.log
[Pipeline] }
[Pipeline] // dir
[withMaven] Publishers: Generated Artifacts Publisher: 7993 ms, Junit Publisher: 33625 ms, Open Task Scanner Publisher: 3050 ms, Dependencies Fingerprint Publisher: 2074 ms, Invoker Publisher: 141451 ms, Pipeline Graph Publisher: 1 ms
[withMaven] openTasksPublisher - Scan Tasks for Maven artifact org.apache.maven.enforcer:enforcer-api:jar:3.0.0-M4-SNAPSHOT in source directory linux-jdk15-m3.6.x_build/enforcer-api/src/main/java
[withMaven] openTasksPublisher - Scan Tasks for Maven artifact org.apache.maven.enforcer:enforcer-rules:jar:3.0.0-M4-SNAPSHOT in source directory linux-jdk15-m3.6.x_build/enforcer-rules/src/main/java
[withMaven] openTasksPublisher - Scan Tasks for Maven artifact org.apache.maven.plugins:maven-enforcer-plugin:maven-plugin:3.0.0-M4-SNAPSHOT in source directory linux-jdk15-m3.6.x_build/maven-enforcer-plugin/src/main/java
[TASKS] Scanning folder '/home/jenkins/workspace/_maven-box_maven-enforcer_master@2' for files matching the pattern 'linux-jdk15-m3.6.x_build/enforcer-api/src/main/java/**/*,linux-jdk15-m3.6.x_build/enforcer-rules/src/main/java/**/*,linux-jdk15-m3.6.x_build/maven-enforcer-plugin/src/main/java/**/*' - excludes: null
[TASKS] Found 52 files to scan for tasks
[TASKS] Found 4 open tasks.
Skipping warnings blame since pipelines do not have an SCM link.%n
[withMaven] invokerPublisher - Archive invoker results for Maven artifact MavenArtifact{org.apache.maven.plugins:maven-enforcer-plugin:maven-plugin:3.0.0-M4-SNAPSHOT(version: 3.0.0-M4-SNAPSHOT, snapshot:false) } generated by PluginInvocation{org.apache.maven.plugins:maven-invoker-plugin:3.2.1@run  integration-test}: linux-jdk15-m3.6.x_build/maven-enforcer-plugin/target/invoker-reports/*.xml
[Pipeline] }
[Pipeline] // withMaven
[Pipeline] cleanWs
[WS-CLEANUP] Deleting project workspace...
[WS-CLEANUP] Deferred wipeout is used...
[WS-CLEANUP] done
[Pipeline] }
[Pipeline] // stage
[Pipeline] }
[Pipeline] // ws
[Pipeline] }
[Pipeline] // node
[Pipeline] }
[withMaven] openTasksPublisher - Scan Tasks for Maven artifact org.apache.maven.enforcer:enforcer-api:jar:3.0.0-M4-SNAPSHOT in source directory linux-jdk11-m3.6.x_build/enforcer-api/src/main/java
[withMaven] openTasksPublisher - Scan Tasks for Maven artifact org.apache.maven.enforcer:enforcer-rules:jar:3.0.0-M4-SNAPSHOT in source directory linux-jdk11-m3.6.x_build/enforcer-rules/src/main/java
[withMaven] artifactsPublisher - Archive artifact linux-jdk7-m3.5.x_build/pom.xml under org/apache/maven/enforcer/enforcer/3.0.0-M4-SNAPSHOT/enforcer-3.0.0-M4-SNAPSHOT.pom
[withMaven] openTasksPublisher - Scan Tasks for Maven artifact org.apache.maven.plugins:maven-enforcer-plugin:maven-plugin:3.0.0-M4-SNAPSHOT in source directory linux-jdk11-m3.6.x_build/maven-enforcer-plugin/src/main/java
[withMaven] artifactsPublisher - Archive artifact linux-jdk7-m3.5.x_build/target/enforcer-3.0.0-M4-SNAPSHOT-site.xml under org/apache/maven/enforcer/enforcer/3.0.0-M4-SNAPSHOT/enforcer-3.0.0-M4-SNAPSHOT-site.xml
[TASKS] Scanning folder '/home/jenkins/workspace/_maven-box_maven-enforcer_master@3@2' for files matching the pattern 'linux-jdk11-m3.6.x_build/enforcer-api/src/main/java/**/*,linux-jdk11-m3.6.x_build/enforcer-rules/src/main/java/**/*,linux-jdk11-m3.6.x_build/maven-enforcer-plugin/src/main/java/**/*' - excludes: null
[TASKS] Found 52 files to scan for tasks
[TASKS] Found 4 open tasks.
Skipping warnings blame since pipelines do not have an SCM link.%n
[withMaven] artifactsPublisher - Archive artifact linux-jdk7-m3.5.x_build/enforcer-api/pom.xml under org/apache/maven/enforcer/enforcer-api/3.0.0-M4-SNAPSHOT/enforcer-api-3.0.0-M4-SNAPSHOT.pom
[withMaven] artifactsPublisher - Archive artifact linux-jdk7-m3.5.x_build/enforcer-api/target/enforcer-api-3.0.0-M4-SNAPSHOT.jar under org/apache/maven/enforcer/enforcer-api/3.0.0-M4-SNAPSHOT/enforcer-api-3.0.0-M4-SNAPSHOT.jar
[withMaven] artifactsPublisher - Archive artifact linux-jdk7-m3.5.x_build/enforcer-rules/pom.xml under org/apache/maven/enforcer/enforcer-rules/3.0.0-M4-SNAPSHOT/enforcer-rules-3.0.0-M4-SNAPSHOT.pom
[withMaven] artifactsPublisher - Archive artifact linux-jdk7-m3.5.x_build/enforcer-rules/target/enforcer-rules-3.0.0-M4-SNAPSHOT.jar under org/apache/maven/enforcer/enforcer-rules/3.0.0-M4-SNAPSHOT/enforcer-rules-3.0.0-M4-SNAPSHOT.jar
[withMaven] artifactsPublisher - Archive artifact linux-jdk7-m3.5.x_build/enforcer-rules/target/enforcer-rules-3.0.0-M4-SNAPSHOT-tests.jar under org/apache/maven/enforcer/enforcer-rules/3.0.0-M4-SNAPSHOT/enforcer-rules-3.0.0-M4-SNAPSHOT-tests.jar
[withMaven] invokerPublisher - Archive invoker results for Maven artifact MavenArtifact{org.apache.maven.plugins:maven-enforcer-plugin:maven-plugin:3.0.0-M4-SNAPSHOT(version: 3.0.0-M4-SNAPSHOT, snapshot:false) } generated by PluginInvocation{org.apache.maven.plugins:maven-invoker-plugin:3.2.1@run  integration-test}: linux-jdk11-m3.6.x_build/maven-enforcer-plugin/target/invoker-reports/*.xml
[withMaven] artifactsPublisher - Archive artifact linux-jdk7-m3.5.x_build/maven-enforcer-plugin/pom.xml under org/apache/maven/plugins/maven-enforcer-plugin/3.0.0-M4-SNAPSHOT/maven-enforcer-plugin-3.0.0-M4-SNAPSHOT.pom
[withMaven] artifactsPublisher - Archive artifact linux-jdk7-m3.5.x_build/maven-enforcer-plugin/target/maven-enforcer-plugin-3.0.0-M4-SNAPSHOT.jar under org/apache/maven/plugins/maven-enforcer-plugin/3.0.0-M4-SNAPSHOT/maven-enforcer-plugin-3.0.0-M4-SNAPSHOT.jar
[withMaven] junitPublisher - Archive test results for Maven artifact org.apache.maven.enforcer:enforcer-api:jar:3.0.0-M4-SNAPSHOT generated by maven-surefire-plugin:test (default-test): linux-jdk7-m3.5.x_build/enforcer-api/target/surefire-reports/*.xml
[withMaven] junitPublisher - Archive test results for Maven artifact org.apache.maven.enforcer:enforcer-rules:jar:3.0.0-M4-SNAPSHOT generated by maven-surefire-plugin:test (default-test): linux-jdk7-m3.5.x_build/enforcer-rules/target/surefire-reports/*.xml
[withMaven] junitPublisher - Archive test results for Maven artifact org.apache.maven.plugins:maven-enforcer-plugin:maven-plugin:3.0.0-M4-SNAPSHOT generated by maven-surefire-plugin:test (default-test): linux-jdk7-m3.5.x_build/maven-enforcer-plugin/target/surefire-reports/*.xml
Recording test results
[withMaven] openTasksPublisher - Scan Tasks for Maven artifact org.apache.maven.enforcer:enforcer-api:jar:3.0.0-M4-SNAPSHOT in source directory linux-jdk7-m3.5.x_build/enforcer-api/src/main/java
[withMaven] openTasksPublisher - Scan Tasks for Maven artifact org.apache.maven.enforcer:enforcer-rules:jar:3.0.0-M4-SNAPSHOT in source directory linux-jdk7-m3.5.x_build/enforcer-rules/src/main/java
[withMaven] openTasksPublisher - Scan Tasks for Maven artifact org.apache.maven.plugins:maven-enforcer-plugin:maven-plugin:3.0.0-M4-SNAPSHOT in source directory linux-jdk7-m3.5.x_build/maven-enforcer-plugin/src/main/java
[TASKS] Scanning folder '/home/jenkins/workspace/_maven-box_maven-enforcer_master@3@2' for files matching the pattern 'linux-jdk7-m3.5.x_build/enforcer-api/src/main/java/**/*,linux-jdk7-m3.5.x_build/enforcer-rules/src/main/java/**/*,linux-jdk7-m3.5.x_build/maven-enforcer-plugin/src/main/java/**/*' - excludes: null
[TASKS] Found 52 files to scan for tasks
[TASKS] Found 4 open tasks.
Skipping warnings blame since pipelines do not have an SCM link.%n
[withMaven] invokerPublisher - Archive invoker results for Maven artifact MavenArtifact{org.apache.maven.plugins:maven-enforcer-plugin:maven-plugin:3.0.0-M4-SNAPSHOT(version: 3.0.0-M4-SNAPSHOT, snapshot:false) } generated by PluginInvocation{org.apache.maven.plugins:maven-invoker-plugin:3.2.1@run  integration-test}: linux-jdk7-m3.5.x_build/maven-enforcer-plugin/target/invoker-reports/*.xml
[withMaven] Publishers: Generated Artifacts Publisher: 10072 ms, Junit Publisher: 32104 ms, Open Task Scanner Publisher: 2831 ms, Dependencies Fingerprint Publisher: 2118 ms, Invoker Publisher: 140699 ms, Pipeline Graph Publisher: 2 ms
[Pipeline] // withMaven
[Pipeline] cleanWs
[WS-CLEANUP] Deleting project workspace...
[WS-CLEANUP] Deferred wipeout is used...
[WS-CLEANUP] done
[Pipeline] }
[Pipeline] // stage
[Pipeline] }
[Pipeline] // ws
[Pipeline] }
[Pipeline] // node
[Pipeline] }
[withMaven] Publishers: Generated Artifacts Publisher: 4434 ms, Junit Publisher: 28142 ms, Open Task Scanner Publisher: 2976 ms, Dependencies Fingerprint Publisher: 1752 ms, Invoker Publisher: 134072 ms, Pipeline Graph Publisher: 1 ms
[Pipeline] // withMaven
[Pipeline] cleanWs
[WS-CLEANUP] Deleting project workspace...
[WS-CLEANUP] Deferred wipeout is used...
[WS-CLEANUP] done
[Pipeline] }
[Pipeline] // stage
[Pipeline] }
[Pipeline] // ws
[Pipeline] }
[Pipeline] // node
[Pipeline] }
[withMaven] Publishers: Generated Artifacts Publisher: 8414 ms, Junit Publisher: 59263 ms, Open Task Scanner Publisher: 3172 ms, Dependencies Fingerprint Publisher: 2121 ms, Invoker Publisher: 142500 ms, Pipeline Graph Publisher: 1 ms
[Pipeline] // withMaven
[Pipeline] cleanWs
[WS-CLEANUP] Deleting project workspace...
[WS-CLEANUP] Deferred wipeout is used...
[WS-CLEANUP] done
[Pipeline] }
[Pipeline] // stage
[Pipeline] }
[Pipeline] // ws
[Pipeline] }
[Pipeline] // node
[Pipeline] }
[withMaven] Publishers: Generated Artifacts Publisher: 7140 ms, Junit Publisher: 29385 ms, Open Task Scanner Publisher: 2828 ms, Dependencies Fingerprint Publisher: 1814 ms, Invoker Publisher: 127398 ms, Pipeline Graph Publisher: 1 ms
[Pipeline] // withMaven
[Pipeline] cleanWs
[WS-CLEANUP] Deleting project workspace...
[WS-CLEANUP] Deferred wipeout is used...
[WS-CLEANUP] done
[Pipeline] }
[Pipeline] // stage
[Pipeline] }
[Pipeline] // ws
[Pipeline] }
[Pipeline] // node
[Pipeline] }
[Pipeline] // parallel
[Pipeline] stage
[Pipeline] { (Notifications)
[Pipeline] echo
Build result: FAILURE
[Pipeline] jiraIssueSelector
[Pipeline] echo
The authors of changes [slachiewicz].
[Pipeline] echo
Sending email ...
[Pipeline] emailext
Reply | Threaded
Open this post in threaded view
|

Build failed in Jenkins: Maven » Maven TLP » maven-enforcer » master #5

Apache Jenkins Server-2
See https://ci-builds.apache.org/job/Maven/job/maven-box/job/maven-enforcer/job/master/5/

Changes:

* MENFORCER-245 Improve documentation about writing own Enforcer Rule
* Changed those lines reviewed in the PR.

All tests passed

Build log:
[...truncated 436120 lines...]
[DEBUG]   (f) omitIgnoredModules = false
[DEBUG]   (f) outputFile = /home/jenkins/h49-shared/712657a4/workspace/_maven-box_maven-enforcer_master@2/linux-jdk7-m3.2.x_build/maven-enforcer-plugin/target/checkstyle-result.xml
[DEBUG]   (f) outputFileFormat = xml
[DEBUG]   (f) plugin = Component Descriptor: role: 'org.apache.maven.plugin.Mojo', implementation: 'org.apache.maven.plugins.checkstyle.CheckstyleViolationCheckMojo', role hint: 'org.apache.maven.plugins:maven-checkstyle-plugin:3.0.0:check'
role: 'org.apache.maven.plugin.Mojo', implementation: 'org.apache.maven.plugins.checkstyle.CheckstyleReport', role hint: 'org.apache.maven.plugins:maven-checkstyle-plugin:3.0.0:checkstyle'
role: 'org.apache.maven.plugin.Mojo', implementation: 'org.apache.maven.plugins.checkstyle.CheckstyleAggregateReport', role hint: 'org.apache.maven.plugins:maven-checkstyle-plugin:3.0.0:checkstyle-aggregate'
role: 'org.apache.maven.plugin.Mojo', implementation: 'org.apache.maven.plugins.checkstyle.HelpMojo', role hint: 'org.apache.maven.plugins:maven-checkstyle-plugin:3.0.0:help'
---
[DEBUG]   (f) project = MavenProject: org.apache.maven.plugins:maven-enforcer-plugin:3.0.0-M4-SNAPSHOT @ /home/jenkins/h49-shared/712657a4/workspace/_maven-box_maven-enforcer_master@2/linux-jdk7-m3.2.x_build/maven-enforcer-plugin/pom.xml
[DEBUG]   (f) resourceIncludes = **/*.properties
[DEBUG]   (f) resources = [Resource {targetPath: null, filtering: false, FileSet {directory: /home/jenkins/h49-shared/712657a4/workspace/_maven-box_maven-enforcer_master@2/linux-jdk7-m3.2.x_build/maven-enforcer-plugin/src/main/resources, PatternSet [includes: {}, excludes: {}]}}, Resource {targetPath: null, filtering: false, FileSet {directory: /home/jenkins/h49-shared/712657a4/workspace/_maven-box_maven-enforcer_master@2/linux-jdk7-m3.2.x_build/maven-enforcer-plugin/target/maven-shared-archive-resources, PatternSet [includes: {}, excludes: {}]}}]
[DEBUG]   (f) rulesFiles = /home/jenkins/h49-shared/712657a4/workspace/_maven-box_maven-enforcer_master@2/linux-jdk7-m3.2.x_build/maven-enforcer-plugin/target/checkstyle-rules.xml
[DEBUG]   (f) skip = false
[DEBUG]   (f) skipExec = false
[DEBUG]   (f) sourceDirectories = [src/main/java]
[DEBUG]   (f) suppressionsFileExpression = checkstyle.suppressions.file
[DEBUG]   (f) testResources = [Resource {targetPath: null, filtering: false, FileSet {directory: /home/jenkins/h49-shared/712657a4/workspace/_maven-box_maven-enforcer_master@2/linux-jdk7-m3.2.x_build/maven-enforcer-plugin/src/test/resources, PatternSet [includes: {}, excludes: {}]}}, Resource {targetPath: null, filtering: false, FileSet {directory: /home/jenkins/h49-shared/712657a4/workspace/_maven-box_maven-enforcer_master@2/linux-jdk7-m3.2.x_build/maven-enforcer-plugin/target/maven-shared-archive-resources, PatternSet [includes: {}, excludes: {}]}}]
[DEBUG]   (f) testSourceDirectories = [src/test/java]
[DEBUG]   (f) violationIgnore = RedundantThrows,NewlineAtEndOfFile,ParameterNumber,MethodLength,FileLength
[DEBUG]   (f) violationSeverity = error
[DEBUG] -- end configuration --
[DEBUG] executeCheckstyle start headerLocation : config/maven-header.txt
[DEBUG] Added 3 source files found in '/home/jenkins/h49-shared/712657a4/workspace/_maven-box_maven-enforcer_master@2/linux-jdk7-m3.2.x_build/maven-enforcer-plugin/src/main/java'.
[DEBUG] Added 0 resource files found in '/home/jenkins/h49-shared/712657a4/workspace/_maven-box_maven-enforcer_master@2/linux-jdk7-m3.2.x_build/maven-enforcer-plugin/src/main/resources'.
[DEBUG] Added 0 resource files found in '/home/jenkins/h49-shared/712657a4/workspace/_maven-box_maven-enforcer_master@2/linux-jdk7-m3.2.x_build/maven-enforcer-plugin/target/maven-shared-archive-resources'.
[DEBUG] The resources directory '/home/jenkins/h49-shared/712657a4/workspace/_maven-box_maven-enforcer_master@2/linux-jdk7-m3.2.x_build/maven-enforcer-plugin/src/test/resources' does not exist or is not a directory.
[DEBUG] Added 0 resource files found in '/home/jenkins/h49-shared/712657a4/workspace/_maven-box_maven-enforcer_master@2/linux-jdk7-m3.2.x_build/maven-enforcer-plugin/target/maven-shared-archive-resources'.
[DEBUG] Added 3 files to process.
[DEBUG] Adding the outputDirectory file:/home/jenkins/h49-shared/712657a4/workspace/_maven-box_maven-enforcer_master@2/linux-jdk7-m3.2.x_build/maven-enforcer-plugin/target/classes/ to the Checkstyle class path
[DEBUG] request.getConfigLocation() config/maven_checks.xml
[DEBUG] The resource 'config/maven_checks.xml' was not found with resourceLoader org.codehaus.plexus.resource.loader.FileResourceLoader.
[DEBUG] The resource 'config/maven_checks.xml' was not found with resourceLoader org.codehaus.plexus.resource.loader.JarResourceLoader.
[DEBUG] The resource 'config/maven_checks.xml' was found as jar:file:/home/jenkins/h49-shared/712657a4/workspace/.maven_repositories/0/org/apache/maven/shared/maven-shared-resources/2/maven-shared-resources-2.jar!/config/maven_checks.xml.
[DEBUG] headerLocation config/maven-header.txt
[DEBUG] The resource 'config/maven-header.txt' was not found with resourceLoader org.codehaus.plexus.resource.loader.FileResourceLoader.
[DEBUG] JarResourceLoader : trying to load "jar:file:/home/jenkins/h49-shared/712657a4/workspace/.maven_repositories/0/org/apache/maven/shared/maven-shared-resources/2/maven-shared-resources-2.jar"
[DEBUG] The resource 'config/maven-header.txt' was found as jar:file:/home/jenkins/h49-shared/712657a4/workspace/.maven_repositories/0/org/apache/maven/shared/maven-shared-resources/2/maven-shared-resources-2.jar!/config/maven-header.txt.
[DEBUG] Added '/home/jenkins/h49-shared/712657a4/workspace/_maven-box_maven-enforcer_master@2/linux-jdk7-m3.2.x_build/maven-enforcer-plugin/src/main/resources' as a source directory.
[DEBUG] Added '/home/jenkins/h49-shared/712657a4/workspace/_maven-box_maven-enforcer_master@2/linux-jdk7-m3.2.x_build/maven-enforcer-plugin/target/maven-shared-archive-resources' as a source directory.
[INFO] ------------------------------------------------------------------------
[INFO] Reactor Summary:
[INFO]
[INFO] Apache Maven Enforcer .............................. SUCCESS [  5.419 s]
[INFO] Apache Maven Enforcer API .......................... SUCCESS [  3.183 s]
[INFO] Apache Maven Enforcer Built-In Rules ............... SUCCESS [ 13.410 s]
[INFO] Apache Maven Enforcer Plugin ....................... SUCCESS [05:33 min]
[INFO] ------------------------------------------------------------------------
[INFO] BUILD SUCCESS
[INFO] ------------------------------------------------------------------------
[INFO] Total time: 05:55 min
[INFO] Finished at: 2020-07-27T14:42:14+00:00
[INFO] Final Memory: 64M/1222M
[INFO] ------------------------------------------------------------------------
[INFO] [jenkins-event-spy] Generated /home/jenkins/h49-shared/712657a4/workspace/_maven-box_maven-enforcer_master@2@tmp/withMavenabc10e54/maven-spy-20200727-143618-5704671426535461034361.log
[withMaven] openTasksPublisher - Scan Tasks for Maven artifact org.apache.maven.enforcer:enforcer-api:jar:3.0.0-M4-SNAPSHOT in source directory linux-jdk7-m3.5.x_build/enforcer-api/src/main/java
[withMaven] openTasksPublisher - Scan Tasks for Maven artifact org.apache.maven.enforcer:enforcer-rules:jar:3.0.0-M4-SNAPSHOT in source directory linux-jdk7-m3.5.x_build/enforcer-rules/src/main/java
[withMaven] openTasksPublisher - Scan Tasks for Maven artifact org.apache.maven.plugins:maven-enforcer-plugin:maven-plugin:3.0.0-M4-SNAPSHOT in source directory linux-jdk7-m3.5.x_build/maven-enforcer-plugin/src/main/java
[TASKS] Scanning folder '/home/jenkins/workspace/_maven-box_maven-enforcer_master@3@2' for files matching the pattern 'linux-jdk7-m3.5.x_build/enforcer-api/src/main/java/**/*,linux-jdk7-m3.5.x_build/enforcer-rules/src/main/java/**/*,linux-jdk7-m3.5.x_build/maven-enforcer-plugin/src/main/java/**/*' - excludes: null
[TASKS] Found 52 files to scan for tasks
[TASKS] Found 4 open tasks.
Skipping warnings blame since pipelines do not have an SCM link.%n
[withMaven] invokerPublisher - Archive invoker results for Maven artifact MavenArtifact{org.apache.maven.plugins:maven-enforcer-plugin:maven-plugin:3.0.0-M4-SNAPSHOT(version: 3.0.0-M4-SNAPSHOT, snapshot:false) } generated by PluginInvocation{org.apache.maven.plugins:maven-invoker-plugin:3.2.1@run  integration-test}: linux-jdk7-m3.5.x_build/maven-enforcer-plugin/target/invoker-reports/*.xml
[Pipeline] // dir
[withMaven] openTasksPublisher - Scan Tasks for Maven artifact org.apache.maven.enforcer:enforcer-api:jar:3.0.0-M4-SNAPSHOT in source directory linux-jdk15-m3.6.x_build/enforcer-api/src/main/java
[withMaven] openTasksPublisher - Scan Tasks for Maven artifact org.apache.maven.enforcer:enforcer-rules:jar:3.0.0-M4-SNAPSHOT in source directory linux-jdk15-m3.6.x_build/enforcer-rules/src/main/java
[withMaven] openTasksPublisher - Scan Tasks for Maven artifact org.apache.maven.plugins:maven-enforcer-plugin:maven-plugin:3.0.0-M4-SNAPSHOT in source directory linux-jdk15-m3.6.x_build/maven-enforcer-plugin/src/main/java
[TASKS] Scanning folder '/home/jenkins/workspace/_maven-box_maven-enforcer_master@2' for files matching the pattern 'linux-jdk15-m3.6.x_build/enforcer-api/src/main/java/**/*,linux-jdk15-m3.6.x_build/enforcer-rules/src/main/java/**/*,linux-jdk15-m3.6.x_build/maven-enforcer-plugin/src/main/java/**/*' - excludes: null
[TASKS] Found 52 files to scan for tasks
[TASKS] Found 4 open tasks.
Skipping warnings blame since pipelines do not have an SCM link.%n
[withMaven] invokerPublisher - Archive invoker results for Maven artifact MavenArtifact{org.apache.maven.plugins:maven-enforcer-plugin:maven-plugin:3.0.0-M4-SNAPSHOT(version: 3.0.0-M4-SNAPSHOT, snapshot:false) } generated by PluginInvocation{org.apache.maven.plugins:maven-invoker-plugin:3.2.1@run  integration-test}: linux-jdk15-m3.6.x_build/maven-enforcer-plugin/target/invoker-reports/*.xml
[withMaven] openTasksPublisher - Scan Tasks for Maven artifact org.apache.maven.enforcer:enforcer-api:jar:3.0.0-M4-SNAPSHOT in source directory linux-jdk8-m3.6.x_build/enforcer-api/src/main/java
[withMaven] openTasksPublisher - Scan Tasks for Maven artifact org.apache.maven.enforcer:enforcer-rules:jar:3.0.0-M4-SNAPSHOT in source directory linux-jdk8-m3.6.x_build/enforcer-rules/src/main/java
[withMaven] openTasksPublisher - Scan Tasks for Maven artifact org.apache.maven.plugins:maven-enforcer-plugin:maven-plugin:3.0.0-M4-SNAPSHOT in source directory linux-jdk8-m3.6.x_build/maven-enforcer-plugin/src/main/java
[TASKS] Scanning folder '/home/jenkins/workspace/_maven-box_maven-enforcer_master@3@2' for files matching the pattern 'linux-jdk8-m3.6.x_build/enforcer-api/src/main/java/**/*,linux-jdk8-m3.6.x_build/enforcer-rules/src/main/java/**/*,linux-jdk8-m3.6.x_build/maven-enforcer-plugin/src/main/java/**/*' - excludes: null
[TASKS] Found 52 files to scan for tasks
[TASKS] Found 4 open tasks.
Skipping warnings blame since pipelines do not have an SCM link.%n
[withMaven] invokerPublisher - Archive invoker results for Maven artifact MavenArtifact{org.apache.maven.plugins:maven-enforcer-plugin:maven-plugin:3.0.0-M4-SNAPSHOT(version: 3.0.0-M4-SNAPSHOT, snapshot:false) } generated by PluginInvocation{org.apache.maven.plugins:maven-invoker-plugin:3.2.1@run  integration-test}: linux-jdk8-m3.6.x_build/maven-enforcer-plugin/target/invoker-reports/*.xml
[Pipeline] }
[Pipeline] }
[Pipeline] // dir
[Pipeline] }
[withMaven] Publishers: Generated Artifacts Publisher: 7128 ms, Junit Publisher: 29507 ms, Open Task Scanner Publisher: 2918 ms, Dependencies Fingerprint Publisher: 2060 ms, Invoker Publisher: 146623 ms, Pipeline Graph Publisher: 1 ms
[Pipeline] // withMaven
[Pipeline] cleanWs
[withMaven] openTasksPublisher - Scan Tasks for Maven artifact org.apache.maven.enforcer:enforcer-api:jar:3.0.0-M4-SNAPSHOT in source directory linux-jdk14-m3.6.x_build/enforcer-api/src/main/java
[withMaven] openTasksPublisher - Scan Tasks for Maven artifact org.apache.maven.enforcer:enforcer-rules:jar:3.0.0-M4-SNAPSHOT in source directory linux-jdk14-m3.6.x_build/enforcer-rules/src/main/java
[withMaven] artifactsPublisher - Archive artifact linux-jdk7-m3.6.x_build/pom.xml under org/apache/maven/enforcer/enforcer/3.0.0-M4-SNAPSHOT/enforcer-3.0.0-M4-SNAPSHOT.pom
[WS-CLEANUP] Deleting project workspace...
[WS-CLEANUP] Deferred wipeout is used...
[withMaven] openTasksPublisher - Scan Tasks for Maven artifact org.apache.maven.plugins:maven-enforcer-plugin:maven-plugin:3.0.0-M4-SNAPSHOT in source directory linux-jdk14-m3.6.x_build/maven-enforcer-plugin/src/main/java
[withMaven] artifactsPublisher - Archive artifact linux-jdk7-m3.6.x_build/target/enforcer-3.0.0-M4-SNAPSHOT-site.xml under org/apache/maven/enforcer/enforcer/3.0.0-M4-SNAPSHOT/enforcer-3.0.0-M4-SNAPSHOT-site.xml
[TASKS] Scanning folder '/home/jenkins/workspace/_maven-box_maven-enforcer_master@2' for files matching the pattern 'linux-jdk14-m3.6.x_build/enforcer-api/src/main/java/**/*,linux-jdk14-m3.6.x_build/enforcer-rules/src/main/java/**/*,linux-jdk14-m3.6.x_build/maven-enforcer-plugin/src/main/java/**/*' - excludes: null
[TASKS] Found 52 files to scan for tasks
[TASKS] Found 4 open tasks.
Skipping warnings blame since pipelines do not have an SCM link.%n
[WS-CLEANUP] done
[Pipeline] }
[Pipeline] // stage
[Pipeline] }
[Pipeline] // ws
[Pipeline] }
[Pipeline] // node
[Pipeline] }
[withMaven] artifactsPublisher - Archive artifact linux-jdk7-m3.6.x_build/enforcer-api/pom.xml under org/apache/maven/enforcer/enforcer-api/3.0.0-M4-SNAPSHOT/enforcer-api-3.0.0-M4-SNAPSHOT.pom
[withMaven] artifactsPublisher - Archive artifact linux-jdk7-m3.6.x_build/enforcer-api/target/enforcer-api-3.0.0-M4-SNAPSHOT.jar under org/apache/maven/enforcer/enforcer-api/3.0.0-M4-SNAPSHOT/enforcer-api-3.0.0-M4-SNAPSHOT.jar
[withMaven] artifactsPublisher - Archive artifact linux-jdk7-m3.6.x_build/enforcer-rules/pom.xml under org/apache/maven/enforcer/enforcer-rules/3.0.0-M4-SNAPSHOT/enforcer-rules-3.0.0-M4-SNAPSHOT.pom
[withMaven] artifactsPublisher - Archive artifact linux-jdk7-m3.6.x_build/enforcer-rules/target/enforcer-rules-3.0.0-M4-SNAPSHOT.jar under org/apache/maven/enforcer/enforcer-rules/3.0.0-M4-SNAPSHOT/enforcer-rules-3.0.0-M4-SNAPSHOT.jar
[withMaven] artifactsPublisher - Archive artifact linux-jdk7-m3.6.x_build/enforcer-rules/target/enforcer-rules-3.0.0-M4-SNAPSHOT-tests.jar under org/apache/maven/enforcer/enforcer-rules/3.0.0-M4-SNAPSHOT/enforcer-rules-3.0.0-M4-SNAPSHOT-tests.jar
[withMaven] invokerPublisher - Archive invoker results for Maven artifact MavenArtifact{org.apache.maven.plugins:maven-enforcer-plugin:maven-plugin:3.0.0-M4-SNAPSHOT(version: 3.0.0-M4-SNAPSHOT, snapshot:false) } generated by PluginInvocation{org.apache.maven.plugins:maven-invoker-plugin:3.2.1@run  integration-test}: linux-jdk14-m3.6.x_build/maven-enforcer-plugin/target/invoker-reports/*.xml
[withMaven] artifactsPublisher - Archive artifact linux-jdk7-m3.6.x_build/maven-enforcer-plugin/pom.xml under org/apache/maven/plugins/maven-enforcer-plugin/3.0.0-M4-SNAPSHOT/maven-enforcer-plugin-3.0.0-M4-SNAPSHOT.pom
[withMaven] artifactsPublisher - Archive artifact linux-jdk7-m3.6.x_build/maven-enforcer-plugin/target/maven-enforcer-plugin-3.0.0-M4-SNAPSHOT.jar under org/apache/maven/plugins/maven-enforcer-plugin/3.0.0-M4-SNAPSHOT/maven-enforcer-plugin-3.0.0-M4-SNAPSHOT.jar
[withMaven] junitPublisher - Archive test results for Maven artifact org.apache.maven.enforcer:enforcer-api:jar:3.0.0-M4-SNAPSHOT generated by maven-surefire-plugin:test (default-test): linux-jdk7-m3.6.x_build/enforcer-api/target/surefire-reports/*.xml
[withMaven] junitPublisher - Archive test results for Maven artifact org.apache.maven.enforcer:enforcer-rules:jar:3.0.0-M4-SNAPSHOT generated by maven-surefire-plugin:test (default-test): linux-jdk7-m3.6.x_build/enforcer-rules/target/surefire-reports/*.xml
[withMaven] junitPublisher - Archive test results for Maven artifact org.apache.maven.plugins:maven-enforcer-plugin:maven-plugin:3.0.0-M4-SNAPSHOT generated by maven-surefire-plugin:test (default-test): linux-jdk7-m3.6.x_build/maven-enforcer-plugin/target/surefire-reports/*.xml
Recording test results
[withMaven] artifactsPublisher - Archive artifact linux-jdk7-m3.2.x_build/pom.xml under org/apache/maven/enforcer/enforcer/3.0.0-M4-SNAPSHOT/enforcer-3.0.0-M4-SNAPSHOT.pom
[withMaven] artifactsPublisher - Archive artifact linux-jdk7-m3.2.x_build/target/enforcer-3.0.0-M4-SNAPSHOT-site.xml under org/apache/maven/enforcer/enforcer/3.0.0-M4-SNAPSHOT/enforcer-3.0.0-M4-SNAPSHOT-site.xml
[withMaven] artifactsPublisher - Archive artifact linux-jdk7-m3.2.x_build/enforcer-api/pom.xml under org/apache/maven/enforcer/enforcer-api/3.0.0-M4-SNAPSHOT/enforcer-api-3.0.0-M4-SNAPSHOT.pom
[withMaven] artifactsPublisher - Archive artifact linux-jdk7-m3.2.x_build/enforcer-api/target/enforcer-api-3.0.0-M4-SNAPSHOT.jar under org/apache/maven/enforcer/enforcer-api/3.0.0-M4-SNAPSHOT/enforcer-api-3.0.0-M4-SNAPSHOT.jar
[withMaven] artifactsPublisher - Archive artifact linux-jdk7-m3.2.x_build/enforcer-rules/pom.xml under org/apache/maven/enforcer/enforcer-rules/3.0.0-M4-SNAPSHOT/enforcer-rules-3.0.0-M4-SNAPSHOT.pom
[withMaven] artifactsPublisher - Archive artifact linux-jdk7-m3.2.x_build/enforcer-rules/target/enforcer-rules-3.0.0-M4-SNAPSHOT.jar under org/apache/maven/enforcer/enforcer-rules/3.0.0-M4-SNAPSHOT/enforcer-rules-3.0.0-M4-SNAPSHOT.jar
[withMaven] artifactsPublisher - Archive artifact linux-jdk7-m3.2.x_build/enforcer-rules/target/enforcer-rules-3.0.0-M4-SNAPSHOT-tests.jar under org/apache/maven/enforcer/enforcer-rules/3.0.0-M4-SNAPSHOT/enforcer-rules-3.0.0-M4-SNAPSHOT-tests.jar
[withMaven] artifactsPublisher - Archive artifact linux-jdk7-m3.2.x_build/maven-enforcer-plugin/pom.xml under org/apache/maven/plugins/maven-enforcer-plugin/3.0.0-M4-SNAPSHOT/maven-enforcer-plugin-3.0.0-M4-SNAPSHOT.pom
[withMaven] artifactsPublisher - Archive artifact linux-jdk7-m3.2.x_build/maven-enforcer-plugin/target/maven-enforcer-plugin-3.0.0-M4-SNAPSHOT.jar under org/apache/maven/plugins/maven-enforcer-plugin/3.0.0-M4-SNAPSHOT/maven-enforcer-plugin-3.0.0-M4-SNAPSHOT.jar
[withMaven] junitPublisher - Archive test results for Maven artifact org.apache.maven.enforcer:enforcer-api:jar:3.0.0-M4-SNAPSHOT generated by maven-surefire-plugin:test (default-test): linux-jdk7-m3.2.x_build/enforcer-api/target/surefire-reports/*.xml
[withMaven] junitPublisher - Archive test results for Maven artifact org.apache.maven.enforcer:enforcer-rules:jar:3.0.0-M4-SNAPSHOT generated by maven-surefire-plugin:test (default-test): linux-jdk7-m3.2.x_build/enforcer-rules/target/surefire-reports/*.xml
[withMaven] junitPublisher - Archive test results for Maven artifact org.apache.maven.plugins:maven-enforcer-plugin:maven-plugin:3.0.0-M4-SNAPSHOT generated by maven-surefire-plugin:test (default-test): linux-jdk7-m3.2.x_build/maven-enforcer-plugin/target/surefire-reports/*.xml
Recording test results
[withMaven] Publishers: Generated Artifacts Publisher: 8136 ms, Junit Publisher: 34300 ms, Open Task Scanner Publisher: 3088 ms, Dependencies Fingerprint Publisher: 2058 ms, Invoker Publisher: 145666 ms, Pipeline Graph Publisher: 1 ms
[Pipeline] // withMaven
[Pipeline] cleanWs
[withMaven] openTasksPublisher - Scan Tasks for Maven artifact org.apache.maven.enforcer:enforcer-api:jar:3.0.0-M4-SNAPSHOT in source directory linux-jdk7-m3.6.x_build/enforcer-api/src/main/java
[withMaven] openTasksPublisher - Scan Tasks for Maven artifact org.apache.maven.enforcer:enforcer-rules:jar:3.0.0-M4-SNAPSHOT in source directory linux-jdk7-m3.6.x_build/enforcer-rules/src/main/java
[WS-CLEANUP] Deleting project workspace...
[WS-CLEANUP] Deferred wipeout is used...
[withMaven] openTasksPublisher - Scan Tasks for Maven artifact org.apache.maven.plugins:maven-enforcer-plugin:maven-plugin:3.0.0-M4-SNAPSHOT in source directory linux-jdk7-m3.6.x_build/maven-enforcer-plugin/src/main/java
[WS-CLEANUP] done
[Pipeline] }
[Pipeline] // stage
[Pipeline] }
[Pipeline] // ws
[TASKS] Scanning folder '/home/jenkins/workspace/_maven-box_maven-enforcer_master@2' for files matching the pattern 'linux-jdk7-m3.6.x_build/enforcer-api/src/main/java/**/*,linux-jdk7-m3.6.x_build/enforcer-rules/src/main/java/**/*,linux-jdk7-m3.6.x_build/maven-enforcer-plugin/src/main/java/**/*' - excludes: null
[TASKS] Found 52 files to scan for tasks
[TASKS] Found 4 open tasks.
Skipping warnings blame since pipelines do not have an SCM link.%n
[Pipeline] }
[Pipeline] // node
[Pipeline] }
[withMaven] invokerPublisher - Archive invoker results for Maven artifact MavenArtifact{org.apache.maven.plugins:maven-enforcer-plugin:maven-plugin:3.0.0-M4-SNAPSHOT(version: 3.0.0-M4-SNAPSHOT, snapshot:false) } generated by PluginInvocation{org.apache.maven.plugins:maven-invoker-plugin:3.2.1@run  integration-test}: linux-jdk7-m3.6.x_build/maven-enforcer-plugin/target/invoker-reports/*.xml
[withMaven] Publishers: Generated Artifacts Publisher: 7138 ms, Junit Publisher: 18531 ms, Open Task Scanner Publisher: 2108 ms, Dependencies Fingerprint Publisher: 1030 ms, Invoker Publisher: 133915 ms, Pipeline Graph Publisher: 1 ms
[Pipeline] // withMaven
[Pipeline] cleanWs
[WS-CLEANUP] Deleting project workspace...
[WS-CLEANUP] Deferred wipeout is used...
[WS-CLEANUP] done
[Pipeline] }
[Pipeline] // stage
[Pipeline] }
[Pipeline] // ws
[Pipeline] }
[Pipeline] // node
[Pipeline] }
[withMaven] Publishers: Generated Artifacts Publisher: 7515 ms, Junit Publisher: 44641 ms, Open Task Scanner Publisher: 3001 ms, Dependencies Fingerprint Publisher: 1742 ms, Invoker Publisher: 153399 ms, Pipeline Graph Publisher: 1 ms
[withMaven] openTasksPublisher - Scan Tasks for Maven artifact org.apache.maven.enforcer:enforcer-api:jar:3.0.0-M4-SNAPSHOT in source directory linux-jdk7-m3.2.x_build/enforcer-api/src/main/java
[Pipeline] // withMaven
[Pipeline] cleanWs
[withMaven] openTasksPublisher - Scan Tasks for Maven artifact org.apache.maven.enforcer:enforcer-rules:jar:3.0.0-M4-SNAPSHOT in source directory linux-jdk7-m3.2.x_build/enforcer-rules/src/main/java
[withMaven] openTasksPublisher - Scan Tasks for Maven artifact org.apache.maven.plugins:maven-enforcer-plugin:maven-plugin:3.0.0-M4-SNAPSHOT in source directory linux-jdk7-m3.2.x_build/maven-enforcer-plugin/src/main/java
[WS-CLEANUP] Deleting project workspace...
[WS-CLEANUP] Deferred wipeout is used...
[WS-CLEANUP] done
[Pipeline] }
[Pipeline] // stage
[Pipeline] }
[Pipeline] // ws
[Pipeline] }
[Pipeline] // node
[Pipeline] }
[TASKS] Scanning folder '/home/jenkins/h49-shared/712657a4/workspace/_maven-box_maven-enforcer_master@2' for files matching the pattern 'linux-jdk7-m3.2.x_build/enforcer-api/src/main/java/**/*,linux-jdk7-m3.2.x_build/enforcer-rules/src/main/java/**/*,linux-jdk7-m3.2.x_build/maven-enforcer-plugin/src/main/java/**/*' - excludes: null
[TASKS] Found 52 files to scan for tasks
[TASKS] Found 4 open tasks.
Skipping warnings blame since pipelines do not have an SCM link.%n
[withMaven] invokerPublisher - Archive invoker results for Maven artifact MavenArtifact{org.apache.maven.plugins:maven-enforcer-plugin:maven-plugin:3.0.0-M4-SNAPSHOT(version: 3.0.0-M4-SNAPSHOT, snapshot:false) } generated by PluginInvocation{org.apache.maven.plugins:maven-invoker-plugin:3.2.1@run  integration-test}: linux-jdk7-m3.2.x_build/maven-enforcer-plugin/target/invoker-reports/*.xml
[withMaven] Publishers: Generated Artifacts Publisher: 8058 ms, Junit Publisher: 64209 ms, Open Task Scanner Publisher: 3403 ms, Dependencies Fingerprint Publisher: 2103 ms, Invoker Publisher: 164689 ms, Pipeline Graph Publisher: 1 ms
[Pipeline] // withMaven
[Pipeline] cleanWs
[WS-CLEANUP] Deleting project workspace...
[WS-CLEANUP] Deferred wipeout is used...
[WS-CLEANUP] done
[Pipeline] }
[Pipeline] // stage
[Pipeline] }
[Pipeline] // ws
[Pipeline] }
[Pipeline] // node
[Pipeline] }
[withMaven] Publishers: Generated Artifacts Publisher: 8006 ms, Junit Publisher: 99329 ms, Open Task Scanner Publisher: 3174 ms, Dependencies Fingerprint Publisher: 2115 ms, Invoker Publisher: 162665 ms, Pipeline Graph Publisher: 1 ms
[Pipeline] // withMaven
[Pipeline] cleanWs
[WS-CLEANUP] Deleting project workspace...
[WS-CLEANUP] Deferred wipeout is used...
[WS-CLEANUP] done
[Pipeline] }
[Pipeline] // stage
[Pipeline] }
[Pipeline] // ws
[Pipeline] }
[Pipeline] // node
[Pipeline] }
[withMaven] Publishers: Generated Artifacts Publisher: 8083 ms, Junit Publisher: 33511 ms, Open Task Scanner Publisher: 3099 ms, Dependencies Fingerprint Publisher: 2040 ms, Invoker Publisher: 130878 ms, Pipeline Graph Publisher: 1 ms
[Pipeline] // withMaven
[Pipeline] cleanWs
[WS-CLEANUP] Deleting project workspace...
[WS-CLEANUP] Deferred wipeout is used...
[WS-CLEANUP] done
[Pipeline] }
[Pipeline] // stage
[Pipeline] }
[Pipeline] // ws
[Pipeline] }
[Pipeline] // node
[Pipeline] }
[withMaven] Publishers: Generated Artifacts Publisher: 19502 ms, Junit Publisher: 78052 ms, Open Task Scanner Publisher: 8284 ms, Dependencies Fingerprint Publisher: 1079 ms, Invoker Publisher: 140262 ms, Pipeline Graph Publisher: 1 ms
[Pipeline] // withMaven
[Pipeline] cleanWs
[WS-CLEANUP] Deleting project workspace...
[WS-CLEANUP] Deferred wipeout is used...
[WS-CLEANUP] done
[Pipeline] }
[Pipeline] // stage
[Pipeline] }
[Pipeline] // ws
[Pipeline] }
[Pipeline] // node
[Pipeline] }
[Pipeline] // parallel
[Pipeline] stage
[Pipeline] { (Notifications)
[Pipeline] echo
Build result: FAILURE
[Pipeline] jiraIssueSelector
[Pipeline] jiraComment
[Pipeline] echo
The authors of changes [slachiewicz].
[Pipeline] echo
Sending email ...
[Pipeline] emailext
Reply | Threaded
Open this post in threaded view
|

Build failed in Jenkins: Maven » Maven TLP » maven-enforcer » master #6

Apache Jenkins Server-2
See https://ci-builds.apache.org/job/Maven/job/maven-box/job/maven-enforcer/job/master/6/

Changes:

* MENFORCER-301 check dependencyManagement
* MENFORCER-301 test

All tests passed

Build log:
[...truncated 440940 lines...]
[DEBUG] Skipping update check for org.apache.maven.enforcer.enforcer-rules.3.0.0-M4-SNAPSHOT (/home/jenkins/workspace/.maven_repositories/0/org/apache/maven/enforcer/enforcer-rules/3/0/0-M4-SNAPSHOT/maven-metadata-Nexus.xml) from disabled repository Nexus (http://repository.apache.org/snapshots)
[DEBUG] Determining update check for org.apache.maven.enforcer.enforcer-rules.3.0.0-M4-SNAPSHOT (/home/jenkins/workspace/.maven_repositories/0/org/apache/maven/enforcer/enforcer-rules/3/0/0-M4-SNAPSHOT/maven-metadata-central.xml) from central (https://repo.maven.apache.org/maven2)
[DEBUG] Searching for central.maven-metadata-central.xml.lastUpdated in resolution tracking file.
[DEBUG] Reading resolution-state from: /home/jenkins/workspace/.maven_repositories/0/org/apache/maven/enforcer/enforcer-rules/3/0/0-M4-SNAPSHOT/resolver-status.properties
[DEBUG] RESPONSE /org/apache/maven/enforcer/enforcer-rules/3.0.0-M4-SNAPSHOT/maven-metadata.xml  200
[DEBUG] REQUEST /org/apache/maven/its/enforcer/module1/1.0-SNAPSHOT/maven-metadata.xml on org.mortbay.jetty.HttpConnection@3625ab4b
[DEBUG] sessionManager=org.mortbay.jetty.servlet.HashSessionManager@5a54e3d7
[DEBUG] session=null
[DEBUG] servlet=org.codehaus.mojo.mrm.servlet.FileSystemServlet-1310457201
[DEBUG] chain=null
[DEBUG] servlet holder=org.codehaus.mojo.mrm.servlet.FileSystemServlet-1310457201
[DEBUG] Determining update check for snapshot org.apache.maven.its.enforcer:module1:1.0-SNAPSHOT (/home/jenkins/workspace/.maven_repositories/0/org/apache/maven/its/enforcer/module1/1.0-SNAPSHOT/maven-metadata-Nexus.xml) from Nexus (http://repository.apache.org/snapshots)
[DEBUG] Searching for Nexus.maven-metadata-Nexus.xml.lastUpdated in resolution tracking file.
[DEBUG] Reading resolution-state from: /home/jenkins/workspace/.maven_repositories/0/org/apache/maven/its/enforcer/module1/1.0-SNAPSHOT/resolver-status.properties
[DEBUG] Skipping update check for snapshot org.apache.maven.its.enforcer:module1:1.0-SNAPSHOT (/home/jenkins/workspace/.maven_repositories/0/org/apache/maven/its/enforcer/module1/1.0-SNAPSHOT/maven-metadata-central.xml) from disabled repository central (https://repo.maven.apache.org/maven2)
[DEBUG] Determining update check for snapshot org.apache.maven.its.enforcer:module1:1.0-SNAPSHOT (/home/jenkins/workspace/.maven_repositories/0/org/apache/maven/its/enforcer/module1/1.0-SNAPSHOT/maven-metadata-Nexus.xml) from Nexus (http://repository.apache.org/snapshots)
[DEBUG] Searching for Nexus.maven-metadata-Nexus.xml.lastUpdated in resolution tracking file.
[DEBUG] Reading resolution-state from: /home/jenkins/workspace/.maven_repositories/0/org/apache/maven/its/enforcer/module1/1.0-SNAPSHOT/resolver-status.properties
[DEBUG] Skipping update check for snapshot org.apache.maven.its.enforcer:module1:1.0-SNAPSHOT (/home/jenkins/workspace/.maven_repositories/0/org/apache/maven/its/enforcer/module1/1.0-SNAPSHOT/maven-metadata-central.xml) from disabled repository central (https://repo.maven.apache.org/maven2)
[DEBUG] Skipping update check for artifact org.apache.maven.its.enforcer.module1:1.0-SNAPSHOT (/home/jenkins/workspace/.maven_repositories/0/org/apache/maven/its/enforcer/module1/1.0-SNAPSHOT/maven-metadata-Nexus.xml) from disabled repository Nexus (http://repository.apache.org/snapshots)
[DEBUG] Determining update check for artifact org.apache.maven.its.enforcer.module1:1.0-SNAPSHOT (/home/jenkins/workspace/.maven_repositories/0/org/apache/maven/its/enforcer/module1/1.0-SNAPSHOT/maven-metadata-central.xml) from central (https://repo.maven.apache.org/maven2)
[DEBUG] Searching for central.maven-metadata-central.xml.lastUpdated in resolution tracking file.
[DEBUG] Reading resolution-state from: /home/jenkins/workspace/.maven_repositories/0/org/apache/maven/its/enforcer/module1/1.0-SNAPSHOT/resolver-status.properties
[DEBUG] Skipping update check for artifact org.apache.maven.its.enforcer.module1:1.0-SNAPSHOT (/home/jenkins/workspace/.maven_repositories/0/org/apache/maven/its/enforcer/module1/1.0-SNAPSHOT/maven-metadata-Nexus.xml) from disabled repository Nexus (http://repository.apache.org/snapshots)
[DEBUG] Determining update check for artifact org.apache.maven.its.enforcer.module1:1.0-SNAPSHOT (/home/jenkins/workspace/.maven_repositories/0/org/apache/maven/its/enforcer/module1/1.0-SNAPSHOT/maven-metadata-central.xml) from central (https://repo.maven.apache.org/maven2)
[DEBUG] Searching for central.maven-metadata-central.xml.lastUpdated in resolution tracking file.
[DEBUG] Reading resolution-state from: /home/jenkins/workspace/.maven_repositories/0/org/apache/maven/its/enforcer/module1/1.0-SNAPSHOT/resolver-status.properties
[DEBUG] Skipping update check for org.apache.maven.its.enforcer.module1.1.0-SNAPSHOT (/home/jenkins/workspace/.maven_repositories/0/org/apache/maven/its/enforcer/module1/1/0-SNAPSHOT/maven-metadata-Nexus.xml) from disabled repository Nexus (http://repository.apache.org/snapshots)
[DEBUG] Determining update check for org.apache.maven.its.enforcer.module1.1.0-SNAPSHOT (/home/jenkins/workspace/.maven_repositories/0/org/apache/maven/its/enforcer/module1/1/0-SNAPSHOT/maven-metadata-central.xml) from central (https://repo.maven.apache.org/maven2)
[DEBUG] Searching for central.maven-metadata-central.xml.lastUpdated in resolution tracking file.
[DEBUG] Reading resolution-state from: /home/jenkins/workspace/.maven_repositories/0/org/apache/maven/its/enforcer/module1/1/0-SNAPSHOT/resolver-status.properties
[DEBUG] Determining update check for snapshot org.apache.maven.its.enforcer:module1:1.0-SNAPSHOT (/home/jenkins/workspace/.maven_repositories/0/org/apache/maven/its/enforcer/module1/1.0-SNAPSHOT/maven-metadata-Nexus.xml) from Nexus (http://repository.apache.org/snapshots)
[DEBUG] Searching for Nexus.maven-metadata-Nexus.xml.lastUpdated in resolution tracking file.
[DEBUG] Reading resolution-state from: /home/jenkins/workspace/.maven_repositories/0/org/apache/maven/its/enforcer/module1/1.0-SNAPSHOT/resolver-status.properties
[DEBUG] Skipping update check for snapshot org.apache.maven.its.enforcer:module1:1.0-SNAPSHOT (/home/jenkins/workspace/.maven_repositories/0/org/apache/maven/its/enforcer/module1/1.0-SNAPSHOT/maven-metadata-central.xml) from disabled repository central (https://repo.maven.apache.org/maven2)
[DEBUG] Determining update check for snapshot org.apache.maven.its.enforcer:module1:1.0-SNAPSHOT (/home/jenkins/workspace/.maven_repositories/0/org/apache/maven/its/enforcer/module1/1.0-SNAPSHOT/maven-metadata-Nexus.xml) from Nexus (http://repository.apache.org/snapshots)
[DEBUG] Searching for Nexus.maven-metadata-Nexus.xml.lastUpdated in resolution tracking file.
[DEBUG] Reading resolution-state from: /home/jenkins/workspace/.maven_repositories/0/org/apache/maven/its/enforcer/module1/1.0-SNAPSHOT/resolver-status.properties
[DEBUG] Skipping update check for snapshot org.apache.maven.its.enforcer:module1:1.0-SNAPSHOT (/home/jenkins/workspace/.maven_repositories/0/org/apache/maven/its/enforcer/module1/1.0-SNAPSHOT/maven-metadata-central.xml) from disabled repository central (https://repo.maven.apache.org/maven2)
[DEBUG] Skipping update check for artifact org.apache.maven.its.enforcer.module1:1.0-SNAPSHOT (/home/jenkins/workspace/.maven_repositories/0/org/apache/maven/its/enforcer/module1/1.0-SNAPSHOT/maven-metadata-Nexus.xml) from disabled repository Nexus (http://repository.apache.org/snapshots)
[DEBUG] Determining update check for artifact org.apache.maven.its.enforcer.module1:1.0-SNAPSHOT (/home/jenkins/workspace/.maven_repositories/0/org/apache/maven/its/enforcer/module1/1.0-SNAPSHOT/maven-metadata-central.xml) from central (https://repo.maven.apache.org/maven2)
[DEBUG] Searching for central.maven-metadata-central.xml.lastUpdated in resolution tracking file.
[DEBUG] Reading resolution-state from: /home/jenkins/workspace/.maven_repositories/0/org/apache/maven/its/enforcer/module1/1.0-SNAPSHOT/resolver-status.properties
[DEBUG] Skipping update check for artifact org.apache.maven.its.enforcer.module1:1.0-SNAPSHOT (/home/jenkins/workspace/.maven_repositories/0/org/apache/maven/its/enforcer/module1/1.0-SNAPSHOT/maven-metadata-Nexus.xml) from disabled repository Nexus (http://repository.apache.org/snapshots)
[DEBUG] Determining update check for artifact org.apache.maven.its.enforcer.module1:1.0-SNAPSHOT (/home/jenkins/workspace/.maven_repositories/0/org/apache/maven/its/enforcer/module1/1.0-SNAPSHOT/maven-metadata-central.xml) from central (https://repo.maven.apache.org/maven2)
[DEBUG] Searching for central.maven-metadata-central.xml.lastUpdated in resolution tracking file.
[DEBUG] Reading resolution-state from: /home/jenkins/workspace/.maven_repositories/0/org/apache/maven/its/enforcer/module1/1.0-SNAPSHOT/resolver-status.properties
[DEBUG] Skipping update check for org.apache.maven.its.enforcer.module1.1.0-SNAPSHOT (/home/jenkins/workspace/.maven_repositories/0/org/apache/maven/its/enforcer/module1/1/0-SNAPSHOT/maven-metadata-Nexus.xml) from disabled repository Nexus (http://repository.apache.org/snapshots)
[DEBUG] Determining update check for org.apache.maven.its.enforcer.module1.1.0-SNAPSHOT (/home/jenkins/workspace/.maven_repositories/0/org/apache/maven/its/enforcer/module1/1/0-SNAPSHOT/maven-metadata-central.xml) from central (https://repo.maven.apache.org/maven2)
[DEBUG] Searching for central.maven-metadata-central.xml.lastUpdated in resolution tracking file.
[DEBUG] Reading resolution-state from: /home/jenkins/workspace/.maven_repositories/0/org/apache/maven/its/enforcer/module1/1/0-SNAPSHOT/resolver-status.properties
[DEBUG] RESPONSE /org/apache/maven/its/enforcer/module1/1.0-SNAPSHOT/maven-metadata.xml  404
[DEBUG] EOF
[INFO] run post-build script verify.groovy
[DEBUG] Running script with GroovyScriptInterpreter: /home/jenkins/workspace/_maven-box_maven-enforcer_master@2/linux-jdk7-m3.6.x_build/maven-enforcer-plugin/target/it/ban-distribution-management-multi-module-except-site/verify.groovy
[INFO]           ban-distribution-management-multi-module-except-site/pom.xml SUCCESS (6.6 s)
[INFO] -------------------------------------------------
[INFO] Build Summary:
[INFO]   Passed: 82, Failed: 0, Errors: 0, Skipped: 0
[INFO] -------------------------------------------------
[INFO]
[INFO] --- mrm-maven-plugin:1.0.0:stop (default) @ maven-enforcer-plugin ---
[DEBUG] Configuring mojo org.codehaus.mojo:mrm-maven-plugin:1.0.0:stop from plugin realm ClassRealm[plugin>org.codehaus.mojo:mrm-maven-plugin:1.0.0, parent: sun.misc.Launcher$AppClassLoader@1a1a7aa4]
[DEBUG] Configuring mojo 'org.codehaus.mojo:mrm-maven-plugin:1.0.0:stop' with basic configurator -->
[DEBUG]   (f) localRepository =       id: local
      url: file:///home/jenkins/workspace/.maven_repositories/0/
   layout: default
snapshots: [enabled => true, update => always]
 releases: [enabled => true, update => always]

[DEBUG]   (f) mojoExecution = org.codehaus.mojo:mrm-maven-plugin:1.0.0:stop {execution: default}
[DEBUG]   (f) pluginDescriptor = Component Descriptor: role: 'org.apache.maven.plugin.Mojo', implementation: 'org.codehaus.mojo.mrm.plugin.HelpMojo', role hint: 'org.codehaus.mojo:mrm-maven-plugin:1.0.0:help'
role: 'org.apache.maven.plugin.Mojo', implementation: 'org.codehaus.mojo.mrm.plugin.RunMojo', role hint: 'org.codehaus.mojo:mrm-maven-plugin:1.0.0:run'
role: 'org.apache.maven.plugin.Mojo', implementation: 'org.codehaus.mojo.mrm.plugin.StartMojo', role hint: 'org.codehaus.mojo:mrm-maven-plugin:1.0.0:start'
role: 'org.apache.maven.plugin.Mojo', implementation: 'org.codehaus.mojo.mrm.plugin.StopMojo', role hint: 'org.codehaus.mojo:mrm-maven-plugin:1.0.0:stop'
---
[DEBUG]   (f) project = MavenProject: org.apache.maven.plugins:maven-enforcer-plugin:3.0.0-M4-SNAPSHOT @ /home/jenkins/workspace/_maven-box_maven-enforcer_master@2/linux-jdk7-m3.6.x_build/maven-enforcer-plugin/pom.xml
[DEBUG]   (f) remoteArtifactRepositories = [      id: Nexus
      url: http://repository.apache.org/snapshots
   layout: default
snapshots: [enabled => true, update => daily]
 releases: [enabled => false, update => daily]
,       id: central
      url: https://repo.maven.apache.org/maven2
   layout: default
snapshots: [enabled => false, update => daily]
 releases: [enabled => true, update => daily]
]
[DEBUG]   (f) remotePluginRepositories = [      id: Nexus
      url: http://repository.apache.org/snapshots
   layout: default
snapshots: [enabled => true, update => daily]
 releases: [enabled => false, update => daily]
,       id: central
      url: https://repo.maven.apache.org/maven2
   layout: default
snapshots: [enabled => false, update => daily]
 releases: [enabled => true, update => never]
]
[DEBUG]   (f) session = org.apache.maven.execution.MavenSession@3018e693
[DEBUG]   (f) skip = false
[DEBUG] -- end configuration --
[INFO] Stopping Mock Repository Manager on http://localhost:33823
[DEBUG] stopped SocketConnector@0.0.0.0:0
[DEBUG] stopping Server@6a620b2e
[DEBUG] stopping org.mortbay.jetty.servlet.Context@7d14e65a{/,null}
[DEBUG] stopping SessionHandler@671f5edd
[DEBUG] stopping ServletHandler@3c8d340f
[DEBUG] stopped org.codehaus.mojo.mrm.servlet.FileSystemServlet-1310457201
[DEBUG] stopped ServletHandler@3c8d340f
[DEBUG] stopped org.mortbay.jetty.servlet.HashSessionManager@5a54e3d7
[DEBUG] stopped SessionHandler@671f5edd
[DEBUG] stopping ErrorHandler@53905e80
[DEBUG] stopped ErrorHandler@53905e80
[DEBUG] stopped org.mortbay.jetty.servlet.Context@7d14e65a{/,null}
[DEBUG] stopped org.mortbay.jetty.servlet.HashSessionIdManager@4773793
[DEBUG] stopped org.mortbay.thread.BoundedThreadPool@76563ed0
[DEBUG] stopped Server@6a620b2e
[INFO] Mock Repository Manager http://localhost:33823 is stopped.
[INFO]
[INFO] --- maven-checkstyle-plugin:3.0.0:check (checkstyle-check) @ maven-enforcer-plugin ---
[DEBUG] Configuring mojo org.apache.maven.plugins:maven-checkstyle-plugin:3.0.0:check from plugin realm ClassRealm[plugin>org.apache.maven.plugins:maven-checkstyle-plugin:3.0.0, parent: sun.misc.Launcher$AppClassLoader@1a1a7aa4]
[DEBUG] Configuring mojo 'org.apache.maven.plugins:maven-checkstyle-plugin:3.0.0:check' with basic configurator -->
[DEBUG]   (f) cacheFile = /home/jenkins/workspace/_maven-box_maven-enforcer_master@2/linux-jdk7-m3.6.x_build/maven-enforcer-plugin/target/checkstyle-cachefile
[DEBUG]   (f) configLocation = config/maven_checks.xml
[DEBUG]   (f) consoleOutput = false
[DEBUG]   (f) encoding = UTF-8
[DEBUG]   (f) failOnViolation = true
[DEBUG]   (f) failsOnError = false
[DEBUG]   (f) headerLocation = config/maven-header.txt
[DEBUG]   (f) includeResources = true
[DEBUG]   (f) includeTestResources = true
[DEBUG]   (f) includeTestSourceDirectory = false
[DEBUG]   (f) includes = **\/*.java
[DEBUG]   (f) logViolationsToConsole = true
[DEBUG]   (f) maxAllowedViolations = 0
[DEBUG]   (f) omitIgnoredModules = false
[DEBUG]   (f) outputFile = /home/jenkins/workspace/_maven-box_maven-enforcer_master@2/linux-jdk7-m3.6.x_build/maven-enforcer-plugin/target/checkstyle-result.xml
[DEBUG]   (f) outputFileFormat = xml
[DEBUG]   (f) plugin = Component Descriptor: role: 'org.apache.maven.plugin.Mojo', implementation: 'org.apache.maven.plugins.checkstyle.CheckstyleViolationCheckMojo', role hint: 'org.apache.maven.plugins:maven-checkstyle-plugin:3.0.0:check'
role: 'org.apache.maven.plugin.Mojo', implementation: 'org.apache.maven.plugins.checkstyle.CheckstyleReport', role hint: 'org.apache.maven.plugins:maven-checkstyle-plugin:3.0.0:checkstyle'
role: 'org.apache.maven.plugin.Mojo', implementation: 'org.apache.maven.plugins.checkstyle.CheckstyleAggregateReport', role hint: 'org.apache.maven.plugins:maven-checkstyle-plugin:3.0.0:checkstyle-aggregate'
role: 'org.apache.maven.plugin.Mojo', implementation: 'org.apache.maven.plugins.checkstyle.HelpMojo', role hint: 'org.apache.maven.plugins:maven-checkstyle-plugin:3.0.0:help'
---
[DEBUG]   (f) project = MavenProject: org.apache.maven.plugins:maven-enforcer-plugin:3.0.0-M4-SNAPSHOT @ /home/jenkins/workspace/_maven-box_maven-enforcer_master@2/linux-jdk7-m3.6.x_build/maven-enforcer-plugin/pom.xml
[DEBUG]   (f) resourceIncludes = **/*.properties
[DEBUG]   (f) resources = [Resource {targetPath: null, filtering: false, FileSet {directory: /home/jenkins/workspace/_maven-box_maven-enforcer_master@2/linux-jdk7-m3.6.x_build/maven-enforcer-plugin/src/main/resources, PatternSet [includes: {}, excludes: {}]}}, Resource {targetPath: null, filtering: false, FileSet {directory: /home/jenkins/workspace/_maven-box_maven-enforcer_master@2/linux-jdk7-m3.6.x_build/maven-enforcer-plugin/target/maven-shared-archive-resources, PatternSet [includes: {}, excludes: {}]}}]
[DEBUG]   (f) rulesFiles = /home/jenkins/workspace/_maven-box_maven-enforcer_master@2/linux-jdk7-m3.6.x_build/maven-enforcer-plugin/target/checkstyle-rules.xml
[DEBUG]   (f) skip = false
[DEBUG]   (f) skipExec = false
[DEBUG]   (f) sourceDirectories = [src/main/java]
[DEBUG]   (f) suppressionsFileExpression = checkstyle.suppressions.file
[DEBUG]   (f) testResources = [Resource {targetPath: null, filtering: false, FileSet {directory: /home/jenkins/workspace/_maven-box_maven-enforcer_master@2/linux-jdk7-m3.6.x_build/maven-enforcer-plugin/src/test/resources, PatternSet [includes: {}, excludes: {}]}}, Resource {targetPath: null, filtering: false, FileSet {directory: /home/jenkins/workspace/_maven-box_maven-enforcer_master@2/linux-jdk7-m3.6.x_build/maven-enforcer-plugin/target/maven-shared-archive-resources, PatternSet [includes: {}, excludes: {}]}}]
[DEBUG]   (f) testSourceDirectories = [src/test/java]
[DEBUG]   (f) violationIgnore = RedundantThrows,NewlineAtEndOfFile,ParameterNumber,MethodLength,FileLength
[DEBUG]   (f) violationSeverity = error
[DEBUG] -- end configuration --
[DEBUG] executeCheckstyle start headerLocation : config/maven-header.txt
[DEBUG] Added 3 source files found in '/home/jenkins/workspace/_maven-box_maven-enforcer_master@2/linux-jdk7-m3.6.x_build/maven-enforcer-plugin/src/main/java'.
[DEBUG] Added 0 resource files found in '/home/jenkins/workspace/_maven-box_maven-enforcer_master@2/linux-jdk7-m3.6.x_build/maven-enforcer-plugin/src/main/resources'.
[DEBUG] Added 0 resource files found in '/home/jenkins/workspace/_maven-box_maven-enforcer_master@2/linux-jdk7-m3.6.x_build/maven-enforcer-plugin/target/maven-shared-archive-resources'.
[DEBUG] The resources directory '/home/jenkins/workspace/_maven-box_maven-enforcer_master@2/linux-jdk7-m3.6.x_build/maven-enforcer-plugin/src/test/resources' does not exist or is not a directory.
[DEBUG] Added 0 resource files found in '/home/jenkins/workspace/_maven-box_maven-enforcer_master@2/linux-jdk7-m3.6.x_build/maven-enforcer-plugin/target/maven-shared-archive-resources'.
[DEBUG] Added 3 files to process.
[DEBUG] Adding the outputDirectory file:/home/jenkins/workspace/_maven-box_maven-enforcer_master@2/linux-jdk7-m3.6.x_build/maven-enforcer-plugin/target/classes/ to the Checkstyle class path
[DEBUG] request.getConfigLocation() config/maven_checks.xml
[DEBUG] The resource 'config/maven_checks.xml' was not found with resourceLoader org.codehaus.plexus.resource.loader.JarResourceLoader.
[DEBUG] The resource 'config/maven_checks.xml' was found as jar:file:/home/jenkins/workspace/.maven_repositories/0/org/apache/maven/shared/maven-shared-resources/2/maven-shared-resources-2.jar!/config/maven_checks.xml.
[DEBUG] headerLocation config/maven-header.txt
[DEBUG] JarResourceLoader : trying to load "jar:file:/home/jenkins/workspace/.maven_repositories/0/org/apache/maven/shared/maven-shared-resources/2/maven-shared-resources-2.jar"
[DEBUG] The resource 'config/maven-header.txt' was found as jar:file:/home/jenkins/workspace/.maven_repositories/0/org/apache/maven/shared/maven-shared-resources/2/maven-shared-resources-2.jar!/config/maven-header.txt.
[DEBUG] Added '/home/jenkins/workspace/_maven-box_maven-enforcer_master@2/linux-jdk7-m3.6.x_build/maven-enforcer-plugin/src/main/resources' as a source directory.
[DEBUG] Added '/home/jenkins/workspace/_maven-box_maven-enforcer_master@2/linux-jdk7-m3.6.x_build/maven-enforcer-plugin/target/maven-shared-archive-resources' as a source directory.
[INFO] ------------------------------------------------------------------------
[INFO] Reactor Summary for Apache Maven Enforcer 3.0.0-M4-SNAPSHOT:
[INFO]
[INFO] Apache Maven Enforcer .............................. SUCCESS [  9.616 s]
[INFO] Apache Maven Enforcer API .......................... SUCCESS [  5.505 s]
[INFO] Apache Maven Enforcer Built-In Rules ............... SUCCESS [ 21.306 s]
[INFO] Apache Maven Enforcer Plugin ....................... SUCCESS [09:35 min]
[INFO] ------------------------------------------------------------------------
[INFO] BUILD SUCCESS
[INFO] ------------------------------------------------------------------------
[INFO] Total time:  10:12 min
[INFO] Finished at: 2020-07-27T14:54:13Z
[INFO] ------------------------------------------------------------------------
[INFO] [jenkins-event-spy] Generated /home/jenkins/workspace/_maven-box_maven-enforcer_master@2@tmp/withMaven55bbe6e6/maven-spy-20200727-144359-9267646437076040666278.log
[Pipeline] }
[Pipeline] // dir
[Pipeline] }
[withMaven] artifactsPublisher - Archive artifact linux-jdk7-m3.6.x_build/pom.xml under org/apache/maven/enforcer/enforcer/3.0.0-M4-SNAPSHOT/enforcer-3.0.0-M4-SNAPSHOT.pom
[withMaven] artifactsPublisher - Archive artifact linux-jdk7-m3.6.x_build/target/enforcer-3.0.0-M4-SNAPSHOT-site.xml under org/apache/maven/enforcer/enforcer/3.0.0-M4-SNAPSHOT/enforcer-3.0.0-M4-SNAPSHOT-site.xml
[withMaven] artifactsPublisher - Archive artifact linux-jdk7-m3.6.x_build/enforcer-api/pom.xml under org/apache/maven/enforcer/enforcer-api/3.0.0-M4-SNAPSHOT/enforcer-api-3.0.0-M4-SNAPSHOT.pom
[withMaven] artifactsPublisher - Archive artifact linux-jdk7-m3.6.x_build/enforcer-api/target/enforcer-api-3.0.0-M4-SNAPSHOT.jar under org/apache/maven/enforcer/enforcer-api/3.0.0-M4-SNAPSHOT/enforcer-api-3.0.0-M4-SNAPSHOT.jar
[withMaven] artifactsPublisher - Archive artifact linux-jdk7-m3.6.x_build/enforcer-rules/pom.xml under org/apache/maven/enforcer/enforcer-rules/3.0.0-M4-SNAPSHOT/enforcer-rules-3.0.0-M4-SNAPSHOT.pom
[withMaven] artifactsPublisher - Archive artifact linux-jdk7-m3.6.x_build/enforcer-rules/target/enforcer-rules-3.0.0-M4-SNAPSHOT.jar under org/apache/maven/enforcer/enforcer-rules/3.0.0-M4-SNAPSHOT/enforcer-rules-3.0.0-M4-SNAPSHOT.jar
[withMaven] artifactsPublisher - Archive artifact linux-jdk7-m3.6.x_build/enforcer-rules/target/enforcer-rules-3.0.0-M4-SNAPSHOT-tests.jar under org/apache/maven/enforcer/enforcer-rules/3.0.0-M4-SNAPSHOT/enforcer-rules-3.0.0-M4-SNAPSHOT-tests.jar
[withMaven] artifactsPublisher - Archive artifact linux-jdk7-m3.6.x_build/maven-enforcer-plugin/pom.xml under org/apache/maven/plugins/maven-enforcer-plugin/3.0.0-M4-SNAPSHOT/maven-enforcer-plugin-3.0.0-M4-SNAPSHOT.pom
[withMaven] artifactsPublisher - Archive artifact linux-jdk7-m3.6.x_build/maven-enforcer-plugin/target/maven-enforcer-plugin-3.0.0-M4-SNAPSHOT.jar under org/apache/maven/plugins/maven-enforcer-plugin/3.0.0-M4-SNAPSHOT/maven-enforcer-plugin-3.0.0-M4-SNAPSHOT.jar
[withMaven] junitPublisher - Archive test results for Maven artifact org.apache.maven.enforcer:enforcer-api:jar:3.0.0-M4-SNAPSHOT generated by maven-surefire-plugin:test (default-test): linux-jdk7-m3.6.x_build/enforcer-api/target/surefire-reports/*.xml
[withMaven] junitPublisher - Archive test results for Maven artifact org.apache.maven.enforcer:enforcer-rules:jar:3.0.0-M4-SNAPSHOT generated by maven-surefire-plugin:test (default-test): linux-jdk7-m3.6.x_build/enforcer-rules/target/surefire-reports/*.xml
[withMaven] junitPublisher - Archive test results for Maven artifact org.apache.maven.plugins:maven-enforcer-plugin:maven-plugin:3.0.0-M4-SNAPSHOT generated by maven-surefire-plugin:test (default-test): linux-jdk7-m3.6.x_build/maven-enforcer-plugin/target/surefire-reports/*.xml
Recording test results
[withMaven] Publishers: Generated Artifacts Publisher: 4303 ms, Junit Publisher: 17639 ms, Open Task Scanner Publisher: 2194 ms, Dependencies Fingerprint Publisher: 1057 ms, Invoker Publisher: 152522 ms, Pipeline Graph Publisher: 1 ms
[Pipeline] // withMaven
[withMaven] openTasksPublisher - Scan Tasks for Maven artifact org.apache.maven.enforcer:enforcer-api:jar:3.0.0-M4-SNAPSHOT in source directory linux-jdk7-m3.6.x_build/enforcer-api/src/main/java
[Pipeline] cleanWs
[withMaven] openTasksPublisher - Scan Tasks for Maven artifact org.apache.maven.enforcer:enforcer-rules:jar:3.0.0-M4-SNAPSHOT in source directory linux-jdk7-m3.6.x_build/enforcer-rules/src/main/java
[withMaven] openTasksPublisher - Scan Tasks for Maven artifact org.apache.maven.plugins:maven-enforcer-plugin:maven-plugin:3.0.0-M4-SNAPSHOT in source directory linux-jdk7-m3.6.x_build/maven-enforcer-plugin/src/main/java
[WS-CLEANUP] Deleting project workspace...
[WS-CLEANUP] Deferred wipeout is used...
[TASKS] Scanning folder '/home/jenkins/workspace/_maven-box_maven-enforcer_master@2' for files matching the pattern 'linux-jdk7-m3.6.x_build/enforcer-api/src/main/java/**/*,linux-jdk7-m3.6.x_build/enforcer-rules/src/main/java/**/*,linux-jdk7-m3.6.x_build/maven-enforcer-plugin/src/main/java/**/*' - excludes: null
[TASKS] Found 52 files to scan for tasks
[TASKS] Found 4 open tasks.
Skipping warnings blame since pipelines do not have an SCM link.%n
[WS-CLEANUP] done
[Pipeline] }
[Pipeline] // stage
[Pipeline] }
[Pipeline] // ws
[Pipeline] }
[Pipeline] // node
[Pipeline] }
[withMaven] invokerPublisher - Archive invoker results for Maven artifact MavenArtifact{org.apache.maven.plugins:maven-enforcer-plugin:maven-plugin:3.0.0-M4-SNAPSHOT(version: 3.0.0-M4-SNAPSHOT, snapshot:false) } generated by PluginInvocation{org.apache.maven.plugins:maven-invoker-plugin:3.2.1@run  integration-test}: linux-jdk7-m3.6.x_build/maven-enforcer-plugin/target/invoker-reports/*.xml
[withMaven] Publishers: Generated Artifacts Publisher: 4811 ms, Junit Publisher: 17819 ms, Open Task Scanner Publisher: 2190 ms, Dependencies Fingerprint Publisher: 1067 ms, Invoker Publisher: 145491 ms, Pipeline Graph Publisher: 1 ms
[Pipeline] // withMaven
[Pipeline] cleanWs
[WS-CLEANUP] Deleting project workspace...
[WS-CLEANUP] Deferred wipeout is used...
[WS-CLEANUP] done
[Pipeline] }
[Pipeline] // stage
[Pipeline] }
[Pipeline] // ws
[Pipeline] }
[Pipeline] // node
[Pipeline] }
[Pipeline] // parallel
[Pipeline] stage
[Pipeline] { (Notifications)
[Pipeline] echo
Build result: FAILURE
[Pipeline] jiraIssueSelector
[Pipeline] jiraComment
[Pipeline] echo
The authors of changes [slachiewicz].
[Pipeline] echo
Sending email ...
[Pipeline] emailext
Reply | Threaded
Open this post in threaded view
|

Build succeeded in Jenkins: Maven » Maven TLP » maven-enforcer » master #7

Apache Jenkins Server-2
See https://ci-builds.apache.org/job/Maven/job/maven-box/job/maven-enforcer/job/master/7/

Changes:

* [MENFORCER-353] Consistently format artifacts same as dependency:tree

All tests passed