Build failed in Jenkins: Maven » Maven TLP » maven-doxia » master #29

Previous Topic Next Topic
 
classic Classic list List threaded Threaded
2 messages Options
Reply | Threaded
Open this post in threaded view
|

Build failed in Jenkins: Maven » Maven TLP » maven-doxia » master #29

Apache Jenkins Server-2
See https://ci-builds.apache.org/job/Maven/job/maven-box/job/maven-doxia/job/master/29/

Changes:

* [DOXIA-618]

All tests passed

Build log:
[...truncated 38953 lines...]
[INFO] Downloading from central: https://repo.maven.apache.org/maven2/org/codehaus/plexus/plexus-utils/3.0.15/plexus-utils-3.0.15.jar
[INFO] Downloaded from central: https://repo.maven.apache.org/maven2/commons-codec/commons-codec/1.6/commons-codec-1.6.jar (233 kB at 6.3 MB/s)
[INFO] Downloaded from central: https://repo.maven.apache.org/maven2/org/codehaus/plexus/plexus-utils/3.0.15/plexus-utils-3.0.15.jar (239 kB at 6.0 MB/s)
[INFO] Downloaded from central: https://repo.maven.apache.org/maven2/org/apache/maven/shared/maven-shared-utils/0.4/maven-shared-utils-0.4.jar (155 kB at 3.7 MB/s)
[INFO] Installing F:\jenkins\jenkins-slave\712657a4\workspace\ven_maven-box_maven-doxia_master@2\m\doxia-modules\doxia-module-markdown\..\doxia-module-xhtml\target\doxia-module-xhtml-1.10-SNAPSHOT.jar to F:\jenkins\jenkins-slave\712657a4\workspace\ven_maven-box_maven-doxia_master@2\m\doxia-modules\doxia-module-markdown\target\local-repo\org\apache\maven\doxia\doxia-module-xhtml\1.10-SNAPSHOT\doxia-module-xhtml-1.10-SNAPSHOT.jar
[INFO]
[INFO] --- maven-install-plugin:2.5.2:install-file (copy-doxia-to-local-repo) @ doxia-module-markdown ---
[INFO] Installing F:\jenkins\jenkins-slave\712657a4\workspace\ven_maven-box_maven-doxia_master@2\m\doxia-modules\doxia-module-markdown\..\..\doxia-core\target\doxia-core-1.10-SNAPSHOT.jar to F:\jenkins\jenkins-slave\712657a4\workspace\ven_maven-box_maven-doxia_master@2\m\doxia-modules\doxia-module-markdown\target\local-repo\org\apache\maven\doxia\doxia-core\1.10-SNAPSHOT\doxia-core-1.10-SNAPSHOT.jar
[INFO]
[INFO] --- maven-invoker-plugin:3.2.1:run (integration-test) @ doxia-module-markdown ---
[INFO] Building: general\pom.xml
[withMaven] Publishers: Junit Publisher: 38013 ms
[Pipeline] // dir
[Pipeline] }
[Pipeline] }
[Pipeline] // dir
[Pipeline] }
[Pipeline] // withMaven
[Pipeline] cleanWs
[WS-CLEANUP] Deleting project workspace...
[WS-CLEANUP] Deferred wipeout is used...
[withMaven] junitPublisher - Archive test results for Maven artifact org.apache.maven.doxia:doxia-logging-api:jar:1.10-SNAPSHOT generated by maven-surefire-plugin:test (default-test): m\doxia-logging-api\target\surefire-reports\*.xml
[withMaven] junitPublisher - Archive test results for Maven artifact org.apache.maven.doxia:doxia-sink-api:jar:1.10-SNAPSHOT generated by maven-surefire-plugin:test (default-test): m\doxia-sink-api\target\surefire-reports\*.xml
[withMaven] junitPublisher - Archive test results for Maven artifact org.apache.maven.doxia:doxia-test-docs:jar:1.10-SNAPSHOT generated by maven-surefire-plugin:test (default-test): m\doxia-test-docs\target\surefire-reports\*.xml
[withMaven] junitPublisher - Archive test results for Maven artifact org.apache.maven.doxia:doxia-core:jar:1.10-SNAPSHOT generated by maven-surefire-plugin:test (default-test): m\doxia-core\target\surefire-reports\*.xml
[withMaven] junitPublisher - Archive test results for Maven artifact org.apache.maven.doxia:doxia-module-apt:jar:1.10-SNAPSHOT generated by maven-surefire-plugin:test (default-test): m\doxia-modules\doxia-module-apt\target\surefire-reports\*.xml
[withMaven] junitPublisher - Archive test results for Maven artifact org.apache.maven.doxia:doxia-module-confluence:jar:1.10-SNAPSHOT generated by maven-surefire-plugin:test (default-test): m\doxia-modules\doxia-module-confluence\target\surefire-reports\*.xml
[withMaven] junitPublisher - Archive test results for Maven artifact org.apache.maven.doxia:doxia-module-docbook-simple:jar:1.10-SNAPSHOT generated by maven-surefire-plugin:test (default-test): m\doxia-modules\doxia-module-docbook-simple\target\surefire-reports\*.xml
[withMaven] junitPublisher - Archive test results for Maven artifact org.apache.maven.doxia:doxia-module-fml:jar:1.10-SNAPSHOT generated by maven-surefire-plugin:test (default-test): m\doxia-modules\doxia-module-fml\target\surefire-reports\*.xml
[withMaven] junitPublisher - Archive test results for Maven artifact org.apache.maven.doxia:doxia-module-fo:jar:1.10-SNAPSHOT generated by maven-surefire-plugin:test (default-test): m\doxia-modules\doxia-module-fo\target\surefire-reports\*.xml
[withMaven] junitPublisher - Archive test results for Maven artifact org.apache.maven.doxia:doxia-module-itext:jar:1.10-SNAPSHOT generated by maven-surefire-plugin:test (default-test): m\doxia-modules\doxia-module-itext\target\surefire-reports\*.xml
[withMaven] junitPublisher - Archive test results for Maven artifact org.apache.maven.doxia:doxia-module-latex:jar:1.10-SNAPSHOT generated by maven-surefire-plugin:test (default-test): m\doxia-modules\doxia-module-latex\target\surefire-reports\*.xml
[withMaven] junitPublisher - Archive test results for Maven artifact org.apache.maven.doxia:doxia-module-rtf:jar:1.10-SNAPSHOT generated by maven-surefire-plugin:test (default-test): m\doxia-modules\doxia-module-rtf\target\surefire-reports\*.xml
[withMaven] junitPublisher - Archive test results for Maven artifact org.apache.maven.doxia:doxia-module-twiki:jar:1.10-SNAPSHOT generated by maven-surefire-plugin:test (default-test): m\doxia-modules\doxia-module-twiki\target\surefire-reports\*.xml
[withMaven] junitPublisher - Archive test results for Maven artifact org.apache.maven.doxia:doxia-module-xdoc:jar:1.10-SNAPSHOT generated by maven-surefire-plugin:test (default-test): m\doxia-modules\doxia-module-xdoc\target\surefire-reports\*.xml
[withMaven] junitPublisher - Archive test results for Maven artifact org.apache.maven.doxia:doxia-module-xhtml:jar:1.10-SNAPSHOT generated by maven-surefire-plugin:test (default-test): m\doxia-modules\doxia-module-xhtml\target\surefire-reports\*.xml
[withMaven] junitPublisher - Archive test results for Maven artifact org.apache.maven.doxia:doxia-module-xhtml5:jar:1.10-SNAPSHOT generated by maven-surefire-plugin:test (default-test): m\doxia-modules\doxia-module-xhtml5\target\surefire-reports\*.xml
[withMaven] junitPublisher - Archive test results for Maven artifact org.apache.maven.doxia:doxia-module-markdown:jar:1.10-SNAPSHOT generated by maven-surefire-plugin:test (default-test): m\doxia-modules\doxia-module-markdown\target\surefire-reports\*.xml
Recording test results
[withMaven] junitPublisher - Archive test results for Maven artifact org.apache.maven.doxia:doxia-logging-api:jar:1.10-SNAPSHOT generated by maven-surefire-plugin:test (default-test): m\doxia-logging-api\target\surefire-reports\*.xml
[withMaven] junitPublisher - Archive test results for Maven artifact org.apache.maven.doxia:doxia-sink-api:jar:1.10-SNAPSHOT generated by maven-surefire-plugin:test (default-test): m\doxia-sink-api\target\surefire-reports\*.xml
[withMaven] junitPublisher - Archive test results for Maven artifact org.apache.maven.doxia:doxia-test-docs:jar:1.10-SNAPSHOT generated by maven-surefire-plugin:test (default-test): m\doxia-test-docs\target\surefire-reports\*.xml
[withMaven] junitPublisher - Archive test results for Maven artifact org.apache.maven.doxia:doxia-core:jar:1.10-SNAPSHOT generated by maven-surefire-plugin:test (default-test): m\doxia-core\target\surefire-reports\*.xml
[withMaven] junitPublisher - Archive test results for Maven artifact org.apache.maven.doxia:doxia-module-apt:jar:1.10-SNAPSHOT generated by maven-surefire-plugin:test (default-test): m\doxia-modules\doxia-module-apt\target\surefire-reports\*.xml
[withMaven] junitPublisher - Archive test results for Maven artifact org.apache.maven.doxia:doxia-module-confluence:jar:1.10-SNAPSHOT generated by maven-surefire-plugin:test (default-test): m\doxia-modules\doxia-module-confluence\target\surefire-reports\*.xml
[withMaven] junitPublisher - Archive test results for Maven artifact org.apache.maven.doxia:doxia-module-docbook-simple:jar:1.10-SNAPSHOT generated by maven-surefire-plugin:test (default-test): m\doxia-modules\doxia-module-docbook-simple\target\surefire-reports\*.xml
[withMaven] junitPublisher - Archive test results for Maven artifact org.apache.maven.doxia:doxia-module-fml:jar:1.10-SNAPSHOT generated by maven-surefire-plugin:test (default-test): m\doxia-modules\doxia-module-fml\target\surefire-reports\*.xml
[withMaven] junitPublisher - Archive test results for Maven artifact org.apache.maven.doxia:doxia-module-fo:jar:1.10-SNAPSHOT generated by maven-surefire-plugin:test (default-test): m\doxia-modules\doxia-module-fo\target\surefire-reports\*.xml
[withMaven] junitPublisher - Archive test results for Maven artifact org.apache.maven.doxia:doxia-module-itext:jar:1.10-SNAPSHOT generated by maven-surefire-plugin:test (default-test): m\doxia-modules\doxia-module-itext\target\surefire-reports\*.xml
[withMaven] junitPublisher - Archive test results for Maven artifact org.apache.maven.doxia:doxia-module-latex:jar:1.10-SNAPSHOT generated by maven-surefire-plugin:test (default-test): m\doxia-modules\doxia-module-latex\target\surefire-reports\*.xml
[withMaven] junitPublisher - Archive test results for Maven artifact org.apache.maven.doxia:doxia-module-rtf:jar:1.10-SNAPSHOT generated by maven-surefire-plugin:test (default-test): m\doxia-modules\doxia-module-rtf\target\surefire-reports\*.xml
[withMaven] junitPublisher - Archive test results for Maven artifact org.apache.maven.doxia:doxia-module-twiki:jar:1.10-SNAPSHOT generated by maven-surefire-plugin:test (default-test): m\doxia-modules\doxia-module-twiki\target\surefire-reports\*.xml
[withMaven] junitPublisher - Archive test results for Maven artifact org.apache.maven.doxia:doxia-module-xdoc:jar:1.10-SNAPSHOT generated by maven-surefire-plugin:test (default-test): m\doxia-modules\doxia-module-xdoc\target\surefire-reports\*.xml
[withMaven] junitPublisher - Archive test results for Maven artifact org.apache.maven.doxia:doxia-module-xhtml:jar:1.10-SNAPSHOT generated by maven-surefire-plugin:test (default-test): m\doxia-modules\doxia-module-xhtml\target\surefire-reports\*.xml
[withMaven] junitPublisher - Archive test results for Maven artifact org.apache.maven.doxia:doxia-module-xhtml5:jar:1.10-SNAPSHOT generated by maven-surefire-plugin:test (default-test): m\doxia-modules\doxia-module-xhtml5\target\surefire-reports\*.xml
[withMaven] junitPublisher - Archive test results for Maven artifact org.apache.maven.doxia:doxia-module-markdown:jar:1.10-SNAPSHOT generated by maven-surefire-plugin:test (default-test): m\doxia-modules\doxia-module-markdown\target\surefire-reports\*.xml
Recording test results
[WS-CLEANUP] done
[Pipeline] }
[Pipeline] // stage
[Pipeline] }
[Pipeline] // ws
[Pipeline] }
[Pipeline] // withEnv
[Pipeline] }
[Pipeline] // node
[Pipeline] }
[withMaven] Publishers: Junit Publisher: 7439 ms
[Pipeline] // withMaven
[withMaven] Publishers: Junit Publisher: 13037 ms
[Pipeline] cleanWs
[Pipeline] // withMaven
[WS-CLEANUP] Deleting project workspace...
[WS-CLEANUP] Deferred wipeout is used...
[Pipeline] cleanWs
[WS-CLEANUP] Deleting project workspace...
[WS-CLEANUP] Deferred wipeout is used...
[WS-CLEANUP] done
[Pipeline] }
[WS-CLEANUP] done
[Pipeline] // stage
[Pipeline] }
[Pipeline] }
[Pipeline] // ws
[Pipeline] // stage
[Pipeline] }
[Pipeline] }
[Pipeline] // ws
[Pipeline] // withEnv
[Pipeline] }
[Pipeline] }
[Pipeline] // withEnv
[Pipeline] // node
[Pipeline] }
[Pipeline] }
[Pipeline] // node
[Pipeline] }
[INFO] run post-build script verify.groovy
WARNING: An illegal reflective access operation has occurred
WARNING: Illegal reflective access by org.codehaus.groovy.reflection.CachedClass (file:/f:/jenkins/jenkins-slave/712657a4/workspace/ven_maven-box_maven-doxia_master@2/.repository/org/codehaus/groovy/groovy-all/2.4.8/groovy-all-2.4.8.jar) to method java.lang.Object.finalize()
WARNING: Please consider reporting this to the maintainers of org.codehaus.groovy.reflection.CachedClass
WARNING: Use --illegal-access=warn to enable warnings of further illegal reflective access operations
WARNING: All illegal access operations will be denied in a future release
[INFO]           general\pom.xml .................................. SUCCESS (23.5 s)
[INFO] -------------------------------------------------
[INFO] Build Summary:
[INFO]   Passed: 1, Failed: 0, Errors: 0, Skipped: 0
[INFO] -------------------------------------------------
[INFO]
[INFO] --- maven-checkstyle-plugin:3.0.0:check (checkstyle-check) @ doxia-module-markdown ---
[INFO]
[INFO] >>> clirr-maven-plugin:2.8:check (default) > compile @ doxia-module-markdown >>>
[INFO]
[INFO] --- maven-enforcer-plugin:1.4.1:enforce (enforce-maven-version) @ doxia-module-markdown ---
[INFO]
[INFO] --- maven-enforcer-plugin:1.4.1:enforce (enforce-bytecode-version) @ doxia-module-markdown ---
[INFO] Adding ignore: module-info
[INFO]
[INFO] --- apache-rat-plugin:0.13:check (rat-check) @ doxia-module-markdown ---
[INFO] Enabled default license matchers.
[INFO] Will parse SCM ignores for exclusions...
[INFO] Finished adding exclusions from SCM ignore files.
[INFO] 62 implicit excludes (use -debug for more details).
[INFO] 13 explicit excludes (use -debug for more details).
[INFO] 13 resources included (use -debug for more details)
[INFO] Rat check: Summary over all files. Unapproved: 0, unknown: 0, generated: 0, approved: 13 licenses.
[INFO]
[INFO] --- maven-remote-resources-plugin:1.7.0:process (process-resource-bundles) @ doxia-module-markdown ---
[INFO] Preparing remote bundle org.apache:apache-jar-resource-bundle:1.4
[INFO] Copying 3 resources from 1 bundle.
[INFO]
[INFO] --- maven-resources-plugin:3.1.0:resources (default-resources) @ doxia-module-markdown ---
[INFO] Using 'UTF-8' encoding to copy filtered resources.
[INFO] skip non existing resourceDirectory F:\jenkins\jenkins-slave\712657a4\workspace\ven_maven-box_maven-doxia_master@2\m\doxia-modules\doxia-module-markdown\src\main\resources
[INFO] skip non existing resourceDirectory F:\jenkins\jenkins-slave\712657a4\workspace\ven_maven-box_maven-doxia_master@2\m\doxia-modules\doxia-module-markdown\target\generated-site\xsd
[INFO] Copying 3 resources
[INFO] Copying 3 resources
[INFO]
[INFO] --- maven-compiler-plugin:3.8.1:compile (default-compile) @ doxia-module-markdown ---
[INFO] Changes detected - recompiling the module!
[INFO] Compiling 3 source files to F:\jenkins\jenkins-slave\712657a4\workspace\ven_maven-box_maven-doxia_master@2\m\doxia-modules\doxia-module-markdown\target\classes
[INFO]
[INFO] <<< clirr-maven-plugin:2.8:check (default) < compile @ doxia-module-markdown <<<
[INFO]
[INFO]
[INFO] --- clirr-maven-plugin:2.8:check (default) @ doxia-module-markdown ---
[INFO] artifact org.apache.maven.doxia:doxia-module-markdown: checking for updates from apache-snapshots
[INFO] artifact org.apache.maven.doxia:doxia-module-markdown: checking for updates from Nexus
[INFO] artifact org.apache.maven.doxia:doxia-module-markdown: checking for updates from central
[INFO] Comparing to version: 1.9.1
[INFO] Downloading from central: https://repo.maven.apache.org/maven2/org/apache/maven/doxia/doxia-module-markdown/1.9.1/doxia-module-markdown-1.9.1.jar
[INFO] Downloaded from central: https://repo.maven.apache.org/maven2/org/apache/maven/doxia/doxia-module-markdown/1.9.1/doxia-module-markdown-1.9.1.jar (23 kB at 616 kB/s)
[INFO] Downloading from central: https://repo.maven.apache.org/maven2/org/apache/maven/doxia/doxia-module-markdown/1.9.1/doxia-module-markdown-1.9.1.pom
[INFO] Downloaded from central: https://repo.maven.apache.org/maven2/org/apache/maven/doxia/doxia-module-markdown/1.9.1/doxia-module-markdown-1.9.1.pom (2.6 kB at 64 kB/s)
[INFO] Succeeded with 0 errors; 0 warnings; and 0 other changes.
[INFO] ------------------------------------------------------------------------
[INFO] Reactor Summary for Doxia 1.10-SNAPSHOT:
[INFO]
[INFO] Doxia .............................................. SUCCESS [ 44.905 s]
[INFO] Doxia :: Logging API ............................... SUCCESS [  8.249 s]
[INFO] Doxia :: Sink API .................................. SUCCESS [  1.804 s]
[INFO] Doxia :: Test Documents ............................ SUCCESS [  1.756 s]
[INFO] Doxia :: Core ...................................... SUCCESS [01:06 min]
[INFO] Doxia :: Modules ................................... SUCCESS [  0.886 s]
[INFO] Doxia :: APT Module ................................ SUCCESS [  5.153 s]
[INFO] Doxia :: Confluence Module ......................... SUCCESS [  6.238 s]
[INFO] Doxia :: Simplified DocBook Module ................. SUCCESS [  6.574 s]
[INFO] Doxia :: FML Module ................................ SUCCESS [  4.954 s]
[INFO] Doxia :: FO Module ................................. SUCCESS [ 19.777 s]
[INFO] Doxia :: iText Module .............................. SUCCESS [  4.706 s]
[INFO] Doxia :: Latex Module .............................. SUCCESS [  4.415 s]
[INFO] Doxia :: RTF Module ................................ SUCCESS [  5.200 s]
[INFO] Doxia :: TWiki Module .............................. SUCCESS [  5.382 s]
[INFO] Doxia :: XDoc Module ............................... SUCCESS [01:10 min]
[INFO] Doxia :: XHTML Module .............................. SUCCESS [  5.563 s]
[INFO] Doxia :: XHTML5 Module ............................. SUCCESS [  5.396 s]
[INFO] Doxia :: Markdown Module ........................... SUCCESS [ 40.627 s]
[INFO] ------------------------------------------------------------------------
[INFO] BUILD SUCCESS
[INFO] ------------------------------------------------------------------------
[INFO] Total time:  05:09 min
[INFO] Finished at: 2021-01-11T03:48:47-08:00
[INFO] ------------------------------------------------------------------------
[WARNING] The requested profile "run-its" could not be activated because it does not exist.
[INFO] [jenkins-event-spy] Generated F:\jenkins\jenkins-slave\712657a4\workspace\ven_maven-box_maven-doxia_master@2@tmp\withMaven960e550c\maven-spy-20210111-034336-89216950934992022654879.log
[Pipeline] }
[Pipeline] // dir
[Pipeline] }
[withMaven] junitPublisher - Archive test results for Maven artifact org.apache.maven.doxia:doxia-logging-api:jar:1.10-SNAPSHOT generated by maven-surefire-plugin:test (default-test): m\doxia-logging-api\target\surefire-reports\*.xml
[withMaven] junitPublisher - Archive test results for Maven artifact org.apache.maven.doxia:doxia-sink-api:jar:1.10-SNAPSHOT generated by maven-surefire-plugin:test (default-test): m\doxia-sink-api\target\surefire-reports\*.xml
[withMaven] junitPublisher - Archive test results for Maven artifact org.apache.maven.doxia:doxia-test-docs:jar:1.10-SNAPSHOT generated by maven-surefire-plugin:test (default-test): m\doxia-test-docs\target\surefire-reports\*.xml
[withMaven] junitPublisher - Archive test results for Maven artifact org.apache.maven.doxia:doxia-core:jar:1.10-SNAPSHOT generated by maven-surefire-plugin:test (default-test): m\doxia-core\target\surefire-reports\*.xml
[withMaven] junitPublisher - Archive test results for Maven artifact org.apache.maven.doxia:doxia-module-apt:jar:1.10-SNAPSHOT generated by maven-surefire-plugin:test (default-test): m\doxia-modules\doxia-module-apt\target\surefire-reports\*.xml
[withMaven] junitPublisher - Archive test results for Maven artifact org.apache.maven.doxia:doxia-module-confluence:jar:1.10-SNAPSHOT generated by maven-surefire-plugin:test (default-test): m\doxia-modules\doxia-module-confluence\target\surefire-reports\*.xml
[withMaven] junitPublisher - Archive test results for Maven artifact org.apache.maven.doxia:doxia-module-docbook-simple:jar:1.10-SNAPSHOT generated by maven-surefire-plugin:test (default-test): m\doxia-modules\doxia-module-docbook-simple\target\surefire-reports\*.xml
[withMaven] junitPublisher - Archive test results for Maven artifact org.apache.maven.doxia:doxia-module-fml:jar:1.10-SNAPSHOT generated by maven-surefire-plugin:test (default-test): m\doxia-modules\doxia-module-fml\target\surefire-reports\*.xml
[withMaven] junitPublisher - Archive test results for Maven artifact org.apache.maven.doxia:doxia-module-fo:jar:1.10-SNAPSHOT generated by maven-surefire-plugin:test (default-test): m\doxia-modules\doxia-module-fo\target\surefire-reports\*.xml
[withMaven] junitPublisher - Archive test results for Maven artifact org.apache.maven.doxia:doxia-module-itext:jar:1.10-SNAPSHOT generated by maven-surefire-plugin:test (default-test): m\doxia-modules\doxia-module-itext\target\surefire-reports\*.xml
[withMaven] junitPublisher - Archive test results for Maven artifact org.apache.maven.doxia:doxia-module-latex:jar:1.10-SNAPSHOT generated by maven-surefire-plugin:test (default-test): m\doxia-modules\doxia-module-latex\target\surefire-reports\*.xml
[withMaven] junitPublisher - Archive test results for Maven artifact org.apache.maven.doxia:doxia-module-rtf:jar:1.10-SNAPSHOT generated by maven-surefire-plugin:test (default-test): m\doxia-modules\doxia-module-rtf\target\surefire-reports\*.xml
[withMaven] junitPublisher - Archive test results for Maven artifact org.apache.maven.doxia:doxia-module-twiki:jar:1.10-SNAPSHOT generated by maven-surefire-plugin:test (default-test): m\doxia-modules\doxia-module-twiki\target\surefire-reports\*.xml
[withMaven] junitPublisher - Archive test results for Maven artifact org.apache.maven.doxia:doxia-module-xdoc:jar:1.10-SNAPSHOT generated by maven-surefire-plugin:test (default-test): m\doxia-modules\doxia-module-xdoc\target\surefire-reports\*.xml
[withMaven] junitPublisher - Archive test results for Maven artifact org.apache.maven.doxia:doxia-module-xhtml:jar:1.10-SNAPSHOT generated by maven-surefire-plugin:test (default-test): m\doxia-modules\doxia-module-xhtml\target\surefire-reports\*.xml
[withMaven] junitPublisher - Archive test results for Maven artifact org.apache.maven.doxia:doxia-module-xhtml5:jar:1.10-SNAPSHOT generated by maven-surefire-plugin:test (default-test): m\doxia-modules\doxia-module-xhtml5\target\surefire-reports\*.xml
[withMaven] junitPublisher - Archive test results for Maven artifact org.apache.maven.doxia:doxia-module-markdown:jar:1.10-SNAPSHOT generated by maven-surefire-plugin:test (default-test): m\doxia-modules\doxia-module-markdown\target\surefire-reports\*.xml
Recording test results
[withMaven] Publishers: Generated Artifacts Publisher: 28362 ms, Junit Publisher: 70081 ms, Open Task Scanner Publisher: 14228 ms, Dependencies Fingerprint Publisher: 47485 ms, Pipeline Graph Publisher: 16 ms
[Pipeline] // withMaven
[withMaven] Publishers: Junit Publisher: 7401 ms
[Pipeline] cleanWs
[Pipeline] // withMaven
[Pipeline] cleanWs
[WS-CLEANUP] Deleting project workspace...
[WS-CLEANUP] Deferred wipeout is used...
[WS-CLEANUP] done
[Pipeline] }
[WS-CLEANUP] Deleting project workspace...
[WS-CLEANUP] Deferred wipeout is used...
[Pipeline] // stage
[Pipeline] }
[Pipeline] // ws
[Pipeline] }
[Pipeline] // withEnv
[Pipeline] }
[Pipeline] // node
[Pipeline] }
[WS-CLEANUP] done
[Pipeline] }
[Pipeline] // stage
[Pipeline] }
[Pipeline] // ws
[Pipeline] }
[Pipeline] // withEnv
[Pipeline] }
[Pipeline] // node
[Pipeline] }
[Pipeline] // parallel
[Pipeline] echo
[FAILURE-003] AbortException hudson.AbortException: script returned exit code 1
[Pipeline] stage
[Pipeline] { (Notifications)
[Pipeline] echo
Build result: FAILURE
[Pipeline] jiraIssueSelector
[Pipeline] echo
The authors of changes [elharo].
[Pipeline] echo
Sending email ...
[Pipeline] emailext
Reply | Threaded
Open this post in threaded view
|

Build succeeded in Jenkins: Maven » Maven TLP » maven-doxia » master #30

Apache Jenkins Server-2
See https://ci-builds.apache.org/job/Maven/job/maven-box/job/maven-doxia/job/master/30/

Changes:

* Bump fop from 2.5 to 2.6

All tests passed