Build failed in Jenkins: Maven » Maven TLP » maven-assembly-plugin » master #35

Previous Topic Next Topic
 
classic Classic list List threaded Threaded
1 message Options
Reply | Threaded
Open this post in threaded view
|

Build failed in Jenkins: Maven » Maven TLP » maven-assembly-plugin » master #35

Apache Jenkins Server-2
See https://ci-builds.apache.org/job/Maven/job/maven-box/job/maven-assembly-plugin/job/master/35/

Changes:

* Bump maven-invoker-plugin from 3.2.1 to 3.2.2

All tests passed

Build log:
[...truncated 11512 lines...]
[INFO]           projects\multimodule\multimodule-filteredFileSet\pom.xml SUCCESS (5.0 s)
[INFO] Building: projects\multimodule\multimodule-modulePomPropInterp\pom.xml
[INFO] run post-build script verify.bsh
[INFO]           projects\multimodule\multimodule-binariesNotSource\pom.xml SUCCESS (9.9 s)
[INFO] Building: projects\multimodule\multimodule-filteredFileSet\pom.xml
[INFO] run post-build script verify.groovy
[INFO]           projects\multimodule\two-levels-includeBaseDir-withBin\pom.xml SUCCESS (9.2 s)
[INFO] Building: projects\multimodule\two-levels-includeBaseDir-withSrc\pom.xml
[INFO] run post-build script verify.bsh
[INFO]           projects\multimodule\multimodule-modulePomPropInterp\pom.xml SUCCESS (5.9 s)
[INFO] Building: projects\multimodule\multimodule-siblingParent\parent\pom.xml
[INFO] run post-build script verify.bsh
[INFO]           projects\multimodule\multimodule-filteredFileSet\pom.xml SUCCESS (5.1 s)
[INFO] Building: projects\multimodule\multimodule-modulePomPropInterp\pom.xml
[INFO] run post-build script verify.bsh
[INFO]           projects\multimodule\multimodule-modulePomPropInterp\pom.xml SUCCESS (5.7 s)
[INFO] Building: projects\multimodule\multimodule-siblingParent\parent\pom.xml
[INFO] run post-build script verify.groovy
[INFO]           projects\multimodule\two-levels-includeBaseDir-withSrc\pom.xml SUCCESS (8.8 s)
[INFO] Building: projects\repositories\basic-repository\pom.xml
[INFO] run post-build script verify.bsh
[INFO]           projects\multimodule\multimodule-siblingParent\parent\pom.xml SUCCESS (8.7 s)
[INFO] Building: projects\multimodule\multimodule-sourceNotBinaries\pom.xml
[INFO] run post-build script verify.bsh
[INFO]           projects\multimodule\multimodule-siblingParent\parent\pom.xml SUCCESS (7.3 s)
[INFO] Building: projects\multimodule\multimodule-sourceNotBinaries\pom.xml
[INFO] run post-build script verify.bsh
[INFO]           projects\repositories\basic-repository\pom.xml ... SUCCESS (7.4 s)
[INFO] Building: projects\repositories\massembly-196\pom.xml
[INFO] run post-build script verify.bsh
[INFO]           projects\multimodule\multimodule-sourceNotBinaries\pom.xml SUCCESS (9.6 s)
[INFO] Building: projects\multimodule\multimodule-wholeReactorFromChild\pom.xml
[INFO] run post-build script verify.bsh
[INFO]           projects\multimodule\multimodule-sourceNotBinaries\pom.xml SUCCESS (10.0 s)
[INFO] Building: projects\multimodule\multimodule-wholeReactorFromChild\pom.xml
[INFO] run post-build script verify.bsh
[INFO]           projects\multimodule\multimodule-wholeReactorFromChild\pom.xml SUCCESS (10.0 s)
[INFO] Building: projects\multimodule\two-level-multimodule\pom.xml
[INFO] run post-build script verify.bsh
[INFO]           projects\repositories\massembly-196\pom.xml ...... SUCCESS (11.7 s)
[INFO] Building: projects\repositories\massembly-855\pom.xml
[INFO] run post-build script verify.bsh
[INFO]           projects\repositories\massembly-855\pom.xml ...... SUCCESS (4.5 s)
[INFO] Building: projects\reproducible\pom.xml
[INFO] run post-build script verify.bsh
[INFO]           projects\multimodule\multimodule-wholeReactorFromChild\pom.xml SUCCESS (10.0 s)
[INFO] Building: projects\multimodule\two-level-multimodule\pom.xml
[INFO] run post-build script verify.groovy
[INFO]           projects\multimodule\two-level-multimodule\pom.xml SUCCESS (9.0 s)
[INFO] Building: projects\multimodule\two-levels-includeBaseDir-withBin\pom.xml
[INFO] run post-build script verify.groovy
[INFO]           projects\reproducible\pom.xml .................... SUCCESS (7.2 s)
[INFO]
[INFO] --- maven-checkstyle-plugin:3.0.0:check (checkstyle-check) @ maven-assembly-plugin ---
[INFO] There are 3 errors reported by Checkstyle 6.18 with config/maven_checks.xml ruleset.
[INFO] Ignored 3 errors, 0 violation remaining.
[INFO]
[INFO] --- maven-invoker-plugin:3.2.2:verify (integration-test) @ maven-assembly-plugin ---
[INFO] -------------------------------------------------
[INFO] Build Summary:
[INFO]   Passed: 139, Failed: 0, Errors: 0, Skipped: 2
[INFO] -------------------------------------------------
[ERROR] The following builds was skipped:
[ERROR] *  projects\bugs\massembly-731\pom.xml
[ERROR] *  projects\file-modes\file-set-fileMode\pom.xml
[INFO] -------------------------------------------------
[INFO] ------------------------------------------------------------------------
[INFO] BUILD SUCCESS
[INFO] ------------------------------------------------------------------------
[INFO] Total time:  17:14 min
[INFO] Finished at: 2021-02-22T04:11:49-08:00
[INFO] ------------------------------------------------------------------------
[INFO] [jenkins-event-spy] Generated F:\jenkins\jenkins-slave\712657a4\workspace\box_maven-assembly-plugin_master@2@tmp\withMaven6fed2da7\maven-spy-20210222-035435-881789702623377639821.log
[Pipeline] }
[Pipeline] // dir
[Pipeline] }
[withMaven] artifactsPublisher - Archive artifact windows-jdk11-m3.6.x_build\pom.xml under org\apache\maven\plugins\maven-assembly-plugin\3.3.1-SNAPSHOT\maven-assembly-plugin-3.3.1-SNAPSHOT.pom
[withMaven] artifactsPublisher - Archive artifact windows-jdk11-m3.6.x_build\target\maven-assembly-plugin-3.3.1-SNAPSHOT.jar under org\apache\maven\plugins\maven-assembly-plugin\3.3.1-SNAPSHOT\maven-assembly-plugin-3.3.1-SNAPSHOT.jar
[INFO] run post-build script verify.groovy
[INFO]           projects\multimodule\two-level-multimodule\pom.xml SUCCESS (8.4 s)
[INFO] Building: projects\multimodule\two-levels-includeBaseDir-withBin\pom.xml
[withMaven] junitPublisher - Archive test results for Maven artifact org.apache.maven.plugins:maven-assembly-plugin:maven-plugin:3.3.1-SNAPSHOT generated by maven-surefire-plugin:test (default-test): windows-jdk11-m3.6.x_build\target\surefire-reports\*.xml
Recording test results
[INFO] run post-build script verify.groovy
[INFO]           projects\multimodule\two-levels-includeBaseDir-withBin\pom.xml SUCCESS (8.6 s)
[INFO] Building: projects\multimodule\two-levels-includeBaseDir-withSrc\pom.xml
[withMaven] openTasksPublisher - Scan Tasks for Maven artifact org.apache.maven.plugins:maven-assembly-plugin:maven-plugin:3.3.1-SNAPSHOT in source directory windows-jdk11-m3.6.x_build\src\main\java
[TASKS] Scanning folder 'f:\jenkins\jenkins-slave\712657a4\workspace\box_maven-assembly-plugin_master@2' for files matching the pattern 'windows-jdk11-m3.6.x_build\src\main\java\**\*' - excludes: null
[TASKS] Found 82 files to scan for tasks
[TASKS] Found 14 open tasks.
Skipping warnings blame since pipelines do not have an SCM link.%n
[TASKS] Computing warning deltas based on reference build #34
[withMaven] invokerPublisher - Archive invoker results for Maven artifact MavenArtifact{org.apache.maven.plugins:maven-assembly-plugin:maven-plugin:3.3.1-SNAPSHOT(version: 3.3.1-SNAPSHOT, snapshot:false) } generated by PluginInvocation{org.apache.maven.plugins:maven-invoker-plugin:3.2.2@integration-test  integration-test}: windows-jdk11-m3.6.x_build\target\invoker-reports\*.xml
ERROR: [withMaven] invokerPublisher - Silently ignore exception archiving Invoker runs for Maven artifact MavenArtifact{org.apache.maven.plugins:maven-assembly-plugin:maven-plugin:3.3.1-SNAPSHOT(version: 3.3.1-SNAPSHOT, snapshot:false) } generated by PluginInvocation{org.apache.maven.plugins:maven-invoker-plugin:3.2.2@integration-test  integration-test}: java.io.IOException: Unknown attribute 'buildlog' for tag 'build-job' (position: START_TAG seen ...ndows-jdk11-m3.6.x_build\target\it\it-project-parent\build.log" />... @2:271)
[withMaven] Publishers: Generated Artifacts Publisher: 283 ms, Junit Publisher: 2887 ms, Open Task Scanner Publisher: 450 ms, Invoker Publisher: 1112 ms
[Pipeline] // withMaven
[Pipeline] cleanWs
[WS-CLEANUP] Deleting project workspace...
[WS-CLEANUP] Deferred wipeout is used...
[WS-CLEANUP] done
[Pipeline] }
[Pipeline] // stage
[Pipeline] }
[Pipeline] // ws
[Pipeline] }
[Pipeline] // node
[Pipeline] }
[INFO] run post-build script verify.groovy
[INFO]           projects\multimodule\two-levels-includeBaseDir-withBin\pom.xml SUCCESS (7.6 s)
[INFO] Building: projects\multimodule\two-levels-includeBaseDir-withSrc\pom.xml
[INFO] run post-build script verify.groovy
[INFO]           projects\multimodule\two-levels-includeBaseDir-withSrc\pom.xml SUCCESS (8.7 s)
[INFO] Building: projects\repositories\basic-repository\pom.xml
[INFO] run post-build script verify.groovy
[INFO]           projects\multimodule\two-levels-includeBaseDir-withSrc\pom.xml SUCCESS (8.3 s)
[INFO] Building: projects\repositories\basic-repository\pom.xml
[INFO] run post-build script verify.bsh
[INFO]           projects\repositories\basic-repository\pom.xml ... SUCCESS (7.5 s)
[INFO] Building: projects\repositories\massembly-196\pom.xml
[INFO] run post-build script verify.bsh
[INFO]           projects\repositories\basic-repository\pom.xml ... SUCCESS (7.0 s)
[INFO] Building: projects\repositories\massembly-196\pom.xml
[INFO] run post-build script verify.bsh
[INFO]           projects\repositories\massembly-196\pom.xml ...... SUCCESS (11.8 s)
[INFO] Building: projects\repositories\massembly-855\pom.xml
[INFO] run post-build script verify.bsh
[INFO]           projects\repositories\massembly-855\pom.xml ...... SUCCESS (4.6 s)
[INFO] Building: projects\reproducible\pom.xml
[INFO] run post-build script verify.bsh
[INFO]           projects\repositories\massembly-196\pom.xml ...... SUCCESS (12.0 s)
[INFO] Building: projects\repositories\massembly-855\pom.xml
[INFO] run post-build script verify.bsh
[INFO]           projects\repositories\massembly-855\pom.xml ...... SUCCESS (4.0 s)
[INFO] Building: projects\reproducible\pom.xml
[INFO] run post-build script verify.groovy
[INFO]           projects\reproducible\pom.xml .................... SUCCESS (7.8 s)
[INFO]
[INFO] --- maven-checkstyle-plugin:3.0.0:check (checkstyle-check) @ maven-assembly-plugin ---
[INFO] There are 3 errors reported by Checkstyle 6.18 with config/maven_checks.xml ruleset.
[INFO] Ignored 3 errors, 0 violation remaining.
[INFO]
[INFO] --- maven-invoker-plugin:3.2.2:verify (integration-test) @ maven-assembly-plugin ---
[INFO] run post-build script verify.groovy
[INFO]           projects\reproducible\pom.xml .................... SUCCESS (7.2 s)
[INFO]
[INFO] --- maven-checkstyle-plugin:3.0.0:check (checkstyle-check) @ maven-assembly-plugin ---
[INFO] -------------------------------------------------
[INFO] Build Summary:
[INFO]   Passed: 139, Failed: 0, Errors: 0, Skipped: 2
[INFO] -------------------------------------------------
[ERROR] The following builds was skipped:
[ERROR] *  projects\bugs\massembly-731\pom.xml
[ERROR] *  projects\file-modes\file-set-fileMode\pom.xml
[INFO] -------------------------------------------------
[INFO] ------------------------------------------------------------------------
[INFO] BUILD SUCCESS
[INFO] ------------------------------------------------------------------------
[INFO] Total time:  16:54 min
[INFO] Finished at: 2021-02-22T04:12:36-08:00
[INFO] ------------------------------------------------------------------------
[INFO] [jenkins-event-spy] Generated F:\jenkins\jenkins-slave\712657a4\workspace\box_maven-assembly-plugin_master@2@tmp\withMaven7297e441\maven-spy-20210222-035541-55912838968756671373109.log
[Pipeline] }
[Pipeline] // dir
[Pipeline] }
[withMaven] artifactsPublisher - Archive artifact windows-jdk15-m3.6.x_build\pom.xml under org\apache\maven\plugins\maven-assembly-plugin\3.3.1-SNAPSHOT\maven-assembly-plugin-3.3.1-SNAPSHOT.pom
[withMaven] artifactsPublisher - Archive artifact windows-jdk15-m3.6.x_build\target\maven-assembly-plugin-3.3.1-SNAPSHOT.jar under org\apache\maven\plugins\maven-assembly-plugin\3.3.1-SNAPSHOT\maven-assembly-plugin-3.3.1-SNAPSHOT.jar
[Fast Archiver] Compressed 266.39 KB of artifacts by 72.1% relative to #34
[withMaven] junitPublisher - Archive test results for Maven artifact org.apache.maven.plugins:maven-assembly-plugin:maven-plugin:3.3.1-SNAPSHOT generated by maven-surefire-plugin:test (default-test): windows-jdk15-m3.6.x_build\target\surefire-reports\*.xml
Recording test results
[INFO] There are 3 errors reported by Checkstyle 6.18 with config/maven_checks.xml ruleset.
[INFO] Ignored 3 errors, 0 violation remaining.
[INFO]
[INFO] --- maven-invoker-plugin:3.2.2:verify (integration-test) @ maven-assembly-plugin ---
[INFO] -------------------------------------------------
[INFO] Build Summary:
[INFO]   Passed: 139, Failed: 0, Errors: 0, Skipped: 2
[INFO] -------------------------------------------------
[ERROR] The following builds was skipped:
[ERROR] *  projects\bugs\massembly-731\pom.xml
[ERROR] *  projects\file-modes\file-set-fileMode\pom.xml
[INFO] -------------------------------------------------
[INFO] ------------------------------------------------------------------------
[INFO] BUILD SUCCESS
[INFO] ------------------------------------------------------------------------
[INFO] Total time:  16:24 min
[INFO] Finished at: 2021-02-22T04:12:39-08:00
[INFO] ------------------------------------------------------------------------
[INFO] [jenkins-event-spy] Generated F:\jenkins\jenkins-slave\712657a4\workspace\box_maven-assembly-plugin_master@2@tmp\withMavenf8636d61\maven-spy-20210222-035614-56113264875350401207002.log
[Pipeline] }
[Pipeline] // dir
[Pipeline] }
[withMaven] openTasksPublisher - Scan Tasks for Maven artifact org.apache.maven.plugins:maven-assembly-plugin:maven-plugin:3.3.1-SNAPSHOT in source directory windows-jdk15-m3.6.x_build\src\main\java
[withMaven] artifactsPublisher - Archive artifact windows-jdk16-m3.6.x_build\pom.xml under org\apache\maven\plugins\maven-assembly-plugin\3.3.1-SNAPSHOT\maven-assembly-plugin-3.3.1-SNAPSHOT.pom
[TASKS] Scanning folder 'f:\jenkins\jenkins-slave\712657a4\workspace\box_maven-assembly-plugin_master@2' for files matching the pattern 'windows-jdk15-m3.6.x_build\src\main\java\**\*' - excludes: null
[TASKS] Found 82 files to scan for tasks
[TASKS] Found 14 open tasks.
Skipping warnings blame since pipelines do not have an SCM link.%n
[TASKS] Computing warning deltas based on reference build #34
[withMaven] artifactsPublisher - Archive artifact windows-jdk16-m3.6.x_build\target\maven-assembly-plugin-3.3.1-SNAPSHOT.jar under org\apache\maven\plugins\maven-assembly-plugin\3.3.1-SNAPSHOT\maven-assembly-plugin-3.3.1-SNAPSHOT.jar
[Fast Archiver] Compressed 266.41 KB of artifacts by 72.1% relative to #34
[withMaven] junitPublisher - Archive test results for Maven artifact org.apache.maven.plugins:maven-assembly-plugin:maven-plugin:3.3.1-SNAPSHOT generated by maven-surefire-plugin:test (default-test): windows-jdk16-m3.6.x_build\target\surefire-reports\*.xml
Recording test results
[withMaven] invokerPublisher - Archive invoker results for Maven artifact MavenArtifact{org.apache.maven.plugins:maven-assembly-plugin:maven-plugin:3.3.1-SNAPSHOT(version: 3.3.1-SNAPSHOT, snapshot:false) } generated by PluginInvocation{org.apache.maven.plugins:maven-invoker-plugin:3.2.2@integration-test  integration-test}: windows-jdk15-m3.6.x_build\target\invoker-reports\*.xml
ERROR: [withMaven] invokerPublisher - Silently ignore exception archiving Invoker runs for Maven artifact MavenArtifact{org.apache.maven.plugins:maven-assembly-plugin:maven-plugin:3.3.1-SNAPSHOT(version: 3.3.1-SNAPSHOT, snapshot:false) } generated by PluginInvocation{org.apache.maven.plugins:maven-invoker-plugin:3.2.2@integration-test  integration-test}: java.io.IOException: Unknown attribute 'buildlog' for tag 'build-job' (position: START_TAG seen ...ndows-jdk15-m3.6.x_build\target\it\it-project-parent\build.log" />... @2:271)
[withMaven] Publishers: Generated Artifacts Publisher: 218 ms, Junit Publisher: 2915 ms, Open Task Scanner Publisher: 404 ms, Invoker Publisher: 908 ms
[Pipeline] // withMaven
[Pipeline] cleanWs
[WS-CLEANUP] Deleting project workspace...
[WS-CLEANUP] Deferred wipeout is used...
[withMaven] openTasksPublisher - Scan Tasks for Maven artifact org.apache.maven.plugins:maven-assembly-plugin:maven-plugin:3.3.1-SNAPSHOT in source directory windows-jdk16-m3.6.x_build\src\main\java
[WS-CLEANUP] done
[Pipeline] }
[TASKS] Scanning folder 'f:\jenkins\jenkins-slave\712657a4\workspace\box_maven-assembly-plugin_master@2' for files matching the pattern 'windows-jdk16-m3.6.x_build\src\main\java\**\*' - excludes: null
[TASKS] Found 82 files to scan for tasks
[TASKS] Found 14 open tasks.
Skipping warnings blame since pipelines do not have an SCM link.%n
[TASKS] Computing warning deltas based on reference build #34
[Pipeline] // stage
[Pipeline] }
[Pipeline] // ws
[Pipeline] }
[Pipeline] // node
[Pipeline] }
[withMaven] invokerPublisher - Archive invoker results for Maven artifact MavenArtifact{org.apache.maven.plugins:maven-assembly-plugin:maven-plugin:3.3.1-SNAPSHOT(version: 3.3.1-SNAPSHOT, snapshot:false) } generated by PluginInvocation{org.apache.maven.plugins:maven-invoker-plugin:3.2.2@integration-test  integration-test}: windows-jdk16-m3.6.x_build\target\invoker-reports\*.xml
ERROR: [withMaven] invokerPublisher - Silently ignore exception archiving Invoker runs for Maven artifact MavenArtifact{org.apache.maven.plugins:maven-assembly-plugin:maven-plugin:3.3.1-SNAPSHOT(version: 3.3.1-SNAPSHOT, snapshot:false) } generated by PluginInvocation{org.apache.maven.plugins:maven-invoker-plugin:3.2.2@integration-test  integration-test}: java.io.IOException: Unknown attribute 'buildlog' for tag 'build-job' (position: START_TAG seen ...ndows-jdk16-m3.6.x_build\target\it\it-project-parent\build.log" />... @2:271)
[withMaven] Publishers: Generated Artifacts Publisher: 212 ms, Junit Publisher: 2790 ms, Open Task Scanner Publisher: 424 ms, Invoker Publisher: 970 ms
[Pipeline] // withMaven
[Pipeline] cleanWs
[WS-CLEANUP] Deleting project workspace...
[WS-CLEANUP] Deferred wipeout is used...
[WS-CLEANUP] done
[Pipeline] }
[Pipeline] // stage
[Pipeline] }
[Pipeline] // ws
[Pipeline] }
[Pipeline] // node
[Pipeline] }
[Pipeline] // parallel
[Pipeline] stage
[Pipeline] { (Notifications)
[Pipeline] echo
Build result: FAILURE
[Pipeline] jiraIssueSelector
[Pipeline] echo
The authors of changes [slachiewicz].
[Pipeline] echo
Sending email ...
[Pipeline] emailext