Build failed in Jenkins: Maven » Maven TLP » maven-archetypes » master #24

Previous Topic Next Topic
 
classic Classic list List threaded Threaded
1 message Options
Reply | Threaded
Open this post in threaded view
|

Build failed in Jenkins: Maven » Maven TLP » maven-archetypes » master #24

Apache Jenkins Server-2
See https://ci-builds.apache.org/job/Maven/job/maven-box/job/maven-archetypes/job/master/24/

Changes:

* [MARCHETYPES-71] update plugins versions

All tests passed

Build log:
[...truncated 22407 lines...]
[INFO] [INFO] Downloading from central: https://repo.maven.apache.org/maven2/org/codehaus/plexus/plexus-interpolation/1.19/plexus-interpolation-1.19.pom
[INFO] [INFO] Downloaded from central: https://repo.maven.apache.org/maven2/org/codehaus/plexus/plexus-interpolation/1.19/plexus-interpolation-1.19.pom (1.0 kB at 33 kB/s)
[INFO] [INFO] Downloading from central: https://repo.maven.apache.org/maven2/org/apache/maven/maven-repository-metadata/3.1.1/maven-repository-metadata-3.1.1.pom
[INFO] [INFO] Downloaded from central: https://repo.maven.apache.org/maven2/org/apache/maven/maven-repository-metadata/3.1.1/maven-repository-metadata-3.1.1.pom (2.2 kB at 72 kB/s)
[INFO] [INFO] Downloading from central: https://repo.maven.apache.org/maven2/org/apache/maven/maven-model-builder/3.1.1/maven-model-builder-3.1.1.pom
[INFO] [INFO] Downloaded from central: https://repo.maven.apache.org/maven2/org/apache/maven/maven-model-builder/3.1.1/maven-model-builder-3.1.1.pom (2.8 kB at 91 kB/s)
[INFO] [INFO] Downloading from central: https://repo.maven.apache.org/maven2/org/apache/maven/maven-aether-provider/3.1.1/maven-aether-provider-3.1.1.pom
[INFO] [INFO] Downloaded from central: https://repo.maven.apache.org/maven2/org/apache/maven/maven-aether-provider/3.1.1/maven-aether-provider-3.1.1.pom (4.1 kB at 128 kB/s)
[INFO] [INFO] Downloading from central: https://repo.maven.apache.org/maven2/org/apache/maven/maven-plugin-api/3.1.1/maven-plugin-api-3.1.1.jar
[INFO] [INFO] Downloading from central: https://repo.maven.apache.org/maven2/org/eclipse/sisu/org.eclipse.sisu.inject/0.0.0.M5/org.eclipse.sisu.inject-0.0.0.M5.jar
[INFO] [INFO] Downloading from central: https://repo.maven.apache.org/maven2/org/eclipse/sisu/org.eclipse.sisu.plexus/0.0.0.M5/org.eclipse.sisu.plexus-0.0.0.M5.jar
[INFO] [INFO] Downloading from central: https://repo.maven.apache.org/maven2/org/apache/maven/maven-model/3.1.1/maven-model-3.1.1.jar
[INFO] [INFO] Downloading from central: https://repo.maven.apache.org/maven2/org/apache/maven/maven-core/3.1.1/maven-core-3.1.1.jar
[INFO] [INFO] Downloaded from central: https://repo.maven.apache.org/maven2/org/apache/maven/maven-model/3.1.1/maven-model-3.1.1.jar (154 kB at 1.4 MB/s)
[INFO] [INFO] Downloading from central: https://repo.maven.apache.org/maven2/org/apache/maven/maven-settings/3.1.1/maven-settings-3.1.1.jar
[INFO] [INFO] Downloaded from central: https://repo.maven.apache.org/maven2/org/apache/maven/maven-plugin-api/3.1.1/maven-plugin-api-3.1.1.jar (45 kB at 365 kB/s)
[INFO] [INFO] Downloading from central: https://repo.maven.apache.org/maven2/org/apache/maven/maven-settings-builder/3.1.1/maven-settings-builder-3.1.1.jar
[INFO] [INFO] Downloaded from central: https://repo.maven.apache.org/maven2/org/apache/maven/maven-core/3.1.1/maven-core-3.1.1.jar (557 kB at 3.9 MB/s)
[INFO] [INFO] Downloading from central: https://repo.maven.apache.org/maven2/org/apache/maven/maven-repository-metadata/3.1.1/maven-repository-metadata-3.1.1.jar
[INFO] [INFO] Downloaded from central: https://repo.maven.apache.org/maven2/org/apache/maven/maven-settings/3.1.1/maven-settings-3.1.1.jar (42 kB at 286 kB/s)
[INFO] [INFO] Downloading from central: https://repo.maven.apache.org/maven2/org/apache/maven/maven-model-builder/3.1.1/maven-model-builder-3.1.1.jar
[INFO] [INFO] Downloaded from central: https://repo.maven.apache.org/maven2/org/eclipse/sisu/org.eclipse.sisu.plexus/0.0.0.M5/org.eclipse.sisu.plexus-0.0.0.M5.jar (197 kB at 1.3 MB/s)
[INFO] [INFO] Downloading from central: https://repo.maven.apache.org/maven2/org/apache/maven/maven-aether-provider/3.1.1/maven-aether-provider-3.1.1.jar
[INFO] [INFO] Downloaded from central: https://repo.maven.apache.org/maven2/org/apache/maven/maven-settings-builder/3.1.1/maven-settings-builder-3.1.1.jar (42 kB at 257 kB/s)
[INFO] [INFO] Downloading from central: https://repo.maven.apache.org/maven2/org/codehaus/plexus/plexus-classworlds/2.5.1/plexus-classworlds-2.5.1.jar
[INFO] [INFO] Downloaded from central: https://repo.maven.apache.org/maven2/org/apache/maven/maven-repository-metadata/3.1.1/maven-repository-metadata-3.1.1.jar (25 kB at 143 kB/s)
[INFO] [INFO] Downloaded from central: https://repo.maven.apache.org/maven2/org/eclipse/sisu/org.eclipse.sisu.inject/0.0.0.M5/org.eclipse.sisu.inject-0.0.0.M5.jar (291 kB at 1.6 MB/s)
[INFO] [INFO] Downloading from central: https://repo.maven.apache.org/maven2/org/apache/maven/maven-artifact/3.1.1/maven-artifact-3.1.1.jar
[INFO] [INFO] Downloaded from central: https://repo.maven.apache.org/maven2/org/apache/maven/maven-aether-provider/3.1.1/maven-aether-provider-3.1.1.jar (60 kB at 314 kB/s)
[INFO] [INFO] Downloaded from central: https://repo.maven.apache.org/maven2/org/apache/maven/maven-model-builder/3.1.1/maven-model-builder-3.1.1.jar (160 kB at 831 kB/s)
[INFO] [INFO] Downloaded from central: https://repo.maven.apache.org/maven2/org/codehaus/plexus/plexus-classworlds/2.5.1/plexus-classworlds-2.5.1.jar (50 kB at 255 kB/s)
[INFO] [INFO] Downloaded from central: https://repo.maven.apache.org/maven2/org/apache/maven/maven-artifact/3.1.1/maven-artifact-3.1.1.jar (52 kB at 248 kB/s)
[INFO] [INFO] Building EJB ejbs-0.1-SNAPSHOT with EJB version 3.1
[INFO] [INFO] Building jar: F:\jenkins\jenkins-slave\712657a4\workspace\aven-box_maven-archetypes_master@2\m\maven-archetype-j2ee-simple\target\test-classes\projects\it-basic\project\basic-j2ee-simple\ejbs\target\ejbs-0.1-SNAPSHOT.jar
[INFO] [INFO]
[INFO] [INFO] --------------------------< archetype.it:ear >--------------------------
[INFO] [INFO] Building ear assembly 0.1-SNAPSHOT                                 [8/8]
[INFO] [INFO] --------------------------------[ ear ]---------------------------------
[INFO] [INFO] Downloading from central: https://repo.maven.apache.org/maven2/org/apache/maven/plugins/maven-ear-plugin/3.2.0/maven-ear-plugin-3.2.0.pom
[INFO] [WARNING] The POM for org.apache.maven.plugins:maven-ear-plugin:jar:3.2.0 is missing, no dependency information available
[INFO] [INFO] Downloading from central: https://repo.maven.apache.org/maven2/org/apache/maven/plugins/maven-ear-plugin/3.2.0/maven-ear-plugin-3.2.0.jar
[INFO] [INFO] ------------------------------------------------------------------------
[INFO] [INFO] Reactor Summary for basic-j2ee-simple 0.1-SNAPSHOT:
[INFO] [INFO]
[INFO] [INFO] basic-j2ee-simple .................................. SUCCESS [  0.006 s]
[INFO] [INFO] sub projects ....................................... SUCCESS [  0.004 s]
[INFO] [INFO] logging ............................................ SUCCESS [  2.230 s]
[INFO] [INFO] core project classes ............................... SUCCESS [  0.118 s]
[INFO] [INFO] servlets ........................................... SUCCESS [  0.004 s]
[INFO] [INFO] servlet ............................................ SUCCESS [  2.452 s]
[INFO] [INFO] enterprise java beans .............................. SUCCESS [  3.294 s]
[INFO] [INFO] ear assembly ....................................... FAILURE [  0.034 s]
[INFO] [INFO] ------------------------------------------------------------------------
[INFO] [INFO] BUILD FAILURE
[INFO] [INFO] ------------------------------------------------------------------------
[INFO] [INFO] Total time:  8.351 s
[INFO] [INFO] Finished at: 2020-12-30T14:50:23-08:00
[INFO] [INFO] ------------------------------------------------------------------------
[INFO] [INFO] [jenkins-event-spy] Generated F:\jenkins\jenkins-slave\712657a4\workspace\aven-box_maven-archetypes_master@2@tmp\withMaven9c933f48\maven-spy-20201230-145015-1194694957644512583882.log
[INFO] [ERROR] Plugin org.apache.maven.plugins:maven-ear-plugin:3.2.0 or one of its dependencies could not be resolved: Could not find artifact org.apache.maven.plugins:maven-ear-plugin:jar:3.2.0 in central (https://repo.maven.apache.org/maven2) -> [Help 1]
[INFO] org.apache.maven.plugin.PluginResolutionException: Plugin org.apache.maven.plugins:maven-ear-plugin:3.2.0 or one of its dependencies could not be resolved: Could not find artifact org.apache.maven.plugins:maven-ear-plugin:jar:3.2.0 in central (https://repo.maven.apache.org/maven2)
[INFO]     at org.apache.maven.plugin.internal.DefaultPluginDependenciesResolver.resolve (DefaultPluginDependenciesResolver.java:131)
[INFO]     at org.apache.maven.plugin.internal.DefaultMavenPluginManager.getPluginDescriptor (DefaultMavenPluginManager.java:182)
[INFO]     at org.apache.maven.plugin.internal.DefaultMavenPluginManager.getMojoDescriptor (DefaultMavenPluginManager.java:286)
[INFO]     at org.apache.maven.plugin.DefaultBuildPluginManager.getMojoDescriptor (DefaultBuildPluginManager.java:244)
[INFO]     at org.apache.maven.lifecycle.internal.DefaultLifecycleExecutionPlanCalculator.setupMojoExecution (DefaultLifecycleExecutionPlanCalculator.java:169)
[INFO]     at org.apache.maven.lifecycle.internal.DefaultLifecycleExecutionPlanCalculator.setupMojoExecutions (DefaultLifecycleExecutionPlanCalculator.java:154)
[INFO]     at org.apache.maven.lifecycle.internal.DefaultLifecycleExecutionPlanCalculator.calculateExecutionPlan (DefaultLifecycleExecutionPlanCalculator.java:130)
[INFO]     at org.apache.maven.lifecycle.internal.DefaultLifecycleExecutionPlanCalculator.calculateExecutionPlan (DefaultLifecycleExecutionPlanCalculator.java:144)
[INFO]     at org.apache.maven.lifecycle.internal.builder.BuilderCommon.resolveBuildPlan (BuilderCommon.java:97)
[INFO]     at org.apache.maven.lifecycle.internal.LifecycleModuleBuilder.buildProject (LifecycleModuleBuilder.java:111)
[INFO]     at org.apache.maven.lifecycle.internal.LifecycleModuleBuilder.buildProject (LifecycleModuleBuilder.java:81)
[INFO]     at org.apache.maven.lifecycle.internal.builder.singlethreaded.SingleThreadedBuilder.build (SingleThreadedBuilder.java:56)
[INFO]     at org.apache.maven.lifecycle.internal.LifecycleStarter.execute (LifecycleStarter.java:128)
[INFO]     at org.apache.maven.DefaultMaven.doExecute (DefaultMaven.java:305)
[INFO]     at org.apache.maven.DefaultMaven.doExecute (DefaultMaven.java:192)
[INFO]     at org.apache.maven.DefaultMaven.execute (DefaultMaven.java:105)
[INFO]     at org.apache.maven.cli.MavenCli.execute (MavenCli.java:956)
[INFO]     at org.apache.maven.cli.MavenCli.doMain (MavenCli.java:288)
[INFO]     at org.apache.maven.cli.MavenCli.main (MavenCli.java:192)
[INFO]     at jdk.internal.reflect.NativeMethodAccessorImpl.invoke0 (Native Method)
[INFO]     at jdk.internal.reflect.NativeMethodAccessorImpl.invoke (NativeMethodAccessorImpl.java:62)
[INFO]     at jdk.internal.reflect.DelegatingMethodAccessorImpl.invoke (DelegatingMethodAccessorImpl.java:43)
[INFO]     at java.lang.reflect.Method.invoke (Method.java:564)
[INFO]     at org.codehaus.plexus.classworlds.launcher.Launcher.launchEnhanced (Launcher.java:282)
[INFO]     at org.codehaus.plexus.classworlds.launcher.Launcher.launch (Launcher.java:225)
[INFO]     at org.codehaus.plexus.classworlds.launcher.Launcher.mainWithExitCode (Launcher.java:406)
[INFO]     at org.codehaus.plexus.classworlds.launcher.Launcher.main (Launcher.java:347)
[INFO] Caused by: org.eclipse.aether.resolution.ArtifactResolutionException: Could not find artifact org.apache.maven.plugins:maven-ear-plugin:jar:3.2.0 in central (https://repo.maven.apache.org/maven2)
[INFO]     at org.eclipse.aether.internal.impl.DefaultArtifactResolver.resolve (DefaultArtifactResolver.java:424)
[INFO]     at org.eclipse.aether.internal.impl.DefaultArtifactResolver.resolveArtifacts (DefaultArtifactResolver.java:229)
[INFO]     at org.eclipse.aether.internal.impl.DefaultArtifactResolver.resolveArtifact (DefaultArtifactResolver.java:207)
[INFO]     at org.eclipse.aether.internal.impl.DefaultRepositorySystem.resolveArtifact (DefaultRepositorySystem.java:262)
[INFO]     at org.apache.maven.plugin.internal.DefaultPluginDependenciesResolver.resolve (DefaultPluginDependenciesResolver.java:127)
[INFO]     at org.apache.maven.plugin.internal.DefaultMavenPluginManager.getPluginDescriptor (DefaultMavenPluginManager.java:182)
[INFO]     at org.apache.maven.plugin.internal.DefaultMavenPluginManager.getMojoDescriptor (DefaultMavenPluginManager.java:286)
[INFO]     at org.apache.maven.plugin.DefaultBuildPluginManager.getMojoDescriptor (DefaultBuildPluginManager.java:244)
[INFO]     at org.apache.maven.lifecycle.internal.DefaultLifecycleExecutionPlanCalculator.setupMojoExecution (DefaultLifecycleExecutionPlanCalculator.java:169)
[INFO]     at org.apache.maven.lifecycle.internal.DefaultLifecycleExecutionPlanCalculator.setupMojoExecutions (DefaultLifecycleExecutionPlanCalculator.java:154)
[INFO]     at org.apache.maven.lifecycle.internal.DefaultLifecycleExecutionPlanCalculator.calculateExecutionPlan (DefaultLifecycleExecutionPlanCalculator.java:130)
[INFO]     at org.apache.maven.lifecycle.internal.DefaultLifecycleExecutionPlanCalculator.calculateExecutionPlan (DefaultLifecycleExecutionPlanCalculator.java:144)
[INFO]     at org.apache.maven.lifecycle.internal.builder.BuilderCommon.resolveBuildPlan (BuilderCommon.java:97)
[INFO]     at org.apache.maven.lifecycle.internal.LifecycleModuleBuilder.buildProject (LifecycleModuleBuilder.java:111)
[INFO]     at org.apache.maven.lifecycle.internal.LifecycleModuleBuilder.buildProject (LifecycleModuleBuilder.java:81)
[INFO]     at org.apache.maven.lifecycle.internal.builder.singlethreaded.SingleThreadedBuilder.build (SingleThreadedBuilder.java:56)
[INFO]     at org.apache.maven.lifecycle.internal.LifecycleStarter.execute (LifecycleStarter.java:128)
[INFO]     at org.apache.maven.DefaultMaven.doExecute (DefaultMaven.java:305)
[INFO]     at org.apache.maven.DefaultMaven.doExecute (DefaultMaven.java:192)
[INFO]     at org.apache.maven.DefaultMaven.execute (DefaultMaven.java:105)
[INFO]     at org.apache.maven.cli.MavenCli.execute (MavenCli.java:956)
[INFO]     at org.apache.maven.cli.MavenCli.doMain (MavenCli.java:288)
[INFO]     at org.apache.maven.cli.MavenCli.main (MavenCli.java:192)
[INFO]     at jdk.internal.reflect.NativeMethodAccessorImpl.invoke0 (Native Method)
[INFO]     at jdk.internal.reflect.NativeMethodAccessorImpl.invoke (NativeMethodAccessorImpl.java:62)
[INFO]     at jdk.internal.reflect.DelegatingMethodAccessorImpl.invoke (DelegatingMethodAccessorImpl.java:43)
[INFO]     at java.lang.reflect.Method.invoke (Method.java:564)
[INFO]     at org.codehaus.plexus.classworlds.launcher.Launcher.launchEnhanced (Launcher.java:282)
[INFO]     at org.codehaus.plexus.classworlds.launcher.Launcher.launch (Launcher.java:225)
[INFO]     at org.codehaus.plexus.classworlds.launcher.Launcher.mainWithExitCode (Launcher.java:406)
[INFO]     at org.codehaus.plexus.classworlds.launcher.Launcher.main (Launcher.java:347)
[INFO] Caused by: org.eclipse.aether.transfer.ArtifactNotFoundException: Could not find artifact org.apache.maven.plugins:maven-ear-plugin:jar:3.2.0 in central (https://repo.maven.apache.org/maven2)
[INFO]     at org.eclipse.aether.connector.basic.ArtifactTransportListener.transferFailed (ArtifactTransportListener.java:48)
[INFO]     at org.eclipse.aether.connector.basic.BasicRepositoryConnector$TaskRunner.run (BasicRepositoryConnector.java:369)
[INFO]     at org.eclipse.aether.util.concurrency.RunnableErrorForwarder$1.run (RunnableErrorForwarder.java:75)
[INFO]     at org.eclipse.aether.connector.basic.BasicRepositoryConnector$DirectExecutor.execute (BasicRepositoryConnector.java:644)
[INFO]     at org.eclipse.aether.connector.basic.BasicRepositoryConnector.get (BasicRepositoryConnector.java:262)
[INFO]     at org.eclipse.aether.internal.impl.DefaultArtifactResolver.performDownloads (DefaultArtifactResolver.java:499)
[INFO]     at org.eclipse.aether.internal.impl.DefaultArtifactResolver.resolve (DefaultArtifactResolver.java:401)
[INFO]     at org.eclipse.aether.internal.impl.DefaultArtifactResolver.resolveArtifacts (DefaultArtifactResolver.java:229)
[INFO]     at org.eclipse.aether.internal.impl.DefaultArtifactResolver.resolveArtifact (DefaultArtifactResolver.java:207)
[INFO]     at org.eclipse.aether.internal.impl.DefaultRepositorySystem.resolveArtifact (DefaultRepositorySystem.java:262)
[INFO]     at org.apache.maven.plugin.internal.DefaultPluginDependenciesResolver.resolve (DefaultPluginDependenciesResolver.java:127)
[INFO]     at org.apache.maven.plugin.internal.DefaultMavenPluginManager.getPluginDescriptor (DefaultMavenPluginManager.java:182)
[INFO]     at org.apache.maven.plugin.internal.DefaultMavenPluginManager.getMojoDescriptor (DefaultMavenPluginManager.java:286)
[INFO]     at org.apache.maven.plugin.DefaultBuildPluginManager.getMojoDescriptor (DefaultBuildPluginManager.java:244)
[INFO]     at org.apache.maven.lifecycle.internal.DefaultLifecycleExecutionPlanCalculator.setupMojoExecution (DefaultLifecycleExecutionPlanCalculator.java:169)
[INFO]     at org.apache.maven.lifecycle.internal.DefaultLifecycleExecutionPlanCalculator.setupMojoExecutions (DefaultLifecycleExecutionPlanCalculator.java:154)
[INFO]     at org.apache.maven.lifecycle.internal.DefaultLifecycleExecutionPlanCalculator.calculateExecutionPlan (DefaultLifecycleExecutionPlanCalculator.java:130)
[INFO]     at org.apache.maven.lifecycle.internal.DefaultLifecycleExecutionPlanCalculator.calculateExecutionPlan (DefaultLifecycleExecutionPlanCalculator.java:144)
[INFO]     at org.apache.maven.lifecycle.internal.builder.BuilderCommon.resolveBuildPlan (BuilderCommon.java:97)
[INFO]     at org.apache.maven.lifecycle.internal.LifecycleModuleBuilder.buildProject (LifecycleModuleBuilder.java:111)
[INFO]     at org.apache.maven.lifecycle.internal.LifecycleModuleBuilder.buildProject (LifecycleModuleBuilder.java:81)
[INFO]     at org.apache.maven.lifecycle.internal.builder.singlethreaded.SingleThreadedBuilder.build (SingleThreadedBuilder.java:56)
[INFO]     at org.apache.maven.lifecycle.internal.LifecycleStarter.execute (LifecycleStarter.java:128)
[INFO]     at org.apache.maven.DefaultMaven.doExecute (DefaultMaven.java:305)
[INFO]     at org.apache.maven.DefaultMaven.doExecute (DefaultMaven.java:192)
[INFO]     at org.apache.maven.DefaultMaven.execute (DefaultMaven.java:105)
[INFO]     at org.apache.maven.cli.MavenCli.execute (MavenCli.java:956)
[INFO]     at org.apache.maven.cli.MavenCli.doMain (MavenCli.java:288)
[INFO]     at org.apache.maven.cli.MavenCli.main (MavenCli.java:192)
[INFO]     at jdk.internal.reflect.NativeMethodAccessorImpl.invoke0 (Native Method)
[INFO]     at jdk.internal.reflect.NativeMethodAccessorImpl.invoke (NativeMethodAccessorImpl.java:62)
[INFO]     at jdk.internal.reflect.DelegatingMethodAccessorImpl.invoke (DelegatingMethodAccessorImpl.java:43)
[INFO]     at java.lang.reflect.Method.invoke (Method.java:564)
[INFO]     at org.codehaus.plexus.classworlds.launcher.Launcher.launchEnhanced (Launcher.java:282)
[INFO]     at org.codehaus.plexus.classworlds.launcher.Launcher.launch (Launcher.java:225)
[INFO]     at org.codehaus.plexus.classworlds.launcher.Launcher.mainWithExitCode (Launcher.java:406)
[INFO]     at org.codehaus.plexus.classworlds.launcher.Launcher.main (Launcher.java:347)
[INFO] [ERROR]
[INFO] [ERROR] Re-run Maven using the -X switch to enable full debug logging.
[INFO] [ERROR]
[INFO] [ERROR] For more information about the errors and possible solutions, please read the following articles:
[INFO] [ERROR] [Help 1] http://cwiki.apache.org/confluence/display/MAVEN/PluginResolutionException
[INFO] Post-archetype-generation invoker exit code: 1
[INFO] ------------------------------------------------------------------------
[INFO] Reactor Summary for Apache Maven Archetypes 1.5-SNAPSHOT:
[INFO]
[INFO] Apache Maven Archetypes ............................ SUCCESS [ 40.977 s]
[INFO] Maven Archetype Archetype .......................... SUCCESS [ 26.919 s]
[INFO] Maven Simple J2EE Archetype ........................ FAILURE [ 11.124 s]
[INFO] Maven Plugin Archetype ............................. SKIPPED
[INFO] Maven Plugin Site Archetype ........................ SKIPPED
[INFO] Maven Portlet Archetype ............................ SKIPPED
[INFO] Maven Quickstart Archetype ......................... SKIPPED
[INFO] Maven Simple Project Archetype ..................... SKIPPED
[INFO] Maven Site Archetype ............................... SKIPPED
[INFO] Maven Archetype for Simple Site .................... SKIPPED
[INFO] Maven Site Skin Archetype .......................... SKIPPED
[INFO] Maven Webapp Archetype ............................. SKIPPED
[INFO] ------------------------------------------------------------------------
[INFO] BUILD FAILURE
[INFO] ------------------------------------------------------------------------
[INFO] Total time:  01:21 min
[INFO] Finished at: 2020-12-30T14:50:23-08:00
[INFO] ------------------------------------------------------------------------
[WARNING] The requested profile "run-its" could not be activated because it does not exist.
[INFO] [jenkins-event-spy] Generated F:\jenkins\jenkins-slave\712657a4\workspace\aven-box_maven-archetypes_master@2@tmp\withMaven9c933f48\maven-spy-20201230-144902-64516468483253703280509.log
[ERROR] Failed to execute goal org.apache.maven.plugins:maven-archetype-plugin:3.2.0:integration-test (default-integration-test) on project maven-archetype-j2ee-simple:
[ERROR] Archetype IT 'it-basic' failed: Execution failure: exit code = 1
[ERROR] -> [Help 1]
[ERROR]
[ERROR] To see the full stack trace of the errors, re-run Maven with the -e switch.
[ERROR] Re-run Maven using the -X switch to enable full debug logging.
[ERROR]
[ERROR] For more information about the errors and possible solutions, please read the following articles:
[ERROR] [Help 1] http://cwiki.apache.org/confluence/display/MAVEN/MojoExecutionException
[ERROR]
[ERROR] After correcting the problems, you can resume the build with the command
[ERROR]   mvn <args> -rf :maven-archetype-j2ee-simple
[Pipeline] }
[Pipeline] // dir
[Pipeline] }
[withMaven] Publishers:
[withMaven] Publishers:
[withMaven] junitPublisher - Archive test results for Maven artifact archetype.it:basic-project:jar:0.1-SNAPSHOT generated by maven-surefire-plugin:test (default-test): m\maven-archetype-archetype\target\test-classes\projects\it-basic\project\basic-archetype\target\test-classes\projects\it-basic\project\basic-project\target\surefire-reports\*.xml
Recording test results
[withMaven] Publishers: Junit Publisher: 1565 ms
[withMaven] junitPublisher - Archive test results for Maven artifact archetype.it:logging:jar:0.1-SNAPSHOT generated by maven-surefire-plugin:test (default-test): m\maven-archetype-j2ee-simple\target\test-classes\projects\it-basic\project\basic-j2ee-simple\projects\logging\target\surefire-reports\*.xml
[withMaven] junitPublisher - Archive test results for Maven artifact archetype.it:primary-source:jar:0.1-SNAPSHOT generated by maven-surefire-plugin:test (default-test): m\maven-archetype-j2ee-simple\target\test-classes\projects\it-basic\project\basic-j2ee-simple\primary-source\target\surefire-reports\*.xml
[withMaven] junitPublisher - Archive test results for Maven artifact archetype.it:servlet:war:0.1-SNAPSHOT generated by maven-surefire-plugin:test (default-test): m\maven-archetype-j2ee-simple\target\test-classes\projects\it-basic\project\basic-j2ee-simple\servlets\servlet\target\surefire-reports\*.xml
[withMaven] junitPublisher - Archive test results for Maven artifact archetype.it:ejbs:ejb:0.1-SNAPSHOT generated by maven-surefire-plugin:test (default-test): m\maven-archetype-j2ee-simple\target\test-classes\projects\it-basic\project\basic-j2ee-simple\ejbs\target\surefire-reports\*.xml
Recording test results
None of the test reports contained any result
[withMaven] Publishers: Junit Publisher: 37 ms
[Pipeline] // withMaven
[Pipeline] echo
[FAILURE-004] hudson.AbortException: script returned exit code 1
[Pipeline] cleanWs
[WS-CLEANUP] Deleting project workspace...
[WS-CLEANUP] Deferred wipeout is used...
[WS-CLEANUP] done
[Pipeline] cleanWs
[WS-CLEANUP] Deleting project workspace...
[WS-CLEANUP] Deferred wipeout is used...
[WS-CLEANUP] done
[Pipeline] }
[Pipeline] // stage
[Pipeline] }
[Pipeline] // ws
[Pipeline] }
[Pipeline] // withEnv
[Pipeline] }
[Pipeline] // node
[Pipeline] }
Failed in branch windows-jdk15
[Pipeline] // parallel
[Pipeline] echo
[FAILURE-003] AbortException hudson.AbortException: script returned exit code 1
[Pipeline] stage
[Pipeline] { (Notifications)
[Pipeline] echo
Build result: FAILURE
[Pipeline] jiraIssueSelector
[Pipeline] jiraComment
[Pipeline] echo
The authors of changes [hboutemy].
[Pipeline] echo
Sending email ...
[Pipeline] emailext