Build failed in Jenkins: Maven » Maven TLP » maven-archetypes » master #20

Previous Topic Next Topic
 
classic Classic list List threaded Threaded
1 message Options
Reply | Threaded
Open this post in threaded view
|

Build failed in Jenkins: Maven » Maven TLP » maven-archetypes » master #20

Apache Jenkins Server-2
See https://ci-builds.apache.org/job/Maven/job/maven-box/job/maven-archetypes/job/master/20/

Changes:

* [MARCHETYPES-70] enable generating Java 9+ projects and add support for JUnit 5.x

All tests passed

Build log:
[...truncated 41832 lines...]
[INFO] [INFO] Using 'UTF-8' encoding to copy filtered resources.
[INFO] [INFO] skip non existing resourceDirectory F:\jenkins\jenkins-slave\712657a4\workspace\aven-box_maven-archetypes_master@2\m\maven-archetype-webapp\target\test-classes\projects\it-basic\project\basic-webapp\src\main\resources
[INFO] [INFO]
[INFO] [INFO] --- maven-compiler-plugin:3.8.0:compile (default-compile) @ basic-webapp ---
[INFO] [INFO] No sources to compile
[INFO] [INFO]
[INFO] [INFO] --- maven-resources-plugin:3.0.2:testResources (default-testResources) @ basic-webapp ---
[INFO] [INFO] Using 'UTF-8' encoding to copy filtered resources.
[INFO] [INFO] skip non existing resourceDirectory F:\jenkins\jenkins-slave\712657a4\workspace\aven-box_maven-archetypes_master@2\m\maven-archetype-webapp\target\test-classes\projects\it-basic\project\basic-webapp\src\test\resources
[INFO] [INFO]
[INFO] [INFO] --- maven-compiler-plugin:3.8.0:testCompile (default-testCompile) @ basic-webapp ---
[INFO] [INFO] No sources to compile
[INFO] [INFO]
[INFO] [INFO] --- maven-surefire-plugin:2.22.1:test (default-test) @ basic-webapp ---
[withMaven] Publishers: Junit Publisher: 1484 ms
[withMaven] junitPublisher - Archive test results for Maven artifact archetype.it:logging:jar:0.1-SNAPSHOT generated by maven-surefire-plugin:test (default-test): m\maven-archetype-j2ee-simple\target\test-classes\projects\it-basic\project\basic-j2ee-simple\projects\logging\target\surefire-reports\*.xml
[withMaven] junitPublisher - Archive test results for Maven artifact archetype.it:primary-source:jar:0.1-SNAPSHOT generated by maven-surefire-plugin:test (default-test): m\maven-archetype-j2ee-simple\target\test-classes\projects\it-basic\project\basic-j2ee-simple\primary-source\target\surefire-reports\*.xml
[withMaven] junitPublisher - Archive test results for Maven artifact archetype.it:servlet:war:0.1-SNAPSHOT generated by maven-surefire-plugin:test (default-test): m\maven-archetype-j2ee-simple\target\test-classes\projects\it-basic\project\basic-j2ee-simple\servlets\servlet\target\surefire-reports\*.xml
[withMaven] junitPublisher - Archive test results for Maven artifact archetype.it:ejbs:ejb:0.1-SNAPSHOT generated by maven-surefire-plugin:test (default-test): m\maven-archetype-j2ee-simple\target\test-classes\projects\it-basic\project\basic-j2ee-simple\ejbs\target\surefire-reports\*.xml
Recording test results
None of the test reports contained any result
[withMaven] Publishers: Junit Publisher: 30 ms
[withMaven] junitPublisher - Archive test results for Maven artifact archetype.it:basic-plugin:maven-plugin:0.1-SNAPSHOT generated by maven-surefire-plugin:test (default-test): m\maven-archetype-plugin\target\test-classes\projects\it-basic\project\basic-plugin\target\surefire-reports\*.xml
Recording test results
[INFO] [INFO] No tests to run.
[INFO] [INFO]
[INFO] [INFO] --- maven-war-plugin:3.2.2:war (default-war) @ basic-webapp ---
[withMaven] Publishers: Junit Publisher: 120 ms
[withMaven] Publishers:
[withMaven] Publishers:
[withMaven] junitPublisher - Archive test results for Maven artifact archetype.it:basic-portlet:war:0.1-SNAPSHOT generated by maven-surefire-plugin:test (default-test): m\maven-archetype-portlet\target\test-classes\projects\it-basic\project\basic-portlet\target\surefire-reports\*.xml
Recording test results
[INFO] [INFO] Packaging webapp
[INFO] [INFO] Assembling webapp [basic-webapp] in [F:\jenkins\jenkins-slave\712657a4\workspace\aven-box_maven-archetypes_master@2\m\maven-archetype-webapp\target\test-classes\projects\it-basic\project\basic-webapp\target\basic-webapp]
[INFO] [INFO] Processing war project
[INFO] [INFO] Copying webapp resources [F:\jenkins\jenkins-slave\712657a4\workspace\aven-box_maven-archetypes_master@2\m\maven-archetype-webapp\target\test-classes\projects\it-basic\project\basic-webapp\src\main\webapp]
[INFO] [INFO] Webapp assembled in [45 msecs]
[withMaven] openTasksPublisher - Scan Tasks for Maven artifact archetype.it:java-8-quickstart:jar:0.1-SNAPSHOT in source directory m/maven-archetype-quickstart/target/test-classes/projects/it-java-8/project/java-8-quickstart/src/main/java
None of the test reports contained any result
[withMaven] Publishers: Junit Publisher: 29 ms
[withMaven] junitPublisher - Archive test results for Maven artifact archetype.it:basic-quickstart:jar:0.1-SNAPSHOT generated by maven-surefire-plugin:test (default-test): m\maven-archetype-quickstart\target\test-classes\projects\it-basic\project\basic-quickstart\target\surefire-reports\*.xml
Recording test results
[TASKS] Scanning folder '/home/jenkins/workspace/aven-box_maven-archetypes_master@2' for files matching the pattern 'm/maven-archetype-quickstart/target/test-classes/projects/it-java-8/project/java-8-quickstart/src/main/java/**/*' - excludes: null
[TASKS] Found 1 files to scan for tasks
[TASKS] Found 0 open tasks.
Skipping warnings blame since pipelines do not have an SCM link.%n
[TASKS] Computing warning deltas based on reference build #19
[withMaven] Publishers: Junit Publisher: 115 ms
[withMaven] Publishers:
[INFO] [INFO] Building war: F:\jenkins\jenkins-slave\712657a4\workspace\aven-box_maven-archetypes_master@2\m\maven-archetype-webapp\target\test-classes\projects\it-basic\project\basic-webapp\target\basic-webapp.war
[INFO] [INFO] ------------------------------------------------------------------------
[INFO] [INFO] BUILD SUCCESS
[INFO] [INFO] ------------------------------------------------------------------------
[INFO] [INFO] Total time:  1.714 s
[INFO] [INFO] Finished at: 2020-11-24T19:44:26-08:00
[INFO] [INFO] ------------------------------------------------------------------------
[INFO] [INFO] [jenkins-event-spy] Generated F:\jenkins\jenkins-slave\712657a4\workspace\aven-box_maven-archetypes_master@2@tmp\withMavenae1e29ca\maven-spy-20201124-194424-4772182342313743436378.log
[INFO] Picked up JAVA_TOOL_OPTIONS: -Dmaven.ext.class.path="f:\jenkins\jenkins-slave\712657a4\workspace\aven-box_maven-archetypes_master@2@tmp\withMavenae1e29ca\pipeline-maven-spy.jar" -Dorg.jenkinsci.plugins.pipeline.maven.reportsFolder="f:\jenkins\jenkins-slave\712657a4\workspace\aven-box_maven-archetypes_master@2@tmp\withMavenae1e29ca"
[INFO] Post-archetype-generation invoker exit code: 0
[INFO]
[INFO] --- maven-checkstyle-plugin:3.0.0:check (checkstyle-check) @ maven-archetype-webapp ---
[withMaven] Publishers:
[withMaven] Publishers:
[withMaven] Publishers:
[withMaven] junitPublisher - Archive test results for Maven artifact archetype.it:basic-simple:jar:0.1-SNAPSHOT generated by maven-surefire-plugin:test (default-test): m\maven-archetype-simple\target\test-classes\projects\it-basic\project\basic-simple\target\surefire-reports\*.xml
Recording test results
[INFO] ------------------------------------------------------------------------
[INFO] Reactor Summary for Apache Maven Archetypes 1.5-SNAPSHOT:
[INFO]
[INFO] Apache Maven Archetypes ............................ SUCCESS [ 42.918 s]
[INFO] Maven Archetype Archetype .......................... SUCCESS [ 23.475 s]
[INFO] Maven Simple J2EE Archetype ........................ SUCCESS [  9.144 s]
[INFO] Maven Plugin Archetype ............................. SUCCESS [ 38.642 s]
[INFO] Maven Plugin Site Archetype ........................ SUCCESS [ 18.309 s]
[INFO] Maven Portlet Archetype ............................ SUCCESS [  7.050 s]
[INFO] Maven Quickstart Archetype ......................... SUCCESS [ 17.660 s]
[INFO] Maven Simple Project Archetype ..................... SUCCESS [  9.483 s]
[INFO] Maven Site Archetype ............................... SUCCESS [ 32.261 s]
[INFO] Maven Archetype for Simple Site .................... SUCCESS [  6.039 s]
[INFO] Maven Site Skin Archetype .......................... SUCCESS [ 36.134 s]
[INFO] Maven Webapp Archetype ............................. SUCCESS [  3.938 s]
[INFO] ------------------------------------------------------------------------
[INFO] BUILD SUCCESS
[INFO] ------------------------------------------------------------------------
[INFO] Total time:  04:07 min
[INFO] Finished at: 2020-11-24T19:44:26-08:00
[INFO] ------------------------------------------------------------------------
[WARNING] The requested profile "run-its" could not be activated because it does not exist.
[INFO] [jenkins-event-spy] Generated F:\jenkins\jenkins-slave\712657a4\workspace\aven-box_maven-archetypes_master@2@tmp\withMavenae1e29ca\maven-spy-20201124-194019-2578195840131174073220.log
Picked up JAVA_TOOL_OPTIONS: -Dmaven.ext.class.path="f:\jenkins\jenkins-slave\712657a4\workspace\aven-box_maven-archetypes_master@2@tmp\withMavenae1e29ca\pipeline-maven-spy.jar" -Dorg.jenkinsci.plugins.pipeline.maven.reportsFolder="f:\jenkins\jenkins-slave\712657a4\workspace\aven-box_maven-archetypes_master@2@tmp\withMavenae1e29ca"
[withMaven] Publishers: Generated Artifacts Publisher: 864 ms, Open Task Scanner Publisher: 351 ms
[withMaven] Publishers: Junit Publisher: 119 ms
[withMaven] Publishers:
[withMaven] Publishers:
[Pipeline] }
[Pipeline] // dir
[Pipeline] }
[withMaven] junitPublisher - Archive test results for Maven artifact archetype.it:basic-skin:jar:0.1-SNAPSHOT generated by maven-surefire-plugin:test (default-test): m\maven-archetype-site-skin\target\test-classes\projects\it-basic\project\basic-skin\target\surefire-reports\*.xml
Recording test results
None of the test reports contained any result
[withMaven] Publishers: Junit Publisher: 29 ms
[withMaven] Publishers:
[withMaven] junitPublisher - Archive test results for Maven artifact archetype.it:basic-webapp:war:0.1-SNAPSHOT generated by maven-surefire-plugin:test (default-test): m\maven-archetype-webapp\target\test-classes\projects\it-basic\project\basic-webapp\target\surefire-reports\*.xml
Recording test results
None of the test reports contained any result
[withMaven] Publishers: Junit Publisher: 29 ms
[Pipeline] // withMaven
[Pipeline] cleanWs
[WS-CLEANUP] Deleting project workspace...
[WS-CLEANUP] Deferred wipeout is used...
[WS-CLEANUP] done
[Pipeline] }
[withMaven] artifactsPublisher - Archive artifact m/maven-archetype-quickstart/target/test-classes/projects/it-java-11/project/java-11-quickstart/pom.xml under archetype/it/java-11-quickstart/0.1-SNAPSHOT/java-11-quickstart-0.1-SNAPSHOT.pom
[withMaven] Publishers:
[withMaven] Publishers:
[Pipeline] // stage
[Pipeline] }
[Pipeline] // ws
[Pipeline] }
[Pipeline] // withEnv
[Pipeline] }
[Pipeline] // node
[Pipeline] }
[withMaven] junitPublisher - Archive test results for Maven artifact archetype.it:basic-project:jar:0.1-SNAPSHOT generated by maven-surefire-plugin:test (default-test): m\maven-archetype-archetype\target\test-classes\projects\it-basic\project\basic-archetype\target\test-classes\projects\it-basic\project\basic-project\target\surefire-reports\*.xml
Recording test results
[withMaven] openTasksPublisher - Scan Tasks for Maven artifact archetype.it:java-11-quickstart:jar:0.1-SNAPSHOT in source directory m/maven-archetype-quickstart/target/test-classes/projects/it-java-11/project/java-11-quickstart/src/main/java
[TASKS] Scanning folder '/home/jenkins/workspace/aven-box_maven-archetypes_master@2' for files matching the pattern 'm/maven-archetype-quickstart/target/test-classes/projects/it-java-11/project/java-11-quickstart/src/main/java/**/*' - excludes: null
[TASKS] Found 1 files to scan for tasks
[TASKS] Found 0 open tasks.
Skipping warnings blame since pipelines do not have an SCM link.%n
[TASKS] Computing warning deltas based on reference build #19
[withMaven] Publishers: Junit Publisher: 1647 ms
[withMaven] junitPublisher - Archive test results for Maven artifact archetype.it:logging:jar:0.1-SNAPSHOT generated by maven-surefire-plugin:test (default-test): m\maven-archetype-j2ee-simple\target\test-classes\projects\it-basic\project\basic-j2ee-simple\projects\logging\target\surefire-reports\*.xml
[withMaven] junitPublisher - Archive test results for Maven artifact archetype.it:primary-source:jar:0.1-SNAPSHOT generated by maven-surefire-plugin:test (default-test): m\maven-archetype-j2ee-simple\target\test-classes\projects\it-basic\project\basic-j2ee-simple\primary-source\target\surefire-reports\*.xml
[withMaven] junitPublisher - Archive test results for Maven artifact archetype.it:servlet:war:0.1-SNAPSHOT generated by maven-surefire-plugin:test (default-test): m\maven-archetype-j2ee-simple\target\test-classes\projects\it-basic\project\basic-j2ee-simple\servlets\servlet\target\surefire-reports\*.xml
[withMaven] junitPublisher - Archive test results for Maven artifact archetype.it:ejbs:ejb:0.1-SNAPSHOT generated by maven-surefire-plugin:test (default-test): m\maven-archetype-j2ee-simple\target\test-classes\projects\it-basic\project\basic-j2ee-simple\ejbs\target\surefire-reports\*.xml
Recording test results
None of the test reports contained any result
[withMaven] Publishers: Junit Publisher: 31 ms
[withMaven] Publishers: Generated Artifacts Publisher: 865 ms, Open Task Scanner Publisher: 352 ms
[withMaven] junitPublisher - Archive test results for Maven artifact archetype.it:basic-plugin:maven-plugin:0.1-SNAPSHOT generated by maven-surefire-plugin:test (default-test): m\maven-archetype-plugin\target\test-classes\projects\it-basic\project\basic-plugin\target\surefire-reports\*.xml
Recording test results
[withMaven] Publishers: Junit Publisher: 126 ms
[withMaven] Publishers:
[withMaven] Publishers:
[withMaven] junitPublisher - Archive test results for Maven artifact archetype.it:basic-portlet:war:0.1-SNAPSHOT generated by maven-surefire-plugin:test (default-test): m\maven-archetype-portlet\target\test-classes\projects\it-basic\project\basic-portlet\target\surefire-reports\*.xml
Recording test results
None of the test reports contained any result
[withMaven] Publishers: Junit Publisher: 30 ms
[withMaven] junitPublisher - Archive test results for Maven artifact archetype.it:basic-quickstart:jar:0.1-SNAPSHOT generated by maven-surefire-plugin:test (default-test): m\maven-archetype-quickstart\target\test-classes\projects\it-basic\project\basic-quickstart\target\surefire-reports\*.xml
Recording test results
[withMaven] Publishers: Junit Publisher: 123 ms
[withMaven] Publishers:
[withMaven] Publishers:
[withMaven] Publishers:
[withMaven] Publishers:
[withMaven] junitPublisher - Archive test results for Maven artifact archetype.it:basic-simple:jar:0.1-SNAPSHOT generated by maven-surefire-plugin:test (default-test): m\maven-archetype-simple\target\test-classes\projects\it-basic\project\basic-simple\target\surefire-reports\*.xml
Recording test results
[withMaven] Publishers: Junit Publisher: 122 ms
[withMaven] Publishers:
[withMaven] artifactsPublisher - Archive artifact m/maven-archetype-quickstart/target/test-classes/projects/it-java-11-junit-5.4.2/project/java-11-junit-542-quickstart/pom.xml under archetype/it/java-11-junit-542-quickstart/0.1-SNAPSHOT/java-11-junit-542-quickstart-0.1-SNAPSHOT.pom
[withMaven] Publishers:
[withMaven] junitPublisher - Archive test results for Maven artifact archetype.it:basic-skin:jar:0.1-SNAPSHOT generated by maven-surefire-plugin:test (default-test): m\maven-archetype-site-skin\target\test-classes\projects\it-basic\project\basic-skin\target\surefire-reports\*.xml
Recording test results
None of the test reports contained any result
[withMaven] Publishers: Junit Publisher: 31 ms
[withMaven] Publishers:
[withMaven] junitPublisher - Archive test results for Maven artifact archetype.it:basic-webapp:war:0.1-SNAPSHOT generated by maven-surefire-plugin:test (default-test): m\maven-archetype-webapp\target\test-classes\projects\it-basic\project\basic-webapp\target\surefire-reports\*.xml
Recording test results
None of the test reports contained any result
[withMaven] Publishers: Junit Publisher: 30 ms
[Pipeline] // withMaven
[Pipeline] cleanWs
[WS-CLEANUP] Deleting project workspace...
[WS-CLEANUP] Deferred wipeout is used...
[WS-CLEANUP] done
[Pipeline] }
[Pipeline] // stage
[Pipeline] }
[Pipeline] // ws
[Pipeline] }
[Pipeline] // withEnv
[Pipeline] }
[Pipeline] // node
[Pipeline] }
[withMaven] openTasksPublisher - Scan Tasks for Maven artifact archetype.it:java-11-junit-542-quickstart:jar:0.1-SNAPSHOT in source directory m/maven-archetype-quickstart/target/test-classes/projects/it-java-11-junit-5.4.2/project/java-11-junit-542-quickstart/src/main/java
[TASKS] Scanning folder '/home/jenkins/workspace/aven-box_maven-archetypes_master@2' for files matching the pattern 'm/maven-archetype-quickstart/target/test-classes/projects/it-java-11-junit-5.4.2/project/java-11-junit-542-quickstart/src/main/java/**/*' - excludes: null
[TASKS] Found 1 files to scan for tasks
[TASKS] Found 0 open tasks.
Skipping warnings blame since pipelines do not have an SCM link.%n
[TASKS] Computing warning deltas based on reference build #19
[withMaven] Publishers: Generated Artifacts Publisher: 864 ms, Open Task Scanner Publisher: 355 ms
[withMaven] artifactsPublisher - Archive artifact m/maven-archetype-simple/target/test-classes/projects/it-basic/project/basic-simple/pom.xml under archetype/it/basic-simple/0.1-SNAPSHOT/basic-simple-0.1-SNAPSHOT.pom
[withMaven] artifactsPublisher - Archive artifact m/maven-archetype-simple/target/test-classes/projects/it-basic/project/basic-simple/target/basic-simple-0.1-SNAPSHOT.jar under archetype/it/basic-simple/0.1-SNAPSHOT/basic-simple-0.1-SNAPSHOT.jar
[withMaven] junitPublisher - Archive test results for Maven artifact archetype.it:basic-simple:jar:0.1-SNAPSHOT generated by maven-surefire-plugin:test (default-test): m/maven-archetype-simple/target/test-classes/projects/it-basic/project/basic-simple/target/surefire-reports/*.xml
Recording test results
[withMaven] openTasksPublisher - Scan Tasks for Maven artifact archetype.it:basic-simple:jar:0.1-SNAPSHOT in source directory m/maven-archetype-simple/target/test-classes/projects/it-basic/project/basic-simple/src/main/java
[TASKS] Scanning folder '/home/jenkins/workspace/aven-box_maven-archetypes_master@2' for files matching the pattern 'm/maven-archetype-simple/target/test-classes/projects/it-basic/project/basic-simple/src/main/java/**/*' - excludes: null
[TASKS] Found 1 files to scan for tasks
[TASKS] Found 0 open tasks.
Skipping warnings blame since pipelines do not have an SCM link.%n
[TASKS] Computing warning deltas based on reference build #19
[withMaven] Publishers: Generated Artifacts Publisher: 1212 ms, Junit Publisher: 698 ms, Open Task Scanner Publisher: 352 ms
[withMaven] artifactsPublisher - Archive artifact m/maven-archetype-site/target/test-classes/projects/it-basic/project/basic-site/pom.xml under archetype/it/basic-site/0.1-SNAPSHOT/basic-site-0.1-SNAPSHOT.pom
[withMaven] Publishers: Generated Artifacts Publisher: 865 ms, Open Task Scanner Publisher: 172 ms
[withMaven] artifactsPublisher - Archive artifact m/maven-archetype-site-simple/target/test-classes/projects/it-basic/project/basic-site-simple/pom.xml under archetype/it/basic-site-simple/0.1-SNAPSHOT/basic-site-simple-0.1-SNAPSHOT.pom
[withMaven] Publishers: Generated Artifacts Publisher: 865 ms, Open Task Scanner Publisher: 172 ms
[withMaven] artifactsPublisher - Archive artifact m/maven-archetype-site-skin/target/test-classes/projects/it-basic/project/basic-skin/pom.xml under archetype/it/basic-skin/0.1-SNAPSHOT/basic-skin-0.1-SNAPSHOT.pom
[withMaven] artifactsPublisher - Archive artifact m/maven-archetype-site-skin/target/test-classes/projects/it-basic/project/basic-skin/target/basic-skin-0.1-SNAPSHOT.jar under archetype/it/basic-skin/0.1-SNAPSHOT/basic-skin-0.1-SNAPSHOT.jar
[withMaven] junitPublisher - Archive test results for Maven artifact archetype.it:basic-skin:jar:0.1-SNAPSHOT generated by maven-surefire-plugin:test (default-test): m/maven-archetype-site-skin/target/test-classes/projects/it-basic/project/basic-skin/target/surefire-reports/*.xml
Recording test results
None of the test reports contained any result
[withMaven] Publishers: Generated Artifacts Publisher: 1212 ms, Junit Publisher: 178 ms, Open Task Scanner Publisher: 172 ms
[withMaven] artifactsPublisher - Archive artifact m/maven-archetype-site-skin/target/test-classes/projects/it-basic/project/basic-skin/target/it/sample/pom.xml under org/apache/maven/skins/its/basic-skin/1.0-SNAPSHOT/basic-skin-1.0-SNAPSHOT.pom
[withMaven] Publishers: Generated Artifacts Publisher: 865 ms, Open Task Scanner Publisher: 172 ms
[withMaven] artifactsPublisher - Archive artifact m/maven-archetype-webapp/target/test-classes/projects/it-basic/project/basic-webapp/pom.xml under archetype/it/basic-webapp/0.1-SNAPSHOT/basic-webapp-0.1-SNAPSHOT.pom
[withMaven] artifactsPublisher - Archive artifact m/maven-archetype-webapp/target/test-classes/projects/it-basic/project/basic-webapp/target/basic-webapp.war under archetype/it/basic-webapp/0.1-SNAPSHOT/basic-webapp-0.1-SNAPSHOT.war
[withMaven] junitPublisher - Archive test results for Maven artifact archetype.it:basic-webapp:war:0.1-SNAPSHOT generated by maven-surefire-plugin:test (default-test): m/maven-archetype-webapp/target/test-classes/projects/it-basic/project/basic-webapp/target/surefire-reports/*.xml
Recording test results
None of the test reports contained any result
[withMaven] Publishers: Generated Artifacts Publisher: 1214 ms, Junit Publisher: 175 ms, Open Task Scanner Publisher: 172 ms
[Pipeline] // withMaven
[Pipeline] cleanWs
[WS-CLEANUP] Deleting project workspace...
[WS-CLEANUP] Deferred wipeout is used...
[WS-CLEANUP] done
[Pipeline] }
[Pipeline] // stage
[Pipeline] }
[Pipeline] // ws
[Pipeline] }
[Pipeline] // withEnv
[Pipeline] }
[Pipeline] // node
[Pipeline] }
[Pipeline] // parallel
[Pipeline] echo
[FAILURE-003] AbortException hudson.AbortException: script returned exit code 1
[Pipeline] stage
[Pipeline] { (Notifications)
[Pipeline] echo
Build result: FAILURE
[Pipeline] jiraIssueSelector
[Pipeline] jiraComment
[Pipeline] echo
The authors of changes [jurrian.fahner].
[Pipeline] echo
Sending email ...
[Pipeline] emailext