Build failed in Jenkins: Maven » Maven TLP » maven-antrun-plugin » master #21

Previous Topic Next Topic
 
classic Classic list List threaded Threaded
2 messages Options
Reply | Threaded
Open this post in threaded view
|

Build failed in Jenkins: Maven » Maven TLP » maven-antrun-plugin » master #21

Apache Jenkins Server-2
See https://ci-builds.apache.org/job/Maven/job/maven-box/job/maven-antrun-plugin/job/master/21/

Changes:

* [MANTRUN-227] More Ant dependency updates to IT
* Bump modello-maven-plugin from 1.10.0 to 1.11

All tests passed

Build log:
[...truncated 3768 lines...]
[INFO] --- modello-maven-plugin:1.11:java (sources) @ maven-antrun-plugin ---
[INFO] outputDirectory: f:\jenkins\jenkins-slave\712657a4\workspace\n-box_maven-antrun-plugin_master@2@2\windows-jdk15-m3.6.x_build\target\generated-sources\modello
[INFO] Working on model: src/main/mdo/antrun.mdo
[INFO] Generating current version: 1.0.0
[INFO]
[INFO] --- maven-remote-resources-plugin:1.7.0:process (process-resource-bundles) @ maven-antrun-plugin ---
[INFO] Preparing remote bundle org.apache:apache-jar-resource-bundle:1.4
[INFO] Copying 3 resources from 1 bundle.
[INFO]
[INFO] --- maven-resources-plugin:3.1.0:resources (default-resources) @ maven-antrun-plugin ---
[INFO] Using 'UTF-8' encoding to copy filtered resources.
[INFO] Copying 1 resource
[INFO] Copying 3 resources
[INFO]
[INFO] --- maven-compiler-plugin:3.8.1:compile (default-compile) @ maven-antrun-plugin ---
[INFO] Changes detected - recompiling the module!
[INFO] Compiling 12 source files to f:\jenkins\jenkins-slave\712657a4\workspace\n-box_maven-antrun-plugin_master@2@2\windows-jdk15-m3.6.x_build\target\classes
[INFO]
[INFO] --- maven-plugin-plugin:3.5.2:descriptor (default-descriptor) @ maven-antrun-plugin ---
[INFO] Using 'UTF-8' encoding to read mojo source files.
[INFO] java-javadoc mojo extractor found 0 mojo descriptor.
[INFO] java-annotations mojo extractor found 2 mojo descriptors.
[INFO]
[INFO] --- maven-resources-plugin:3.1.0:testResources (default-testResources) @ maven-antrun-plugin ---
[INFO] Using 'UTF-8' encoding to copy filtered resources.
[INFO] Copying 4 resources
[INFO] Copying 3 resources
[INFO]
[INFO] --- maven-compiler-plugin:3.8.1:testCompile (default-testCompile) @ maven-antrun-plugin ---
[INFO] Changes detected - recompiling the module!
[INFO] Compiling 1 source file to f:\jenkins\jenkins-slave\712657a4\workspace\n-box_maven-antrun-plugin_master@2@2\windows-jdk15-m3.6.x_build\target\test-classes
[INFO]
[INFO] --- maven-surefire-plugin:2.22.0:test (default-test) @ maven-antrun-plugin ---
[INFO] Surefire report directory: f:\jenkins\jenkins-slave\712657a4\workspace\n-box_maven-antrun-plugin_master@2@2\windows-jdk15-m3.6.x_build\target\surefire-reports
[INFO]
[INFO] -------------------------------------------------------
[INFO]  T E S T S
[INFO] -------------------------------------------------------
[INFO] Running org.apache.maven.plugins.antrun.AntrunXmlPlexusConfigurationWriterTest
[INFO] Tests run: 4, Failures: 0, Errors: 0, Skipped: 0, Time elapsed: 0.345 s - in org.apache.maven.plugins.antrun.AntrunXmlPlexusConfigurationWriterTest
[INFO]
[INFO] Results:
[INFO]
[INFO] Tests run: 4, Failures: 0, Errors: 0, Skipped: 0
[INFO]
[INFO]
[INFO] --- maven-jar-plugin:3.2.0:jar (default-jar) @ maven-antrun-plugin ---
[INFO] Building jar: f:\jenkins\jenkins-slave\712657a4\workspace\n-box_maven-antrun-plugin_master@2@2\windows-jdk15-m3.6.x_build\target\maven-antrun-plugin-3.1.0-SNAPSHOT.jar
[INFO]
[INFO] --- maven-plugin-plugin:3.5.2:addPluginArtifactMetadata (default-addPluginArtifactMetadata) @ maven-antrun-plugin ---
[INFO]
[INFO] --- maven-site-plugin:3.7.1:attach-descriptor (attach-descriptor) @ maven-antrun-plugin ---
[INFO] Skipping because packaging 'maven-plugin' is not pom.
[INFO]
[INFO] --- maven-invoker-plugin:3.2.1:install (integration-test) @ maven-antrun-plugin ---
[INFO] Installing f:\jenkins\jenkins-slave\712657a4\workspace\n-box_maven-antrun-plugin_master@2@2\windows-jdk15-m3.6.x_build\pom.xml to f:\jenkins\jenkins-slave\712657a4\workspace\n-box_maven-antrun-plugin_master@2@2\windows-jdk15-m3.6.x_build\target\local-repo\org\apache\maven\plugins\maven-antrun-plugin\3.1.0-SNAPSHOT\maven-antrun-plugin-3.1.0-SNAPSHOT.pom
[INFO] Installing f:\jenkins\jenkins-slave\712657a4\workspace\n-box_maven-antrun-plugin_master@2@2\windows-jdk15-m3.6.x_build\target\maven-antrun-plugin-3.1.0-SNAPSHOT.jar to f:\jenkins\jenkins-slave\712657a4\workspace\n-box_maven-antrun-plugin_master@2@2\windows-jdk15-m3.6.x_build\target\local-repo\org\apache\maven\plugins\maven-antrun-plugin\3.1.0-SNAPSHOT\maven-antrun-plugin-3.1.0-SNAPSHOT.jar
[INFO]
[INFO] --- maven-invoker-plugin:3.2.1:integration-test (integration-test) @ maven-antrun-plugin ---
[INFO] Building: ant-1.7-features\pom.xml
[INFO] run post-build script verify.bsh
[INFO]           ant-1.7-features\pom.xml ......................... SUCCESS (17.9 s)
[INFO] Building: antrun-default-test\pom.xml
[INFO] run post-build script verify.bsh
[INFO]           antrun-default-test\pom.xml ...................... SUCCESS (3.9 s)
[INFO] Building: attach-artifact-from-ant-task\pom.xml
[INFO] run post-build script verify.bsh
[INFO]           attach-artifact-from-ant-task\pom.xml ............ SUCCESS (6.1 s)
[INFO] Building: attach-artifact-test\pom.xml
[INFO] run post-build script verify.bsh
[INFO]           attach-artifact-test\pom.xml ..................... SUCCESS (4.1 s)
[INFO] Building: attach-artifact-test-with-prefix-antlib\pom.xml
[INFO] run post-build script verify.bsh
[INFO]           attach-artifact-test-with-prefix-antlib\pom.xml .. SUCCESS (3.7 s)
[INFO] Building: attach-artifact-test-with-prefix-antrun\pom.xml
[INFO] run post-build script verify.bsh
[INFO]           attach-artifact-test-with-prefix-antrun\pom.xml .. SUCCESS (5.2 s)
[INFO] Building: attach-artifact-test-with-prefix-unknown\pom.xml
[INFO]           attach-artifact-test-with-prefix-unknown\pom.xml . SUCCESS (3.4 s)
[INFO] Building: classpath-ref-test\pom.xml
[INFO]           classpath-ref-test\pom.xml ....................... SUCCESS (7.8 s)
[INFO] Building: classpath-test-scope-test\pom.xml
[INFO]           classpath-test-scope-test\pom.xml ................ SUCCESS (5.4 s)
[INFO] Building: copy-fail-test\pom.xml
[INFO]           copy-fail-test\pom.xml ........................... SUCCESS (3.1 s)
[INFO] Building: custom-ant-target-attributes\pom.xml
[INFO] run post-build script verify.groovy
WARNING: An illegal reflective access operation has occurred
WARNING: Illegal reflective access by org.codehaus.groovy.reflection.CachedClass (file:/f:/jenkins/jenkins-slave/712657a4/workspace/.maven_repositories/0/org/codehaus/groovy/groovy-all/2.4.8/groovy-all-2.4.8.jar) to method java.lang.Object.finalize()
WARNING: Please consider reporting this to the maintainers of org.codehaus.groovy.reflection.CachedClass
WARNING: Use --illegal-access=warn to enable warnings of further illegal reflective access operations
WARNING: All illegal access operations will be denied in a future release
[INFO]           custom-ant-target-attributes\pom.xml ............. SUCCESS (3.9 s)
[INFO] Building: custom-task-test\pom.xml
[INFO]           custom-task-test\pom.xml ......................... SUCCESS (6.0 s)
[INFO] Building: env-var-test\pom.xml
[INFO]           env-var-test\pom.xml ............................. SUCCESS (5.6 s)
[INFO] Building: export-ant-properties\pom.xml
[INFO]           export-ant-properties\pom.xml .................... SUCCESS (7.4 s)
[INFO] Building: filesets-test\pom.xml
[INFO] run post-build script verify.bsh
[INFO]   The post-build script returned false.
[INFO]           filesets-test\pom.xml ............................ FAILED (3.7 s)
[INFO] Building: local-repo-prop-test\pom.xml
[INFO]           local-repo-prop-test\pom.xml ..................... SUCCESS (3.3 s)
[INFO] Building: MANTRUN-172\pom.xml
[INFO] run post-build script verify.bsh
[INFO]           MANTRUN-172\pom.xml .............................. SUCCESS (3.7 s)
[INFO] Building: MANTRUN-178\pom.xml
[INFO]           MANTRUN-178\pom.xml .............................. SUCCESS (3.5 s)
[INFO] Building: MANTRUN-179\pom.xml
[INFO] run post-build script verify.bsh
[INFO]           MANTRUN-179\pom.xml .............................. SUCCESS (3.4 s)
[INFO] Building: MANTRUN-192\pom.xml
[INFO]           MANTRUN-192\pom.xml .............................. SUCCESS (3.0 s)
[INFO] Building: MANTRUN-208\pom.xml
[INFO] run post-build script verify.bsh
[INFO]           MANTRUN-208\pom.xml .............................. SUCCESS (5.6 s)
[INFO] Building: MANTRUN-221\pom.xml
[INFO]           MANTRUN-221\pom.xml .............................. SUCCESS (6.5 s)
[INFO] Building: multiple-phase-test\pom.xml
[INFO] run post-build script verify.bsh
[INFO]           multiple-phase-test\pom.xml ...................... SUCCESS (3.3 s)
[INFO] Building: never-fail-test\pom.xml
[INFO]           never-fail-test\pom.xml .......................... SUCCESS (3.2 s)
[INFO] Building: plugin-classpath-test\pom.xml
[INFO]           plugin-classpath-test\pom.xml .................... SUCCESS (7.3 s)
[INFO] Building: properties-attributes-test\pom.xml
[INFO]           properties-attributes-test\pom.xml ............... SUCCESS (5.6 s)
[INFO] Building: properties-test\pom.xml
[INFO]           properties-test\pom.xml .......................... SUCCESS (3.5 s)
[INFO] Building: task-encoding-test\pom.xml
[INFO]           task-encoding-test\pom.xml ....................... SUCCESS (3.1 s)
[INFO] Building: tasksattributes-test\pom.xml
[INFO] run post-build script verify.bsh
[INFO]           tasksattributes-test\pom.xml ..................... SUCCESS (5.0 s)
[INFO]
[INFO] --- maven-checkstyle-plugin:3.0.0:check (checkstyle-check) @ maven-antrun-plugin ---
[INFO]
[INFO] --- maven-invoker-plugin:3.2.1:verify (integration-test) @ maven-antrun-plugin ---
[INFO] -------------------------------------------------
[INFO] Build Summary:
[INFO]   Passed: 28, Failed: 1, Errors: 0, Skipped: 0
[INFO] -------------------------------------------------
[ERROR] The following builds failed:
[ERROR] *  filesets-test\pom.xml
[INFO] -------------------------------------------------
[INFO] ------------------------------------------------------------------------
[INFO] BUILD FAILURE
[INFO] ------------------------------------------------------------------------
[INFO] Total time:  02:44 min
[INFO] Finished at: 2020-09-15T03:08:36-07:00
[INFO] ------------------------------------------------------------------------
[INFO] [jenkins-event-spy] Generated F:\jenkins\jenkins-slave\712657a4\workspace\n-box_maven-antrun-plugin_master@2@2@tmp\withMaven74d9e815\maven-spy-20200915-030551-918396935022929803414.log
[ERROR] Failed to execute goal org.apache.maven.plugins:maven-invoker-plugin:3.2.1:verify (integration-test) on project maven-antrun-plugin: 1 build failed. See console output above for details. -> [Help 1]
org.apache.maven.lifecycle.LifecycleExecutionException: Failed to execute goal org.apache.maven.plugins:maven-invoker-plugin:3.2.1:verify (integration-test) on project maven-antrun-plugin: 1 build failed. See console output above for details.
    at org.apache.maven.lifecycle.internal.MojoExecutor.execute (MojoExecutor.java:215)
    at org.apache.maven.lifecycle.internal.MojoExecutor.execute (MojoExecutor.java:156)
    at org.apache.maven.lifecycle.internal.MojoExecutor.execute (MojoExecutor.java:148)
    at org.apache.maven.lifecycle.internal.LifecycleModuleBuilder.buildProject (LifecycleModuleBuilder.java:117)
    at org.apache.maven.lifecycle.internal.LifecycleModuleBuilder.buildProject (LifecycleModuleBuilder.java:81)
    at org.apache.maven.lifecycle.internal.builder.singlethreaded.SingleThreadedBuilder.build (SingleThreadedBuilder.java:56)
    at org.apache.maven.lifecycle.internal.LifecycleStarter.execute (LifecycleStarter.java:128)
    at org.apache.maven.DefaultMaven.doExecute (DefaultMaven.java:305)
    at org.apache.maven.DefaultMaven.doExecute (DefaultMaven.java:192)
    at org.apache.maven.DefaultMaven.execute (DefaultMaven.java:105)
    at org.apache.maven.cli.MavenCli.execute (MavenCli.java:956)
    at org.apache.maven.cli.MavenCli.doMain (MavenCli.java:288)
    at org.apache.maven.cli.MavenCli.main (MavenCli.java:192)
    at jdk.internal.reflect.NativeMethodAccessorImpl.invoke0 (Native Method)
    at jdk.internal.reflect.NativeMethodAccessorImpl.invoke (NativeMethodAccessorImpl.java:62)
    at jdk.internal.reflect.DelegatingMethodAccessorImpl.invoke (DelegatingMethodAccessorImpl.java:43)
    at java.lang.reflect.Method.invoke (Method.java:564)
    at org.codehaus.plexus.classworlds.launcher.Launcher.launchEnhanced (Launcher.java:282)
    at org.codehaus.plexus.classworlds.launcher.Launcher.launch (Launcher.java:225)
    at org.codehaus.plexus.classworlds.launcher.Launcher.mainWithExitCode (Launcher.java:406)
    at org.codehaus.plexus.classworlds.launcher.Launcher.main (Launcher.java:347)
Caused by: org.apache.maven.plugin.MojoFailureException: 1 build failed. See console output above for details.
    at org.apache.maven.plugins.invoker.InvokerSession.handleFailures (InvokerSession.java:259)
    at org.apache.maven.plugins.invoker.VerifyMojo.execute (VerifyMojo.java:140)
    at org.apache.maven.plugin.DefaultBuildPluginManager.executeMojo (DefaultBuildPluginManager.java:137)
    at org.apache.maven.lifecycle.internal.MojoExecutor.execute (MojoExecutor.java:210)
    at org.apache.maven.lifecycle.internal.MojoExecutor.execute (MojoExecutor.java:156)
    at org.apache.maven.lifecycle.internal.MojoExecutor.execute (MojoExecutor.java:148)
    at org.apache.maven.lifecycle.internal.LifecycleModuleBuilder.buildProject (LifecycleModuleBuilder.java:117)
    at org.apache.maven.lifecycle.internal.LifecycleModuleBuilder.buildProject (LifecycleModuleBuilder.java:81)
    at org.apache.maven.lifecycle.internal.builder.singlethreaded.SingleThreadedBuilder.build (SingleThreadedBuilder.java:56)
    at org.apache.maven.lifecycle.internal.LifecycleStarter.execute (LifecycleStarter.java:128)
    at org.apache.maven.DefaultMaven.doExecute (DefaultMaven.java:305)
    at org.apache.maven.DefaultMaven.doExecute (DefaultMaven.java:192)
    at org.apache.maven.DefaultMaven.execute (DefaultMaven.java:105)
    at org.apache.maven.cli.MavenCli.execute (MavenCli.java:956)
    at org.apache.maven.cli.MavenCli.doMain (MavenCli.java:288)
    at org.apache.maven.cli.MavenCli.main (MavenCli.java:192)
    at jdk.internal.reflect.NativeMethodAccessorImpl.invoke0 (Native Method)
    at jdk.internal.reflect.NativeMethodAccessorImpl.invoke (NativeMethodAccessorImpl.java:62)
    at jdk.internal.reflect.DelegatingMethodAccessorImpl.invoke (DelegatingMethodAccessorImpl.java:43)
    at java.lang.reflect.Method.invoke (Method.java:564)
    at org.codehaus.plexus.classworlds.launcher.Launcher.launchEnhanced (Launcher.java:282)
    at org.codehaus.plexus.classworlds.launcher.Launcher.launch (Launcher.java:225)
    at org.codehaus.plexus.classworlds.launcher.Launcher.mainWithExitCode (Launcher.java:406)
    at org.codehaus.plexus.classworlds.launcher.Launcher.main (Launcher.java:347)
[ERROR]
[ERROR] Re-run Maven using the -X switch to enable full debug logging.
[ERROR]
[ERROR] For more information about the errors and possible solutions, please read the following articles:
[ERROR] [Help 1] http://cwiki.apache.org/confluence/display/MAVEN/MojoFailureException
[Pipeline] }
[Pipeline] // dir
[Pipeline] }
[withMaven] junitPublisher - Archive test results for Maven artifact org.apache.maven.plugins:maven-antrun-plugin:maven-plugin:3.1.0-SNAPSHOT generated by maven-surefire-plugin:test (default-test): windows-jdk15-m3.6.x_build\target\surefire-reports\*.xml
Recording test results
[withMaven] openTasksPublisher - Scan Tasks for Maven artifact org.apache.maven.plugins:maven-antrun-plugin:maven-plugin:3.1.0-SNAPSHOT in source directory windows-jdk15-m3.6.x_build\src\main\java
[TASKS] Scanning folder 'f:\jenkins\jenkins-slave\712657a4\workspace\n-box_maven-antrun-plugin_master@2@2' for files matching the pattern 'windows-jdk15-m3.6.x_build\src\main\java\**\*' - excludes: null
[TASKS] Found 9 files to scan for tasks
[TASKS] Found 0 open tasks.
Skipping warnings blame since pipelines do not have an SCM link.%n
[TASKS] Computing warning deltas based on reference build #20
[withMaven] invokerPublisher - Archive invoker results for Maven artifact MavenArtifact{org.apache.maven.plugins:maven-antrun-plugin:maven-plugin:3.1.0-SNAPSHOT(version: 3.1.0-SNAPSHOT, snapshot:false) } generated by PluginInvocation{org.apache.maven.plugins:maven-invoker-plugin:3.2.1@integration-test  integration-test}: windows-jdk15-m3.6.x_build\target\invoker-reports\*.xml
[withMaven] Publishers: Generated Artifacts Publisher: 54 ms, Junit Publisher: 238 ms, Open Task Scanner Publisher: 81 ms, Invoker Publisher: 8378 ms
[Pipeline] // withMaven
[Pipeline] cleanWs
[WS-CLEANUP] Deleting project workspace...
[WS-CLEANUP] Deferred wipeout is used...
[WS-CLEANUP] done
[Pipeline] cleanWs
[WS-CLEANUP] Deleting project workspace...
[WS-CLEANUP] Deferred wipeout is used...
[WS-CLEANUP] done
[Pipeline] }
[Pipeline] // stage
[Pipeline] }
[Pipeline] // ws
[Pipeline] }
[Pipeline] // node
[Pipeline] }
Failed in branch windows-jdk15-m3.6.x_build
[Pipeline] // parallel
[Pipeline] stage
[Pipeline] { (Notifications)
[Pipeline] echo
Build result: FAILURE
[Pipeline] jiraIssueSelector
[Pipeline] jiraComment
[Pipeline] echo
The authors of changes [slachiewicz].
[Pipeline] echo
Sending email ...
[Pipeline] emailext
Reply | Threaded
Open this post in threaded view
|

Build succeeded in Jenkins: Maven » Maven TLP » maven-antrun-plugin » master #22

Apache Jenkins Server-2